directory-notifications mailing list archives

Site index · List index
Message view « Date » · « Thread »
Top « Date » · « Thread »
Subject Build failed in Jenkins: directory-fortress-enmasse #859
Date Thu, 24 Mar 2016 07:50:30 GMT
See <>

Started by timer
Building in workspace <>
 > git rev-parse --is-inside-work-tree # timeout=10
Fetching changes from the remote Git repository
 > git config remote.origin.url
# timeout=10
Fetching upstream changes from
 > git --version # timeout=10
 > git -c core.askpass=true fetch --tags --progress
Seen branch in repository origin/1.0-RC41
Seen branch in repository origin/master
Seen 2 remote branches
Checking out Revision 35e9f7b37516bd84c11205592e2635dff0ff9288 (origin/master)
 > git config core.sparsecheckout # timeout=10
 > git checkout -f 35e9f7b37516bd84c11205592e2635dff0ff9288
 > git rev-list 35e9f7b37516bd84c11205592e2635dff0ff9288 # timeout=10
 > git tag -a -f -m Jenkins Build #859 jenkins-directory-fortress-enmasse-859 # timeout=10
Parsing POMs
Established TCP socket on 58413
[workspace] $ /x1/jenkins/jenkins-master/jenkins-home/tools/hudson.model.JDK/jdk1.7.0_65/bin/java
-Xms256m -Xmx512m -XX:+UseCompressedOops -XX:MaxPermSize=256m -cp /x1/jenkins/jenkins-master/jenkins-home/plugins/maven-plugin/WEB-INF/lib/maven3-agent-1.7.jar:/x1/jenkins/jenkins-master/jenkins-home/tools/hudson.tasks.Maven_MavenInstallation/maven-3.0.5/boot/plexus-classworlds-2.4.jar
org.jvnet.hudson.maven3.agent.Maven3Main /x1/jenkins/jenkins-master/jenkins-home/tools/hudson.tasks.Maven_MavenInstallation/maven-3.0.5
<===[JENKINS REMOTING CAPACITY]===>   channel started
Executing Maven:  -B -f <>
clean install -U -DskipTests -fae
[INFO] Scanning for projects...
[WARNING] Some problems were encountered while building the effective model for
[WARNING] 'build.plugins.plugin.version' for org.codehaus.mojo:tomcat-maven-plugin is missing.
@ line 323, column 15
[WARNING] 'reporting.plugins.plugin.version' for org.apache.maven.plugins:maven-javadoc-plugin
is missing. @ line 448, column 15
[WARNING] It is highly recommended to fix these problems because they threaten the stability
of your build.
[WARNING] For this reason, future Maven versions might no longer support building such malformed
[INFO] ------------------------------------------------------------------------
[INFO] Building Apache Fortress Rest 1.0-RC43-SNAPSHOT
[INFO] ------------------------------------------------------------------------
(439 B at 1.1 KB/sec)
[WARNING] The POM for is missing,
no dependency information available
[INFO] ------------------------------------------------------------------------
[INFO] ------------------------------------------------------------------------
[INFO] Total time: 16.045s
[INFO] Finished at: Thu Mar 24 07:49:59 UTC 2016
[INFO] Final Memory: 13M/246M
[INFO] ------------------------------------------------------------------------
Waiting for Jenkins to finish collecting data[ERROR] Failed to execute goal on project fortress-rest:
Could not resolve dependencies for project
Could not find artifact in
maven2 ( -> [Help 1]
[ERROR] To see the full stack trace of the errors, re-run Maven with the -e switch.
[ERROR] Re-run Maven using the -X switch to enable full debug logging.
[ERROR] For more information about the errors and possible solutions, please read the following
[ERROR] [Help 1]

[JENKINS] Archiving <>
Sending e-mails to:
channel stopped
Skipping sonar analysis due to bad build status FAILURE

View raw message