directory-notifications mailing list archives

Site index · List index
Message view « Date » · « Thread »
Top « Date » · « Thread »
From gmcdon...@apache.org
Subject Build failed in Jenkins: directory-fortress-core #292
Date Wed, 02 Mar 2016 01:08:30 GMT
See <https://analysis.apache.org/jenkins/job/directory-fortress-core/292/changes>

Changes:

[elecharny] Bumped some dependencies, disabled the javadoc lint

[elecharny] Added the missing license

[elecharny] added a missing Apache header

[elecharny] ingoring all the .log in rat

[elecharny] [maven-release-plugin] prepare release 1.0-RC41

[elecharny] [maven-release-plugin] prepare for next development iteration

[elecharny] disable javadoc lint

[elecharny] [maven-release-plugin] rollback the release of 1.0-RC41

[elecharny] [maven-release-plugin] prepare release 1.0-RC41

[elecharny] [maven-release-plugin] rollback the release of 1.0-RC41

[elecharny] [maven-release-plugin] prepare release 1.0-RC41

[elecharny] [maven-release-plugin] rollback the release of 1.0-RC41

[elecharny] [maven-release-plugin] prepare release 1.0-RC41

[elecharny] [maven-release-plugin] prepare for next development iteration

[elecharny] Added the lint disabling parameter in global properties

[elecharny] Fixed the scm tag : it was pulling 1.0-RC40

[elecharny] [maven-release-plugin] rollback the release of 1.0-RC41

[elecharny] [maven-release-plugin] prepare release 1.0-RC41

[elecharny] [maven-release-plugin] prepare for next development iteration

[elecharny] [maven-release-plugin] rollback the release of 1.0-RC41

[elecharny] [maven-release-plugin] prepare release 1.0-RC41

[elecharny] [maven-release-plugin] prepare for next development iteration

------------------------------------------
Started by timer
Building in workspace <https://analysis.apache.org/jenkins/job/directory-fortress-core/ws/>
 > git rev-parse --is-inside-work-tree # timeout=10
Fetching changes from the remote Git repository
 > git config remote.origin.url https://git-wip-us.apache.org/repos/asf/directory-fortress-core.git
# timeout=10
Cleaning workspace
 > git rev-parse --verify HEAD # timeout=10
Resetting working tree
 > git reset --hard # timeout=10
 > git clean -fdx # timeout=10
Fetching upstream changes from https://git-wip-us.apache.org/repos/asf/directory-fortress-core.git
 > git --version # timeout=10
 > git -c core.askpass=true fetch --tags --progress https://git-wip-us.apache.org/repos/asf/directory-fortress-core.git
+refs/heads/*:refs/remotes/origin/*
Seen branch in repository origin/1.0-RC41
Seen branch in repository origin/HEAD
Seen branch in repository origin/master
Seen 3 remote branches
Checking out Revision e19370fe686977e2e46c126df9f9977b824e092a (origin/master)
 > git config core.sparsecheckout # timeout=10
 > git checkout -f e19370fe686977e2e46c126df9f9977b824e092a
 > git rev-list 4df05c7e46642f7ed2c5fd0a58c0aaa048b84a6c # timeout=10
 > git tag -a -f -m Jenkins Build #292 jenkins-directory-fortress-core-292 # timeout=10
Parsing POMs
Modules changed, recalculating dependency graph
Established TCP socket on 37191
[workspace] $ /x1/jenkins/jenkins-master/jenkins-home/tools/hudson.model.JDK/jdk1.7.0_65/bin/java
-Xms256m -Xmx512m -XX:+UseCompressedOops -XX:MaxPermSize=256m -cp /x1/jenkins/jenkins-master/jenkins-home/plugins/maven-plugin/WEB-INF/lib/maven3-agent-1.7.jar:/x1/jenkins/jenkins-master/jenkins-home/tools/hudson.tasks.Maven_MavenInstallation/maven-3.0.5/boot/plexus-classworlds-2.4.jar
org.jvnet.hudson.maven3.agent.Maven3Main /x1/jenkins/jenkins-master/jenkins-home/tools/hudson.tasks.Maven_MavenInstallation/maven-3.0.5
/x1/jenkins/jenkins-master/catalina-base/work/Catalina/localhost/jenkins/WEB-INF/lib/remoting-2.53.3.jar
/x1/jenkins/jenkins-master/jenkins-home/plugins/maven-plugin/WEB-INF/lib/maven3-interceptor-1.7.jar
/x1/jenkins/jenkins-master/jenkins-home/plugins/maven-plugin/WEB-INF/lib/maven3-interceptor-commons-1.7.jar
37191
<===[JENKINS REMOTING CAPACITY]===>   channel started
Executing Maven:  -B -f <https://analysis.apache.org/jenkins/job/directory-fortress-core/ws/pom.xml>
clean install -U -DskipTests -fae
[INFO] Scanning for projects...
[INFO]                                                                         
[INFO] ------------------------------------------------------------------------
[INFO] Building Apache Fortress Core 1.0-RC42-SNAPSHOT
[INFO] ------------------------------------------------------------------------
Downloading: http://repo.maven.apache.org/maven2/org/apache/httpcomponents/httpclient/4.5.2/httpclient-4.5.2.pom
Downloaded: http://repo.maven.apache.org/maven2/org/apache/httpcomponents/httpclient/4.5.2/httpclient-4.5.2.pom
(7 KB at 16.0 KB/sec)
Downloading: http://repo.maven.apache.org/maven2/org/apache/httpcomponents/httpcomponents-client/4.5.2/httpcomponents-client-4.5.2.pom
Downloaded: http://repo.maven.apache.org/maven2/org/apache/httpcomponents/httpcomponents-client/4.5.2/httpcomponents-client-4.5.2.pom
(16 KB at 150.0 KB/sec)
Downloading: http://repo.maven.apache.org/maven2/org/apache/httpcomponents/httpcore/4.4.4/httpcore-4.4.4.pom
Downloaded: http://repo.maven.apache.org/maven2/org/apache/httpcomponents/httpcore/4.4.4/httpcore-4.4.4.pom
(6 KB at 76.0 KB/sec)
Downloading: http://repo.maven.apache.org/maven2/org/apache/httpcomponents/httpcomponents-core/4.4.4/httpcomponents-core-4.4.4.pom
Downloaded: http://repo.maven.apache.org/maven2/org/apache/httpcomponents/httpcomponents-core/4.4.4/httpcomponents-core-4.4.4.pom
(13 KB at 124.7 KB/sec)
Downloading: http://repo.maven.apache.org/maven2/net/sf/ehcache/ehcache-core/2.6.11/ehcache-core-2.6.11.pom
Downloaded: http://repo.maven.apache.org/maven2/net/sf/ehcache/ehcache-core/2.6.11/ehcache-core-2.6.11.pom
(30 KB at 233.4 KB/sec)
Downloading: http://repo.maven.apache.org/maven2/org/apache/cxf/cxf-api/2.7.18/cxf-api-2.7.18.pom
Downloaded: http://repo.maven.apache.org/maven2/org/apache/cxf/cxf-api/2.7.18/cxf-api-2.7.18.pom
(15 KB at 122.4 KB/sec)
Downloading: http://repo.maven.apache.org/maven2/org/apache/cxf/cxf-parent/2.7.18/cxf-parent-2.7.18.pom
Downloaded: http://repo.maven.apache.org/maven2/org/apache/cxf/cxf-parent/2.7.18/cxf-parent-2.7.18.pom
(0 B at 0.0 KB/sec)
Downloading: http://repo.maven.apache.org/maven2/org/apache/cxf/cxf/2.7.18/cxf-2.7.18.pom
Downloaded: http://repo.maven.apache.org/maven2/org/apache/cxf/cxf/2.7.18/cxf-2.7.18.pom (0
B at 0.0 KB/sec)
Downloading: http://repo.maven.apache.org/maven2/org/apache/directory/api/api-all/1.0.0-M33/api-all-1.0.0-M33.pom
Downloaded: http://repo.maven.apache.org/maven2/org/apache/directory/api/api-all/1.0.0-M33/api-all-1.0.0-M33.pom
(4 KB at 31.8 KB/sec)
Downloading: http://repo.maven.apache.org/maven2/org/slf4j/slf4j-api/1.7.18/slf4j-api-1.7.18.pom
Downloaded: http://repo.maven.apache.org/maven2/org/slf4j/slf4j-api/1.7.18/slf4j-api-1.7.18.pom
(3 KB at 4.0 KB/sec)
Downloading: http://repo.maven.apache.org/maven2/org/slf4j/slf4j-parent/1.7.18/slf4j-parent-1.7.18.pom
Downloaded: http://repo.maven.apache.org/maven2/org/slf4j/slf4j-parent/1.7.18/slf4j-parent-1.7.18.pom
(14 KB at 122.1 KB/sec)
Downloading: http://repo.maven.apache.org/maven2/org/apache/jmeter/ApacheJMeter_core/2.13/ApacheJMeter_core-2.13.pom
Downloaded: http://repo.maven.apache.org/maven2/org/apache/jmeter/ApacheJMeter_core/2.13/ApacheJMeter_core-2.13.pom
(2 KB at 9.7 KB/sec)
Downloading: http://repo.maven.apache.org/maven2/org/apache/jmeter/ApacheJMeter_parent/2.13/ApacheJMeter_parent-2.13.pom
Downloaded: http://repo.maven.apache.org/maven2/org/apache/jmeter/ApacheJMeter_parent/2.13/ApacheJMeter_parent-2.13.pom
(17 KB at 60.8 KB/sec)
Downloading: http://repo.maven.apache.org/maven2/org/apache/jmeter/jorphan/2.13/jorphan-2.13.pom
Downloaded: http://repo.maven.apache.org/maven2/org/apache/jmeter/jorphan/2.13/jorphan-2.13.pom
(2 KB at 9.7 KB/sec)
Downloading: http://repo.maven.apache.org/maven2/commons-math3/commons-math3/3.4.1/commons-math3-3.4.1.pom
Downloading: https://repository.jboss.org/nexus/content/repositories/thirdparty-releases/commons-math3/commons-math3/3.4.1/commons-math3-3.4.1.pom
[WARNING] The POM for commons-math3:commons-math3:jar:3.4.1 is missing, no dependency information
available
Downloading: http://repo.maven.apache.org/maven2/commons-pool2/commons-pool2/2.3/commons-pool2-2.3.pom
Downloading: https://repository.jboss.org/nexus/content/repositories/thirdparty-releases/commons-pool2/commons-pool2/2.3/commons-pool2-2.3.pom
[WARNING] The POM for commons-pool2:commons-pool2:jar:2.3 is missing, no dependency information
available
Downloading: http://repo.maven.apache.org/maven2/dnsjava/dnsjava/2.1.7/dnsjava-2.1.7.pom
Downloaded: http://repo.maven.apache.org/maven2/dnsjava/dnsjava/2.1.7/dnsjava-2.1.7.pom (8
KB at 42.2 KB/sec)
Downloading: http://repo.maven.apache.org/maven2/excalibur-datasource/excalibur-datasource/2.1/excalibur-datasource-2.1.pom
Downloaded: http://repo.maven.apache.org/maven2/excalibur-datasource/excalibur-datasource/2.1/excalibur-datasource-2.1.pom
(4 KB at 20.7 KB/sec)
Downloading: http://repo.maven.apache.org/maven2/hsqldb/hsqldb/1.8.0.1/hsqldb-1.8.0.1.pom
Downloaded: http://repo.maven.apache.org/maven2/hsqldb/hsqldb/1.8.0.1/hsqldb-1.8.0.1.pom (148
B at 1.1 KB/sec)
Downloading: http://repo.maven.apache.org/maven2/avalon-framework/avalon-framework-api/4.3/avalon-framework-api-4.3.pom
Downloaded: http://repo.maven.apache.org/maven2/avalon-framework/avalon-framework-api/4.3/avalon-framework-api-4.3.pom
(387 B at 2.8 KB/sec)
Downloading: http://repo.maven.apache.org/maven2/avalon-logkit/avalon-logkit/2.1/avalon-logkit-2.1.pom
Downloaded: http://repo.maven.apache.org/maven2/avalon-logkit/avalon-logkit/2.1/avalon-logkit-2.1.pom
(913 B at 6.6 KB/sec)
Downloading: http://repo.maven.apache.org/maven2/log4j/log4j/1.2.11/log4j-1.2.11.pom
Downloaded: http://repo.maven.apache.org/maven2/log4j/log4j/1.2.11/log4j-1.2.11.pom (145 B
at 0.9 KB/sec)
Downloading: http://repo.maven.apache.org/maven2/servletapi/servletapi/2.3/servletapi-2.3.pom
Downloaded: http://repo.maven.apache.org/maven2/servletapi/servletapi/2.3/servletapi-2.3.pom
(739 B at 5.3 KB/sec)
Downloading: http://repo.maven.apache.org/maven2/geronimo-spec/geronimo-spec-javamail/1.3.1-rc3/geronimo-spec-javamail-1.3.1-rc3.pom
Downloaded: http://repo.maven.apache.org/maven2/geronimo-spec/geronimo-spec-javamail/1.3.1-rc3/geronimo-spec-javamail-1.3.1-rc3.pom
(173 B at 1.1 KB/sec)
Downloading: http://repo.maven.apache.org/maven2/geronimo-spec/geronimo-spec-jms/1.1-rc4/geronimo-spec-jms-1.1-rc4.pom
Downloaded: http://repo.maven.apache.org/maven2/geronimo-spec/geronimo-spec-jms/1.1-rc4/geronimo-spec-jms-1.1-rc4.pom
(166 B at 1.2 KB/sec)
Downloading: http://repo.maven.apache.org/maven2/avalon-framework/avalon-framework-impl/4.3/avalon-framework-impl-4.3.pom
Downloaded: http://repo.maven.apache.org/maven2/avalon-framework/avalon-framework-impl/4.3/avalon-framework-impl-4.3.pom
(2 KB at 11.9 KB/sec)
Downloading: http://repo.maven.apache.org/maven2/xml-apis/xmlParserAPIs/2.0.2/xmlParserAPIs-2.0.2.pom
Downloaded: http://repo.maven.apache.org/maven2/xml-apis/xmlParserAPIs/2.0.2/xmlParserAPIs-2.0.2.pom
(155 B at 0.9 KB/sec)
Downloading: http://repo.maven.apache.org/maven2/jmock/jmock/1.0.1/jmock-1.0.1.pom
Downloaded: http://repo.maven.apache.org/maven2/jmock/jmock/1.0.1/jmock-1.0.1.pom (314 B at
3.0 KB/sec)
Downloading: http://repo.maven.apache.org/maven2/excalibur-instrument/excalibur-instrument-api/2.1/excalibur-instrument-api-2.1.pom
Downloaded: http://repo.maven.apache.org/maven2/excalibur-instrument/excalibur-instrument-api/2.1/excalibur-instrument-api-2.1.pom
(2 KB at 14.7 KB/sec)
Downloading: http://repo.maven.apache.org/maven2/excalibur-pool/excalibur-pool-api/2.1/excalibur-pool-api-2.1.pom
Downloaded: http://repo.maven.apache.org/maven2/excalibur-pool/excalibur-pool-api/2.1/excalibur-pool-api-2.1.pom
(391 B at 3.5 KB/sec)
Downloading: http://repo.maven.apache.org/maven2/excalibur-pool/excalibur-pool-impl/2.1/excalibur-pool-impl-2.1.pom
Downloaded: http://repo.maven.apache.org/maven2/excalibur-pool/excalibur-pool-impl/2.1/excalibur-pool-impl-2.1.pom
(2 KB at 16.7 KB/sec)
Downloading: http://repo.maven.apache.org/maven2/junitperf/junitperf/1.8/junitperf-1.8.pom
Downloaded: http://repo.maven.apache.org/maven2/junitperf/junitperf/1.8/junitperf-1.8.pom
(150 B at 0.6 KB/sec)
Downloading: http://repo.maven.apache.org/maven2/excalibur-pool/excalibur-pool-instrumented/2.1/excalibur-pool-instrumented-2.1.pom
Downloaded: http://repo.maven.apache.org/maven2/excalibur-pool/excalibur-pool-instrumented/2.1/excalibur-pool-instrumented-2.1.pom
(2 KB at 5.6 KB/sec)
Downloading: http://repo.maven.apache.org/maven2/excalibur-component/excalibur-testcase/2.1/excalibur-testcase-2.1.pom
Downloaded: http://repo.maven.apache.org/maven2/excalibur-component/excalibur-testcase/2.1/excalibur-testcase-2.1.pom
(2 KB at 15.9 KB/sec)
Downloading: http://repo.maven.apache.org/maven2/excalibur-logger/excalibur-logger/2.1/excalibur-logger-2.1.pom
Downloaded: http://repo.maven.apache.org/maven2/excalibur-logger/excalibur-logger/2.1/excalibur-logger-2.1.pom
(2 KB at 12.2 KB/sec)
Downloading: http://repo.maven.apache.org/maven2/excalibur-component/excalibur-component/2.1/excalibur-component-2.1.pom
Downloaded: http://repo.maven.apache.org/maven2/excalibur-component/excalibur-component/2.1/excalibur-component-2.1.pom
(3 KB at 20.5 KB/sec)
Downloading: http://repo.maven.apache.org/maven2/excalibur-instrument/excalibur-instrument-mgr-api/2.1/excalibur-instrument-mgr-api-2.1.pom
Downloaded: http://repo.maven.apache.org/maven2/excalibur-instrument/excalibur-instrument-mgr-api/2.1/excalibur-instrument-mgr-api-2.1.pom
(727 B at 5.3 KB/sec)
Downloading: http://repo.maven.apache.org/maven2/excalibur-instrument/excalibur-instrument-mgr-impl/2.1/excalibur-instrument-mgr-impl-2.1.pom
Downloaded: http://repo.maven.apache.org/maven2/excalibur-instrument/excalibur-instrument-mgr-impl/2.1/excalibur-instrument-mgr-impl-2.1.pom
(2 KB at 7.3 KB/sec)
Downloading: http://repo.maven.apache.org/maven2/qdox/qdox/1.5/qdox-1.5.pom
Downloaded: http://repo.maven.apache.org/maven2/qdox/qdox/1.5/qdox-1.5.pom (140 B at 0.9 KB/sec)
Downloading: http://repo.maven.apache.org/maven2/org/mozilla/rhino/1.7R5/rhino-1.7R5.pom
Downloaded: http://repo.maven.apache.org/maven2/org/mozilla/rhino/1.7R5/rhino-1.7R5.pom (2
KB at 12.9 KB/sec)
Downloading: http://repo.maven.apache.org/maven2/xalan/xalan/2.7.2/xalan-2.7.2.pom
Downloaded: http://repo.maven.apache.org/maven2/xalan/xalan/2.7.2/xalan-2.7.2.pom (2 KB at
9.4 KB/sec)
Downloading: http://repo.maven.apache.org/maven2/xalan/serializer/2.7.2/serializer-2.7.2.pom
Downloaded: http://repo.maven.apache.org/maven2/xalan/serializer/2.7.2/serializer-2.7.2.pom
(2 KB at 10.4 KB/sec)
Downloading: http://repo.maven.apache.org/maven2/org/jsoup/jsoup/1.8.1/jsoup-1.8.1.pom
Downloaded: http://repo.maven.apache.org/maven2/org/jsoup/jsoup/1.8.1/jsoup-1.8.1.pom (7 KB
at 30.8 KB/sec)
Downloading: http://repo.maven.apache.org/maven2/org/jodd/jodd-core/3.6.4/jodd-core-3.6.4.pom
Downloaded: http://repo.maven.apache.org/maven2/org/jodd/jodd-core/3.6.4/jodd-core-3.6.4.pom
(2 KB at 9.7 KB/sec)
Downloading: http://repo.maven.apache.org/maven2/org/jodd/jodd-lagarto/3.6.4/jodd-lagarto-3.6.4.pom
Downloaded: http://repo.maven.apache.org/maven2/org/jodd/jodd-lagarto/3.6.4/jodd-lagarto-3.6.4.pom
(2 KB at 12.4 KB/sec)
Downloading: http://repo.maven.apache.org/maven2/org/jodd/jodd-log/3.6.4/jodd-log-3.6.4.pom
Downloaded: http://repo.maven.apache.org/maven2/org/jodd/jodd-log/3.6.4/jodd-log-3.6.4.pom
(2 KB at 4.2 KB/sec)
Downloading: http://repo.maven.apache.org/maven2/com/fifesoft/rsyntaxtextarea/2.5.6/rsyntaxtextarea-2.5.6.pom
Downloaded: http://repo.maven.apache.org/maven2/com/fifesoft/rsyntaxtextarea/2.5.6/rsyntaxtextarea-2.5.6.pom
(3 KB at 8.2 KB/sec)
Downloading: http://repo.maven.apache.org/maven2/org/slf4j/slf4j-nop/1.7.10/slf4j-nop-1.7.10.pom
Downloaded: http://repo.maven.apache.org/maven2/org/slf4j/slf4j-nop/1.7.10/slf4j-nop-1.7.10.pom
(2 KB at 3.2 KB/sec)
Downloading: http://repo.maven.apache.org/maven2/org/apache/jmeter/ApacheJMeter_java/2.13/ApacheJMeter_java-2.13.pom
Downloaded: http://repo.maven.apache.org/maven2/org/apache/jmeter/ApacheJMeter_java/2.13/ApacheJMeter_java-2.13.pom
(2 KB at 6.8 KB/sec)
Downloading: http://repo.maven.apache.org/maven2/org/apache/jmeter/ApacheJMeter_components/2.13/ApacheJMeter_components-2.13.pom
Downloaded: http://repo.maven.apache.org/maven2/org/apache/jmeter/ApacheJMeter_components/2.13/ApacheJMeter_components-2.13.pom
(2 KB at 5.9 KB/sec)
Downloading: http://repo.maven.apache.org/maven2/org/apache/httpcomponents/httpclient/4.5.2/httpclient-4.5.2.jar
Downloading: http://repo.maven.apache.org/maven2/org/apache/httpcomponents/httpcore/4.4.4/httpcore-4.4.4.jar
Downloading: http://repo.maven.apache.org/maven2/org/apache/cxf/cxf-api/2.7.18/cxf-api-2.7.18.jar
Downloading: http://repo.maven.apache.org/maven2/net/sf/ehcache/ehcache-core/2.6.11/ehcache-core-2.6.11.jar
Downloading: http://repo.maven.apache.org/maven2/org/apache/directory/api/api-all/1.0.0-M33/api-all-1.0.0-M33.jar
Downloaded: http://repo.maven.apache.org/maven2/org/apache/httpcomponents/httpclient/4.5.2/httpclient-4.5.2.jar
(720 KB at 576.4 KB/sec)
Downloading: http://repo.maven.apache.org/maven2/org/slf4j/slf4j-api/1.7.18/slf4j-api-1.7.18.jar
Downloaded: http://repo.maven.apache.org/maven2/org/slf4j/slf4j-api/1.7.18/slf4j-api-1.7.18.jar
(40 KB at 356.5 KB/sec)
Downloading: http://repo.maven.apache.org/maven2/org/apache/jmeter/ApacheJMeter_core/2.13/ApacheJMeter_core-2.13.jar
Downloaded: http://repo.maven.apache.org/maven2/net/sf/ehcache/ehcache-core/2.6.11/ehcache-core-2.6.11.jar
(1316 KB at 533.4 KB/sec)
Downloading: http://repo.maven.apache.org/maven2/org/apache/jmeter/jorphan/2.13/jorphan-2.13.jar
Downloaded: http://repo.maven.apache.org/maven2/org/apache/jmeter/jorphan/2.13/jorphan-2.13.jar
(129 KB at 327.1 KB/sec)
Downloading: http://repo.maven.apache.org/maven2/commons-math3/commons-math3/3.4.1/commons-math3-3.4.1.jar
Downloading: http://repo.maven.apache.org/maven2/commons-pool2/commons-pool2/2.3/commons-pool2-2.3.jar
Downloaded: http://repo.maven.apache.org/maven2/org/apache/httpcomponents/httpcore/4.4.4/httpcore-4.4.4.jar
(320 KB at 92.0 KB/sec)
Downloading: http://repo.maven.apache.org/maven2/dnsjava/dnsjava/2.1.7/dnsjava-2.1.7.jar
Downloaded: http://repo.maven.apache.org/maven2/org/apache/cxf/cxf-api/2.7.18/cxf-api-2.7.18.jar
(1087 KB at 273.9 KB/sec)
Downloading: http://repo.maven.apache.org/maven2/excalibur-datasource/excalibur-datasource/2.1/excalibur-datasource-2.1.jar
Downloading: http://repo.maven.apache.org/maven2/hsqldb/hsqldb/1.8.0.1/hsqldb-1.8.0.1.jar
Downloaded: http://repo.maven.apache.org/maven2/hsqldb/hsqldb/1.8.0.1/hsqldb-1.8.0.1.jar (611
KB at 494.3 KB/sec)
Downloading: http://repo.maven.apache.org/maven2/avalon-framework/avalon-framework-api/4.3/avalon-framework-api-4.3.jar
Downloaded: http://repo.maven.apache.org/maven2/excalibur-datasource/excalibur-datasource/2.1/excalibur-datasource-2.1.jar
(67 KB at 52.6 KB/sec)
Downloading: http://repo.maven.apache.org/maven2/avalon-framework/avalon-framework-impl/4.3/avalon-framework-impl-4.3.jar
Downloaded: http://repo.maven.apache.org/maven2/dnsjava/dnsjava/2.1.7/dnsjava-2.1.7.jar (301
KB at 138.6 KB/sec)
Downloading: http://repo.maven.apache.org/maven2/xml-apis/xmlParserAPIs/2.0.2/xmlParserAPIs-2.0.2.jar
Downloaded: http://repo.maven.apache.org/maven2/avalon-framework/avalon-framework-api/4.3/avalon-framework-api-4.3.jar
(32 KB at 65.2 KB/sec)
Downloading: http://repo.maven.apache.org/maven2/log4j/log4j/1.2.11/log4j-1.2.11.jar
Downloaded: http://repo.maven.apache.org/maven2/avalon-framework/avalon-framework-impl/4.3/avalon-framework-impl-4.3.jar
(59 KB at 109.9 KB/sec)
Downloading: http://repo.maven.apache.org/maven2/jmock/jmock/1.0.1/jmock-1.0.1.jar
Downloaded: http://repo.maven.apache.org/maven2/xml-apis/xmlParserAPIs/2.0.2/xmlParserAPIs-2.0.2.jar
(77 KB at 277.5 KB/sec)
Downloading: http://repo.maven.apache.org/maven2/avalon-logkit/avalon-logkit/2.1/avalon-logkit-2.1.jar
Downloaded: http://repo.maven.apache.org/maven2/jmock/jmock/1.0.1/jmock-1.0.1.jar (68 KB at
230.9 KB/sec)
Downloading: http://repo.maven.apache.org/maven2/geronimo-spec/geronimo-spec-javamail/1.3.1-rc3/geronimo-spec-javamail-1.3.1-rc3.jar
Downloaded: http://repo.maven.apache.org/maven2/avalon-logkit/avalon-logkit/2.1/avalon-logkit-2.1.jar
(82 KB at 290.5 KB/sec)
Downloading: http://repo.maven.apache.org/maven2/geronimo-spec/geronimo-spec-jms/1.1-rc4/geronimo-spec-jms-1.1-rc4.jar
Downloaded: http://repo.maven.apache.org/maven2/geronimo-spec/geronimo-spec-jms/1.1-rc4/geronimo-spec-jms-1.1-rc4.jar
(31 KB at 235.3 KB/sec)
Downloading: http://repo.maven.apache.org/maven2/excalibur-instrument/excalibur-instrument-api/2.1/excalibur-instrument-api-2.1.jar
Downloaded: http://repo.maven.apache.org/maven2/org/apache/directory/api/api-all/1.0.0-M33/api-all-1.0.0-M33.jar
(2917 KB at 459.4 KB/sec)
Downloading: http://repo.maven.apache.org/maven2/excalibur-component/excalibur-testcase/2.1/excalibur-testcase-2.1.jar
Downloaded: http://repo.maven.apache.org/maven2/excalibur-instrument/excalibur-instrument-api/2.1/excalibur-instrument-api-2.1.jar
(20 KB at 189.1 KB/sec)
Downloading: http://repo.maven.apache.org/maven2/excalibur-component/excalibur-component/2.1/excalibur-component-2.1.jar
Downloaded: http://repo.maven.apache.org/maven2/excalibur-component/excalibur-testcase/2.1/excalibur-testcase-2.1.jar
(29 KB at 401.4 KB/sec)
Downloading: http://repo.maven.apache.org/maven2/excalibur-instrument/excalibur-instrument-mgr-api/2.1/excalibur-instrument-mgr-api-2.1.jar
Downloaded: http://repo.maven.apache.org/maven2/excalibur-instrument/excalibur-instrument-mgr-api/2.1/excalibur-instrument-mgr-api-2.1.jar
(21 KB at 276.1 KB/sec)
Downloading: http://repo.maven.apache.org/maven2/excalibur-instrument/excalibur-instrument-mgr-impl/2.1/excalibur-instrument-mgr-impl-2.1.jar
Downloaded: http://repo.maven.apache.org/maven2/geronimo-spec/geronimo-spec-javamail/1.3.1-rc3/geronimo-spec-javamail-1.3.1-rc3.jar
(95 KB at 202.0 KB/sec)
Downloading: http://repo.maven.apache.org/maven2/qdox/qdox/1.5/qdox-1.5.jar
Downloaded: http://repo.maven.apache.org/maven2/excalibur-instrument/excalibur-instrument-mgr-impl/2.1/excalibur-instrument-mgr-impl-2.1.jar
(57 KB at 351.2 KB/sec)
Downloading: http://repo.maven.apache.org/maven2/excalibur-pool/excalibur-pool-api/2.1/excalibur-pool-api-2.1.jar
Downloaded: http://repo.maven.apache.org/maven2/excalibur-component/excalibur-component/2.1/excalibur-component-2.1.jar
(69 KB at 212.0 KB/sec)
Downloading: http://repo.maven.apache.org/maven2/excalibur-pool/excalibur-pool-impl/2.1/excalibur-pool-impl-2.1.jar
Downloaded: http://repo.maven.apache.org/maven2/excalibur-pool/excalibur-pool-api/2.1/excalibur-pool-api-2.1.jar
(15 KB at 159.8 KB/sec)
Downloading: http://repo.maven.apache.org/maven2/junitperf/junitperf/1.8/junitperf-1.8.jar
Downloaded: http://repo.maven.apache.org/maven2/junitperf/junitperf/1.8/junitperf-1.8.jar
(28 KB at 407.9 KB/sec)
Downloading: http://repo.maven.apache.org/maven2/excalibur-pool/excalibur-pool-instrumented/2.1/excalibur-pool-instrumented-2.1.jar
Downloaded: http://repo.maven.apache.org/maven2/log4j/log4j/1.2.11/log4j-1.2.11.jar (343 KB
at 302.2 KB/sec)
Downloading: http://repo.maven.apache.org/maven2/org/mozilla/rhino/1.7R5/rhino-1.7R5.jar
Downloaded: http://repo.maven.apache.org/maven2/excalibur-pool/excalibur-pool-impl/2.1/excalibur-pool-impl-2.1.jar
(28 KB at 210.7 KB/sec)
Downloading: http://repo.maven.apache.org/maven2/xalan/xalan/2.7.2/xalan-2.7.2.jar
Downloaded: http://repo.maven.apache.org/maven2/excalibur-pool/excalibur-pool-instrumented/2.1/excalibur-pool-instrumented-2.1.jar
(18 KB at 263.2 KB/sec)
Downloading: http://repo.maven.apache.org/maven2/xalan/serializer/2.7.2/serializer-2.7.2.jar
Downloaded: http://repo.maven.apache.org/maven2/xalan/serializer/2.7.2/serializer-2.7.2.jar
(270 KB at 1199.7 KB/sec)
Downloading: http://repo.maven.apache.org/maven2/org/jsoup/jsoup/1.8.1/jsoup-1.8.1.jar
Downloaded: http://repo.maven.apache.org/maven2/qdox/qdox/1.5/qdox-1.5.jar (78 KB at 119.8
KB/sec)
Downloading: http://repo.maven.apache.org/maven2/org/jodd/jodd-core/3.6.4/jodd-core-3.6.4.jar
Downloaded: http://repo.maven.apache.org/maven2/org/jsoup/jsoup/1.8.1/jsoup-1.8.1.jar (294
KB at 1341.5 KB/sec)
Downloading: http://repo.maven.apache.org/maven2/org/jodd/jodd-lagarto/3.6.4/jodd-lagarto-3.6.4.jar
Downloaded: http://repo.maven.apache.org/maven2/org/jodd/jodd-lagarto/3.6.4/jodd-lagarto-3.6.4.jar
(201 KB at 1219.5 KB/sec)
Downloading: http://repo.maven.apache.org/maven2/org/jodd/jodd-log/3.6.4/jodd-log-3.6.4.jar
Downloaded: http://repo.maven.apache.org/maven2/org/jodd/jodd-log/3.6.4/jodd-log-3.6.4.jar
(15 KB at 189.4 KB/sec)
Downloading: http://repo.maven.apache.org/maven2/com/fifesoft/rsyntaxtextarea/2.5.6/rsyntaxtextarea-2.5.6.jar
Downloaded: http://repo.maven.apache.org/maven2/org/apache/jmeter/ApacheJMeter_core/2.13/ApacheJMeter_core-2.13.jar
(1236 KB at 198.3 KB/sec)
Downloading: http://repo.maven.apache.org/maven2/org/slf4j/slf4j-nop/1.7.10/slf4j-nop-1.7.10.jar
Downloaded: http://repo.maven.apache.org/maven2/org/slf4j/slf4j-nop/1.7.10/slf4j-nop-1.7.10.jar
(4 KB at 43.4 KB/sec)
Downloading: http://repo.maven.apache.org/maven2/org/apache/jmeter/ApacheJMeter_java/2.13/ApacheJMeter_java-2.13.jar
Downloaded: http://repo.maven.apache.org/maven2/org/apache/jmeter/ApacheJMeter_java/2.13/ApacheJMeter_java-2.13.jar
(41 KB at 323.1 KB/sec)
Downloading: http://repo.maven.apache.org/maven2/org/apache/jmeter/ApacheJMeter_components/2.13/ApacheJMeter_components-2.13.jar
Downloaded: http://repo.maven.apache.org/maven2/com/fifesoft/rsyntaxtextarea/2.5.6/rsyntaxtextarea-2.5.6.jar
(1014 KB at 2184.2 KB/sec)
Downloaded: http://repo.maven.apache.org/maven2/org/jodd/jodd-core/3.6.4/jodd-core-3.6.4.jar
(372 KB at 196.1 KB/sec)
Downloaded: http://repo.maven.apache.org/maven2/org/apache/jmeter/ApacheJMeter_components/2.13/ApacheJMeter_components-2.13.jar
(549 KB at 56.6 KB/sec)
Downloaded: http://repo.maven.apache.org/maven2/org/mozilla/rhino/1.7R5/rhino-1.7R5.jar (1116
KB at 71.9 KB/sec)
Downloaded: http://repo.maven.apache.org/maven2/xalan/xalan/2.7.2/xalan-2.7.2.jar (3081 KB
at 105.6 KB/sec)
Downloading: https://repository.jboss.org/nexus/content/repositories/thirdparty-releases/commons-math3/commons-math3/3.4.1/commons-math3-3.4.1.jar
Downloading: https://repository.jboss.org/nexus/content/repositories/thirdparty-releases/commons-pool2/commons-pool2/2.3/commons-pool2-2.3.jar
[INFO] ------------------------------------------------------------------------
[INFO] BUILD FAILURE
[INFO] ------------------------------------------------------------------------
[INFO] Total time: 1:23.035s
[INFO] Finished at: Wed Mar 02 01:08:01 UTC 2016
[INFO] Final Memory: 19M/250M
[INFO] ------------------------------------------------------------------------
Waiting for Jenkins to finish collecting data
[ERROR] Failed to execute goal on project fortress-core: Could not resolve dependencies for
project org.apache.directory.fortress:fortress-core:jar:1.0-RC42-SNAPSHOT: The following artifacts
could not be resolved: commons-math3:commons-math3:jar:3.4.1, commons-pool2:commons-pool2:jar:2.3:
Could not find artifact commons-math3:commons-math3:jar:3.4.1 in central (http://repo.maven.apache.org/maven2)
-> [Help 1]
[ERROR] 
[ERROR] To see the full stack trace of the errors, re-run Maven with the -e switch.
[ERROR] Re-run Maven using the -X switch to enable full debug logging.
[ERROR] 
[ERROR] For more information about the errors and possible solutions, please read the following
articles:
[ERROR] [Help 1] http://cwiki.apache.org/confluence/display/MAVEN/DependencyResolutionException
[JENKINS] Archiving <https://analysis.apache.org/jenkins/job/directory-fortress-core/ws/pom.xml>
to org.apache.directory.fortress/fortress-core/1.0-RC42-SNAPSHOT/fortress-core-1.0-RC42-SNAPSHOT.pom
Sending e-mails to: notifications@directory.apache.org
channel stopped
Skipping sonar analysis due to bad build status FAILURE

Mime
View raw message