directory-notifications mailing list archives

Site index · List index
Message view « Date » · « Thread »
Top « Date » · « Thread »
From Apache Jenkins Server <jenk...@builds.apache.org>
Subject Build failed in Jenkins: dir-apacheds-docker-installers #53
Date Wed, 02 Mar 2016 03:10:53 GMT
See <https://builds.apache.org/job/dir-apacheds-docker-installers/53/changes>

Changes:

[elecharny] o Some AttributeType constants have been moved from SchemaConstants to ApacheSchemaConstants

[elecharny] Fix for DIRSERVER-2125

[elecharny] Restore the code as it was before the removal of commons.io.

[seelmann] Fix compile error

[seelmann] Use loopback address to avoid DNS lookup

[elecharny] removed reference to commons.io

[elecharny] o Removed the references to commons.io, replacing them by references to the classes
in the LDAP API
o

------------------------------------------
[...truncated 113 lines...]
U         test-framework/src/test/java/org/apache/directory/server/core/integ/TestCreateLdapServerRule.java
U         test-framework/pom.xml
U         installers-maven-plugin/src/main/resources/org/apache/directory/server/installers/apacheds
U         installers-maven-plugin/src/main/resources/org/apache/directory/server/installers/wrapper/src/sh.script.in
U         jdbm-partition/src/test/java/org/apache/directory/server/core/partition/impl/btree/jdbm/JdbmStoreTest.java
U         jdbm-partition/src/test/java/org/apache/directory/server/core/partition/impl/btree/jdbm/JdbmIndexTest.java
U         jdbm-partition/src/test/java/org/apache/directory/server/core/partition/impl/btree/jdbm/JdbmRdnIndexTest.java
U         jdbm-partition/src/main/java/org/apache/directory/server/core/partition/impl/btree/jdbm/JdbmPartition.java
U         jdbm-partition/pom.xml
U         service-builder/pom.xml
U         kerberos-codec/src/test/java/org/apache/directory/server/kerberos/shared/KerberosUtilsTest.java
U         kerberos-codec/src/test/java/org/apache/directory/shared/kerberos/codec/KrbCredInfoDecoderTest.java
U         kerberos-codec/src/test/java/org/apache/directory/shared/kerberos/codec/EncKrbCredPartDecoderTest.java
U         kerberos-codec/src/test/java/org/apache/directory/shared/kerberos/codec/EncTicketPartDecoderTest.java
U         core/src/main/java/org/apache/directory/server/core/DefaultDirectoryService.java
U         kerberos-test/src/test/java/org/apache/directory/server/kerberos/kdc/AbstractKerberosITest.java
U         kerberos-test/src/test/java/org/apache/directory/server/kerberos/kdc/KerberosTestUtils.java
U         kerberos-test/pom.xml
U         core-integ/src/test/java/org/apache/directory/server/core/schema/PartitionSchemaLoaderIT.java
U         core-integ/src/test/java/org/apache/directory/server/core/trigger/SubentryServiceForTriggersIT.java
U         core-integ/src/test/java/org/apache/directory/server/core/api/LdapCoreSessionConnectionTest.java
U         core-integ/src/main/java/org/apache/directory/server/core/integ/IntegrationUtils.java
U         core-integ/pom.xml
At revision 1733201
[dir-apacheds-docker-installers] $ /home/jenkins/jenkins-slave/tools/hudson.tasks.Maven_MavenInstallation/maven-3.2.1/bin/mvn
-V clean install -Pinstallers -Pdocker -DskipTests
Apache Maven 3.2.1 (ea8b2b07643dbb1b84b6d16e1f08391b666bc1e9; 2014-02-14T17:37:52+00:00)
Maven home: /home/jenkins/jenkins-slave/tools/hudson.tasks.Maven_MavenInstallation/maven-3.2.1
Java version: 1.7.0_80, vendor: Oracle Corporation
Java home: /home/jenkins/jenkins-slave/tools/hudson.model.JDK/JDK_1.7_latest_/jre
Default locale: en_US, platform encoding: ISO-8859-1
OS name: "linux", version: "3.13.0-36-lowlatency", arch: "amd64", family: "unix"
[INFO] Scanning for projects...
[INFO] ------------------------------------------------------------------------
[INFO] Reactor Build Order:
[INFO] 
[INFO] ApacheDS
[INFO] ApacheDS I18n
[INFO] ApacheDS Core Constants
[INFO] ApacheDS Core API
[INFO] ApacheDS Core Shared
[INFO] ApacheDS Interceptors
[INFO] ApacheDS AdministrativePoint Interceptor
[INFO] ApacheDS Authentication Interceptor
[INFO] ApacheDS Interceptor to increment numeric attributes
[INFO] ApacheDS Authorization Interceptor
[INFO] ApacheDS ChangeLog Interceptor
[INFO] ApacheDS Collective Attribute Interceptor
[INFO] ApacheDS Event Interceptor
[INFO] ApacheDS Exception Interceptor
[INFO] ApacheDS Journal Interceptor
[INFO] ApacheDS Normalization Interceptor
[INFO] ApacheDS Operational Attribute Interceptor
[INFO] ApacheDS Referral Interceptor
[INFO] ApacheDS Schema Interceptor
[INFO] ApacheDS Subtree Interceptor
[INFO] ApacheDS Triggers Interceptor
[INFO] ApacheDS Core
[INFO] ApacheDS Core AVL
[INFO] ApacheDS Generalized (X) DBM Partition
[INFO] ApacheDS LDIF Partition
[INFO] ApacheDS JDBM Partition
[INFO] ApacheDS Mavibot Partition
[INFO] ApacheDS Core Annotations
[INFO] ApacheDS Core JNDI
[INFO] ApacheDS Protocol Kerberos Codec
[INFO] ApacheDS Interceptors for Kerberos
[INFO] ApacheDS Protocol Dhcp
[INFO] ApacheDS Protocol Shared
[INFO] ApacheDS Protocol Dns
[INFO] ApacheDS Protocol Kerberos
[INFO] ApacheDS Protocol Ldap
[INFO] ApacheDS Protocol Ntp
[INFO] Apacheds Server Annotations
[INFO] ApacheDS Server Config
[INFO] ApacheDS Server JNDI
[INFO] ApacheDS Test Framework
[INFO] ApacheDS All
[INFO] ApacheDS Logger Interceptor
[INFO] ApacheDS Password Hashing Interceptor
[INFO] ApacheDS Core Integration
[INFO] ApacheDS Protocol Kerberos Test
[INFO] ApacheDS Server Integration
[INFO] ApacheDS DirectoryService-WebApp bridge
[INFO] ApacheDS Jetty HTTP Server Integration
[INFO] ApacheDS Service Builder
[INFO] Apache Directory LDAP Client API test
[INFO] kerberos-client
[INFO] ApacheDS Service
[INFO] ApacheDS Wrapper
[INFO] ApacheDS Installers Maven Plugin
[INFO] ApacheDS Installers
[INFO] ApacheDS OSGi Integration Tests
[INFO] 
[INFO] Using the builder org.apache.maven.lifecycle.internal.builder.singlethreaded.SingleThreadedBuilder
with a thread count of 1
[INFO]                                                                         
[INFO] ------------------------------------------------------------------------
[INFO] Building ApacheDS 2.0.0-M22-SNAPSHOT
[INFO] ------------------------------------------------------------------------
[INFO] 
[INFO] --- maven-clean-plugin:2.6.1:clean (default-clean) @ apacheds-parent ---
[INFO] Deleting <https://builds.apache.org/job/dir-apacheds-docker-installers/ws/target>
[INFO] 
[INFO] --- maven-checkstyle-plugin:2.16:check (validate) @ apacheds-parent ---
[INFO] 
[INFO] --- maven-remote-resources-plugin:1.5:process (default) @ apacheds-parent ---
[INFO] 
[INFO] --- maven-site-plugin:3.4:attach-descriptor (attach-descriptor) @ apacheds-parent ---
[INFO] 
[INFO] --- tools-maven-plugin:1.4:verify-legal-files (verify-legal-files) @ apacheds-parent
---
[INFO] 
[INFO] --- maven-install-plugin:2.5.2:install (default-install) @ apacheds-parent ---
[INFO] Installing <https://builds.apache.org/job/dir-apacheds-docker-installers/ws/pom.xml>
to /home/jenkins/.m2/repository/org/apache/directory/server/apacheds-parent/2.0.0-M22-SNAPSHOT/apacheds-parent-2.0.0-M22-SNAPSHOT.pom
[INFO] Installing <https://builds.apache.org/job/dir-apacheds-docker-installers/ws/target/apacheds-parent-2.0.0-M22-SNAPSHOT-site.xml>
to /home/jenkins/.m2/repository/org/apache/directory/server/apacheds-parent/2.0.0-M22-SNAPSHOT/apacheds-parent-2.0.0-M22-SNAPSHOT-site.xml
[INFO]                                                                         
[INFO] ------------------------------------------------------------------------
[INFO] Building ApacheDS I18n 2.0.0-M22-SNAPSHOT
[INFO] ------------------------------------------------------------------------
[INFO] 
[INFO] --- maven-clean-plugin:2.6.1:clean (default-clean) @ apacheds-i18n ---
[INFO] Deleting <https://builds.apache.org/job/dir-apacheds-docker-installers/ws/i18n/target>
[INFO] 
[INFO] --- maven-checkstyle-plugin:2.16:check (validate) @ apacheds-i18n ---
[INFO] 
[INFO] --- maven-remote-resources-plugin:1.5:process (default) @ apacheds-i18n ---
[INFO] 
[INFO] --- maven-resources-plugin:2.7:resources (default-resources) @ apacheds-i18n ---
[INFO] Using 'UTF-8' encoding to copy filtered resources.
[INFO] Copying 6 resources
[INFO] Copying 3 resources
[INFO] 
[INFO] --- maven-compiler-plugin:3.3:compile (default-compile) @ apacheds-i18n ---
[INFO] Changes detected - recompiling the module!
[INFO] Compiling 1 source file to <https://builds.apache.org/job/dir-apacheds-docker-installers/ws/i18n/target/classes>
[INFO] 
[INFO] --- maven-resources-plugin:2.7:testResources (default-testResources) @ apacheds-i18n
---
[INFO] Using 'UTF-8' encoding to copy filtered resources.
[INFO] Copying 0 resource
[INFO] Copying 3 resources
[INFO] 
[INFO] --- maven-compiler-plugin:3.3:testCompile (default-testCompile) @ apacheds-i18n ---
[INFO] Nothing to compile - all classes are up to date
[INFO] 
[INFO] --- maven-surefire-plugin:2.18.1:test (default-test) @ apacheds-i18n ---
[INFO] Tests are skipped.
[INFO] 
[INFO] --- maven-bundle-plugin:2.5.3:bundle (default-bundle) @ apacheds-i18n ---
[INFO] 
[INFO] --- maven-site-plugin:3.4:attach-descriptor (attach-descriptor) @ apacheds-i18n ---
[INFO] 
[INFO] --- tools-maven-plugin:1.4:verify-legal-files (verify-legal-files) @ apacheds-i18n
---
[INFO] Checking legal files in: apacheds-i18n-2.0.0-M22-SNAPSHOT.jar
[INFO] 
[INFO] --- maven-install-plugin:2.5.2:install (default-install) @ apacheds-i18n ---
[INFO] Installing <https://builds.apache.org/job/dir-apacheds-docker-installers/ws/i18n/target/apacheds-i18n-2.0.0-M22-SNAPSHOT.jar>
to /home/jenkins/.m2/repository/org/apache/directory/server/apacheds-i18n/2.0.0-M22-SNAPSHOT/apacheds-i18n-2.0.0-M22-SNAPSHOT.jar
[INFO] Installing <https://builds.apache.org/job/dir-apacheds-docker-installers/ws/i18n/pom.xml>
to /home/jenkins/.m2/repository/org/apache/directory/server/apacheds-i18n/2.0.0-M22-SNAPSHOT/apacheds-i18n-2.0.0-M22-SNAPSHOT.pom
[INFO] 
[INFO] --- maven-bundle-plugin:2.5.3:install (default-install) @ apacheds-i18n ---
[INFO] Installing org/apache/directory/server/apacheds-i18n/2.0.0-M22-SNAPSHOT/apacheds-i18n-2.0.0-M22-SNAPSHOT.jar
[INFO] Writing OBR metadata
[INFO]                                                                         
[INFO] ------------------------------------------------------------------------
[INFO] Building ApacheDS Core Constants 2.0.0-M22-SNAPSHOT
[INFO] ------------------------------------------------------------------------
[INFO] 
[INFO] --- maven-clean-plugin:2.6.1:clean (default-clean) @ apacheds-core-constants ---
[INFO] Deleting <https://builds.apache.org/job/dir-apacheds-docker-installers/ws/core-constants/target>
[INFO] 
[INFO] --- maven-checkstyle-plugin:2.16:check (validate) @ apacheds-core-constants ---
[INFO] There is 1 error reported by Checkstyle 6.8.1 with directory-checks.xml ruleset.
[ERROR] src/main/java/org/apache/directory/server/constants/ApacheSchemaConstants.java[127:32]
(naming) ConstantName: Name '_AUTONOMOUS_AREA_SUBENTRYOID' must match pattern '^[A-Z][A-Z0-9]*(_[A-Z0-9]+)*$'.
[INFO] ------------------------------------------------------------------------
[INFO] Reactor Summary:
[INFO] 
[INFO] ApacheDS .......................................... SUCCESS [  4.075 s]
[INFO] ApacheDS I18n ..................................... SUCCESS [  4.203 s]
[INFO] ApacheDS Core Constants ........................... FAILURE [  0.554 s]
[INFO] ApacheDS Core API ................................. SKIPPED
[INFO] ApacheDS Core Shared .............................. SKIPPED
[INFO] ApacheDS Interceptors ............................. SKIPPED
[INFO] ApacheDS AdministrativePoint Interceptor .......... SKIPPED
[INFO] ApacheDS Authentication Interceptor ............... SKIPPED
[INFO] ApacheDS Interceptor to increment numeric attributes  SKIPPED
[INFO] ApacheDS Authorization Interceptor ................ SKIPPED
[INFO] ApacheDS ChangeLog Interceptor .................... SKIPPED
[INFO] ApacheDS Collective Attribute Interceptor ......... SKIPPED
[INFO] ApacheDS Event Interceptor ........................ SKIPPED
[INFO] ApacheDS Exception Interceptor .................... SKIPPED
[INFO] ApacheDS Journal Interceptor ...................... SKIPPED
[INFO] ApacheDS Normalization Interceptor ................ SKIPPED
[INFO] ApacheDS Operational Attribute Interceptor ........ SKIPPED
[INFO] ApacheDS Referral Interceptor ..................... SKIPPED
[INFO] ApacheDS Schema Interceptor ....................... SKIPPED
[INFO] ApacheDS Subtree Interceptor ...................... SKIPPED
[INFO] ApacheDS Triggers Interceptor ..................... SKIPPED
[INFO] ApacheDS Core ..................................... SKIPPED
[INFO] ApacheDS Core AVL ................................. SKIPPED
[INFO] ApacheDS Generalized (X) DBM Partition ............ SKIPPED
[INFO] ApacheDS LDIF Partition ........................... SKIPPED
[INFO] ApacheDS JDBM Partition ........................... SKIPPED
[INFO] ApacheDS Mavibot Partition ........................ SKIPPED
[INFO] ApacheDS Core Annotations ......................... SKIPPED
[INFO] ApacheDS Core JNDI ................................ SKIPPED
[INFO] ApacheDS Protocol Kerberos Codec .................. SKIPPED
[INFO] ApacheDS Interceptors for Kerberos ................ SKIPPED
[INFO] ApacheDS Protocol Dhcp ............................ SKIPPED
[INFO] ApacheDS Protocol Shared .......................... SKIPPED
[INFO] ApacheDS Protocol Dns ............................. SKIPPED
[INFO] ApacheDS Protocol Kerberos ........................ SKIPPED
[INFO] ApacheDS Protocol Ldap ............................ SKIPPED
[INFO] ApacheDS Protocol Ntp ............................. SKIPPED
[INFO] Apacheds Server Annotations ....................... SKIPPED
[INFO] ApacheDS Server Config ............................ SKIPPED
[INFO] ApacheDS Server JNDI .............................. SKIPPED
[INFO] ApacheDS Test Framework ........................... SKIPPED
[INFO] ApacheDS All ...................................... SKIPPED
[INFO] ApacheDS Logger Interceptor ....................... SKIPPED
[INFO] ApacheDS Password Hashing Interceptor ............. SKIPPED
[INFO] ApacheDS Core Integration ......................... SKIPPED
[INFO] ApacheDS Protocol Kerberos Test ................... SKIPPED
[INFO] ApacheDS Server Integration ....................... SKIPPED
[INFO] ApacheDS DirectoryService-WebApp bridge ........... SKIPPED
[INFO] ApacheDS Jetty HTTP Server Integration ............ SKIPPED
[INFO] ApacheDS Service Builder .......................... SKIPPED
[INFO] Apache Directory LDAP Client API test ............. SKIPPED
[INFO] kerberos-client ................................... SKIPPED
[INFO] ApacheDS Service .................................. SKIPPED
[INFO] ApacheDS Wrapper .................................. SKIPPED
[INFO] ApacheDS Installers Maven Plugin .................. SKIPPED
[INFO] ApacheDS Installers ............................... SKIPPED
[INFO] ApacheDS OSGi Integration Tests ................... SKIPPED
[INFO] ------------------------------------------------------------------------
[INFO] BUILD FAILURE
[INFO] ------------------------------------------------------------------------
[INFO] Total time: 11.783 s
[INFO] Finished at: 2016-03-02T03:10:56+00:00
[INFO] Final Memory: 49M/455M
[INFO] ------------------------------------------------------------------------
[ERROR] Failed to execute goal org.apache.maven.plugins:maven-checkstyle-plugin:2.16:check
(validate) on project apacheds-core-constants: You have 1 Checkstyle violation. -> [Help
1]
[ERROR] 
[ERROR] To see the full stack trace of the errors, re-run Maven with the -e switch.
[ERROR] Re-run Maven using the -X switch to enable full debug logging.
[ERROR] 
[ERROR] For more information about the errors and possible solutions, please read the following
articles:
[ERROR] [Help 1] http://cwiki.apache.org/confluence/display/MAVEN/MojoFailureException
[ERROR] 
[ERROR] After correcting the problems, you can resume the build with the command
[ERROR]   mvn <goals> -rf :apacheds-core-constants
Build step 'Invoke top-level Maven targets' marked build as failure
Archiving artifacts

Mime
View raw message