directory-notifications mailing list archives

Site index · List index
Message view « Date » · « Thread »
Top « Date » · « Thread »
From gmcdon...@apache.org
Subject Build failed in Jenkins: directory-fortress-enmasse #855
Date Sun, 20 Mar 2016 07:49:59 GMT
See <https://analysis.apache.org/jenkins/job/directory-fortress-enmasse/855/changes>

Changes:

[smckinney] release rollback

[smckinney] [maven-release-plugin] prepare release 1.0-RC42

[smckinney] [maven-release-plugin] prepare for next development iteration

------------------------------------------
Started by timer
Building in workspace <https://analysis.apache.org/jenkins/job/directory-fortress-enmasse/ws/>
 > git rev-parse --is-inside-work-tree # timeout=10
Fetching changes from the remote Git repository
 > git config remote.origin.url https://git-wip-us.apache.org/repos/asf/directory-fortress-enmasse.git
# timeout=10
Fetching upstream changes from https://git-wip-us.apache.org/repos/asf/directory-fortress-enmasse.git
 > git --version # timeout=10
 > git -c core.askpass=true fetch --tags --progress https://git-wip-us.apache.org/repos/asf/directory-fortress-enmasse.git
+refs/heads/*:refs/remotes/origin/*
Seen branch in repository origin/1.0-RC41
Seen branch in repository origin/master
Seen 2 remote branches
Checking out Revision fdd3b4d3b40fe3b3db57cd67cd2f4cc723229bd0 (origin/master)
 > git config core.sparsecheckout # timeout=10
 > git checkout -f fdd3b4d3b40fe3b3db57cd67cd2f4cc723229bd0
 > git rev-list e588dcd074d156a2c7f2b74b9ed58237923c51c4 # timeout=10
 > git tag -a -f -m Jenkins Build #855 jenkins-directory-fortress-enmasse-855 # timeout=10
Parsing POMs
Modules changed, recalculating dependency graph
Established TCP socket on 48409
[workspace] $ /x1/jenkins/jenkins-master/jenkins-home/tools/hudson.model.JDK/jdk1.7.0_65/bin/java
-Xms256m -Xmx512m -XX:+UseCompressedOops -XX:MaxPermSize=256m -cp /x1/jenkins/jenkins-master/jenkins-home/plugins/maven-plugin/WEB-INF/lib/maven3-agent-1.7.jar:/x1/jenkins/jenkins-master/jenkins-home/tools/hudson.tasks.Maven_MavenInstallation/maven-3.0.5/boot/plexus-classworlds-2.4.jar
org.jvnet.hudson.maven3.agent.Maven3Main /x1/jenkins/jenkins-master/jenkins-home/tools/hudson.tasks.Maven_MavenInstallation/maven-3.0.5
/x1/jenkins/jenkins-master/catalina-base/work/Catalina/localhost/jenkins/WEB-INF/lib/remoting-2.53.3.jar
/x1/jenkins/jenkins-master/jenkins-home/plugins/maven-plugin/WEB-INF/lib/maven3-interceptor-1.7.jar
/x1/jenkins/jenkins-master/jenkins-home/plugins/maven-plugin/WEB-INF/lib/maven3-interceptor-commons-1.7.jar
48409
<===[JENKINS REMOTING CAPACITY]===>   channel started
Executing Maven:  -B -f <https://analysis.apache.org/jenkins/job/directory-fortress-enmasse/ws/pom.xml>
clean install -U -DskipTests -fae
[INFO] Scanning for projects...
[WARNING] 
[WARNING] Some problems were encountered while building the effective model for org.apache.directory.fortress:fortress-rest:war:1.0-RC43-SNAPSHOT
[WARNING] 'build.plugins.plugin.version' for org.codehaus.mojo:tomcat-maven-plugin is missing.
@ line 330, column 15
[WARNING] 'reporting.plugins.plugin.version' for org.apache.maven.plugins:maven-javadoc-plugin
is missing. @ line 455, column 15
[WARNING] 
[WARNING] It is highly recommended to fix these problems because they threaten the stability
of your build.
[WARNING] 
[WARNING] For this reason, future Maven versions might no longer support building such malformed
projects.
[WARNING] 
[INFO]                                                                         
[INFO] ------------------------------------------------------------------------
[INFO] Building Apache Fortress Rest 1.0-RC43-SNAPSHOT
[INFO] ------------------------------------------------------------------------
Downloading: http://repo.maven.apache.org/maven2/org/codehaus/mojo/tomcat-maven-plugin/maven-metadata.xml
Downloaded: http://repo.maven.apache.org/maven2/org/codehaus/mojo/tomcat-maven-plugin/maven-metadata.xml
(439 B at 0.5 KB/sec)
Downloading: http://repo1.maven.org/maven2/org/apache/directory/fortress/fortress-realm-impl/1.0-RC42/fortress-realm-impl-1.0-RC42.pom
Downloading: http://repo.maven.apache.org/maven2/org/apache/directory/fortress/fortress-realm-impl/1.0-RC42/fortress-realm-impl-1.0-RC42.pom
[WARNING] The POM for org.apache.directory.fortress:fortress-realm-impl:jar:1.0-RC42 is missing,
no dependency information available
Downloading: http://repo1.maven.org/maven2/org/apache/directory/fortress/fortress-realm-impl/1.0-RC42/fortress-realm-impl-1.0-RC42.jar
Downloading: http://repo.maven.apache.org/maven2/org/apache/directory/fortress/fortress-realm-impl/1.0-RC42/fortress-realm-impl-1.0-RC42.jar
[INFO] ------------------------------------------------------------------------
[INFO] BUILD FAILURE
[INFO] ------------------------------------------------------------------------
[INFO] Total time: 19.567s
[INFO] Finished at: Sun Mar 20 07:49:48 UTC 2016
[INFO] Final Memory: 13M/246M
[INFO] ------------------------------------------------------------------------
Waiting for Jenkins to finish collecting data
[ERROR] Failed to execute goal on project fortress-rest: Could not resolve dependencies for
project org.apache.directory.fortress:fortress-rest:war:1.0-RC43-SNAPSHOT: Could not find
artifact org.apache.directory.fortress:fortress-realm-impl:jar:1.0-RC42 in maven2 (http://repo1.maven.org/maven2)
-> [Help 1]
[ERROR] 
[ERROR] To see the full stack trace of the errors, re-run Maven with the -e switch.
[ERROR] Re-run Maven using the -X switch to enable full debug logging.
[ERROR] 
[ERROR] For more information about the errors and possible solutions, please read the following
articles:
[ERROR] [Help 1] http://cwiki.apache.org/confluence/display/MAVEN/DependencyResolutionException
[JENKINS] Archiving <https://analysis.apache.org/jenkins/job/directory-fortress-enmasse/ws/pom.xml>
to org.apache.directory.fortress/fortress-rest/1.0-RC43-SNAPSHOT/fortress-rest-1.0-RC43-SNAPSHOT.pom
Sending e-mails to: notifications@directory.apache.org
channel stopped
Skipping sonar analysis due to bad build status FAILURE

Mime
View raw message