directory-notifications mailing list archives

Site index · List index
Message view « Date » · « Thread »
Top « Date » · « Thread »
From gmcdon...@apache.org
Subject Build failed in Jenkins: directory-fortress-commander #826
Date Tue, 08 Mar 2016 09:32:46 GMT
See <https://analysis.apache.org/jenkins/job/directory-fortress-commander/826/changes>

Changes:

[smckinney] release preps

[smckinney] release preps

[smckinney] release preps

[smckinney] release preps

[smckinney] release preps

[smckinney] [maven-release-plugin] prepare release 1.0-RC42

[smckinney] release preps

[smckinney] [maven-release-plugin] rollback the release of 1.0-RC42

[smckinney] release preps

[smckinney] [maven-release-plugin] prepare release 1.0-RC42

[smckinney] [maven-release-plugin] prepare for next development iteration

[smckinney] release preps

[smckinney] fix selenium

[smckinney] release preps

[smckinney] [maven-release-plugin] prepare release 1.0-RC42

[smckinney] [maven-release-plugin] prepare for next development iteration

[smckinney] [maven-release-plugin] rollback the release of 1.0-RC42

[smckinney]  FC-152 - Upgrade to kendo wicket.kendo-ui.version 6.15.0

[smckinney] [maven-release-plugin] prepare release 1.0-RC42

[smckinney] [maven-release-plugin] prepare for next development iteration

[smckinney]  FC-153 - pwpolicy name contains its rdn value

[smckinney] release preps

[smckinney] [maven-release-plugin] prepare release 1.0-RC42

[smckinney] [maven-release-plugin] prepare for next development iteration

------------------------------------------
Started by timer
Building in workspace <https://analysis.apache.org/jenkins/job/directory-fortress-commander/ws/>
 > git rev-parse --is-inside-work-tree # timeout=10
Fetching changes from the remote Git repository
 > git config remote.origin.url https://git-wip-us.apache.org/repos/asf/directory-fortress-commander.git
# timeout=10
Fetching upstream changes from https://git-wip-us.apache.org/repos/asf/directory-fortress-commander.git
 > git --version # timeout=10
 > git -c core.askpass=true fetch --tags --progress https://git-wip-us.apache.org/repos/asf/directory-fortress-commander.git
+refs/heads/*:refs/remotes/origin/*
Seen branch in repository origin/1.0-RC41
Seen branch in repository origin/master
Seen 2 remote branches
Checking out Revision 694b80e86de9966740c9fcbd0523edae3ebf0bb4 (origin/master)
 > git config core.sparsecheckout # timeout=10
 > git checkout -f 694b80e86de9966740c9fcbd0523edae3ebf0bb4
 > git rev-list 037ff8d4d9f11ab64f4f2684694d0c3b7872a44c # timeout=10
 > git tag -a -f -m Jenkins Build #826 jenkins-directory-fortress-commander-826 # timeout=10
Parsing POMs
Modules changed, recalculating dependency graph
Established TCP socket on 55148
[workspace] $ /x1/jenkins/jenkins-master/jenkins-home/tools/hudson.model.JDK/jdk1.7.0_65/bin/java
-Xms256m -Xmx512m -XX:+UseCompressedOops -XX:MaxPermSize=256m -cp /x1/jenkins/jenkins-master/jenkins-home/plugins/maven-plugin/WEB-INF/lib/maven3-agent-1.7.jar:/x1/jenkins/jenkins-master/jenkins-home/tools/hudson.tasks.Maven_MavenInstallation/maven-3.0.5/boot/plexus-classworlds-2.4.jar
org.jvnet.hudson.maven3.agent.Maven3Main /x1/jenkins/jenkins-master/jenkins-home/tools/hudson.tasks.Maven_MavenInstallation/maven-3.0.5
/x1/jenkins/jenkins-master/catalina-base/work/Catalina/localhost/jenkins/WEB-INF/lib/remoting-2.53.3.jar
/x1/jenkins/jenkins-master/jenkins-home/plugins/maven-plugin/WEB-INF/lib/maven3-interceptor-1.7.jar
/x1/jenkins/jenkins-master/jenkins-home/plugins/maven-plugin/WEB-INF/lib/maven3-interceptor-commons-1.7.jar
55148
<===[JENKINS REMOTING CAPACITY]===>   channel started
Executing Maven:  -B -f <https://analysis.apache.org/jenkins/job/directory-fortress-commander/ws/pom.xml>
clean install -U -DskipTests -fae
[INFO] Scanning for projects...
[INFO]                                                                         
[INFO] ------------------------------------------------------------------------
[INFO] Building Apache Fortress Web 1.0-RC43-SNAPSHOT
[INFO] ------------------------------------------------------------------------
Downloading: http://repo1.maven.org/maven2/org/apache/directory/fortress/fortress-realm-impl/1.0-RC42/fortress-realm-impl-1.0-RC42.pom
Downloading: http://repo.maven.apache.org/maven2/org/apache/directory/fortress/fortress-realm-impl/1.0-RC42/fortress-realm-impl-1.0-RC42.pom
[WARNING] The POM for org.apache.directory.fortress:fortress-realm-impl:jar:1.0-RC42 is missing,
no dependency information available
Downloading: http://repo1.maven.org/maven2/org/wicketstuff/wicketstuff-inmethod-grid/6.15.0/wicketstuff-inmethod-grid-6.15.0.pom
Downloaded: http://repo1.maven.org/maven2/org/wicketstuff/wicketstuff-inmethod-grid/6.15.0/wicketstuff-inmethod-grid-6.15.0.pom
(2 KB at 5.9 KB/sec)
Downloading: http://repo1.maven.org/maven2/org/wicketstuff/inmethod-grid-parent/6.15.0/inmethod-grid-parent-6.15.0.pom
Downloaded: http://repo1.maven.org/maven2/org/wicketstuff/inmethod-grid-parent/6.15.0/inmethod-grid-parent-6.15.0.pom
(3 KB at 8.6 KB/sec)
Downloading: http://repo1.maven.org/maven2/org/wicketstuff/jdk-1.6-parent/6.15.0/jdk-1.6-parent-6.15.0.pom
Downloaded: http://repo1.maven.org/maven2/org/wicketstuff/jdk-1.6-parent/6.15.0/jdk-1.6-parent-6.15.0.pom
(5 KB at 80.5 KB/sec)
Downloading: http://repo1.maven.org/maven2/org/wicketstuff/wicketstuff-core/6.15.0/wicketstuff-core-6.15.0.pom
Downloaded: http://repo1.maven.org/maven2/org/wicketstuff/wicketstuff-core/6.15.0/wicketstuff-core-6.15.0.pom
(30 KB at 311.2 KB/sec)
Downloading: http://repo1.maven.org/maven2/org/apache/wicket/wicket-datetime/6.15.0/wicket-datetime-6.15.0.pom
Downloaded: http://repo1.maven.org/maven2/org/apache/wicket/wicket-datetime/6.15.0/wicket-datetime-6.15.0.pom
(4 KB at 19.0 KB/sec)
Downloading: http://repo1.maven.org/maven2/org/apache/wicket/wicket-parent/6.15.0/wicket-parent-6.15.0.pom
Downloaded: http://repo1.maven.org/maven2/org/apache/wicket/wicket-parent/6.15.0/wicket-parent-6.15.0.pom
(28 KB at 336.9 KB/sec)
Downloading: http://repo1.maven.org/maven2/org/apache/wicket/wicket-core/6.15.0/wicket-core-6.15.0.pom
Downloaded: http://repo1.maven.org/maven2/org/apache/wicket/wicket-core/6.15.0/wicket-core-6.15.0.pom
(5 KB at 67.3 KB/sec)
Downloading: http://repo1.maven.org/maven2/org/apache/wicket/wicket-util/6.15.0/wicket-util-6.15.0.pom
Downloaded: http://repo1.maven.org/maven2/org/apache/wicket/wicket-util/6.15.0/wicket-util-6.15.0.pom
(3 KB at 43.7 KB/sec)
Downloading: http://repo1.maven.org/maven2/org/apache/wicket/wicket-request/6.15.0/wicket-request-6.15.0.pom
Downloaded: http://repo1.maven.org/maven2/org/apache/wicket/wicket-request/6.15.0/wicket-request-6.15.0.pom
(3 KB at 46.0 KB/sec)
Downloading: http://repo1.maven.org/maven2/org/apache/wicket/wicket-extensions/6.15.0/wicket-extensions-6.15.0.pom
Downloaded: http://repo1.maven.org/maven2/org/apache/wicket/wicket-extensions/6.15.0/wicket-extensions-6.15.0.pom
(4 KB at 66.0 KB/sec)
Downloading: http://repo1.maven.org/maven2/org/apache/wicket/wicket/6.15.0/wicket-6.15.0.pom
Downloaded: http://repo1.maven.org/maven2/org/apache/wicket/wicket/6.15.0/wicket-6.15.0.pom
(3 KB at 10.7 KB/sec)
Downloading: http://repo1.maven.org/maven2/org/wicketstuff/wicketstuff-jwicket-ui-resize/6.15.0/wicketstuff-jwicket-ui-resize-6.15.0.pom
Downloaded: http://repo1.maven.org/maven2/org/wicketstuff/wicketstuff-jwicket-ui-resize/6.15.0/wicketstuff-jwicket-ui-resize-6.15.0.pom
(2 KB at 4.9 KB/sec)
Downloading: http://repo1.maven.org/maven2/org/wicketstuff/wicketstuff-jwicket-ui/6.15.0/wicketstuff-jwicket-ui-6.15.0.pom
Downloaded: http://repo1.maven.org/maven2/org/wicketstuff/wicketstuff-jwicket-ui/6.15.0/wicketstuff-jwicket-ui-6.15.0.pom
(3 KB at 7.7 KB/sec)
Downloading: http://repo1.maven.org/maven2/org/wicketstuff/wicketstuff-jwicket-parent/6.15.0/wicketstuff-jwicket-parent-6.15.0.pom
Downloaded: http://repo1.maven.org/maven2/org/wicketstuff/wicketstuff-jwicket-parent/6.15.0/wicketstuff-jwicket-parent-6.15.0.pom
(4 KB at 17.8 KB/sec)
Downloading: http://repo1.maven.org/maven2/org/wicketstuff/wicketstuff-jwicket-core/6.15.0/wicketstuff-jwicket-core-6.15.0.pom
Downloaded: http://repo1.maven.org/maven2/org/wicketstuff/wicketstuff-jwicket-core/6.15.0/wicketstuff-jwicket-core-6.15.0.pom
(2 KB at 5.8 KB/sec)
Downloading: http://repo1.maven.org/maven2/com/googlecode/wicket-jquery-ui/wicket-jquery-ui/6.15.0/wicket-jquery-ui-6.15.0.pom
Downloaded: http://repo1.maven.org/maven2/com/googlecode/wicket-jquery-ui/wicket-jquery-ui/6.15.0/wicket-jquery-ui-6.15.0.pom
(2 KB at 15.8 KB/sec)
Downloading: http://repo1.maven.org/maven2/com/googlecode/wicket-jquery-ui/wicket-jquery-ui-parent/6.15.0/wicket-jquery-ui-parent-6.15.0.pom
Downloaded: http://repo1.maven.org/maven2/com/googlecode/wicket-jquery-ui/wicket-jquery-ui-parent/6.15.0/wicket-jquery-ui-parent-6.15.0.pom
(5 KB at 76.1 KB/sec)
Downloading: http://repo1.maven.org/maven2/com/googlecode/wicket-jquery-ui/wicket-jquery-ui-core/6.15.0/wicket-jquery-ui-core-6.15.0.pom
Downloaded: http://repo1.maven.org/maven2/com/googlecode/wicket-jquery-ui/wicket-jquery-ui-core/6.15.0/wicket-jquery-ui-core-6.15.0.pom
(2 KB at 12.8 KB/sec)
Downloading: http://repo1.maven.org/maven2/com/googlecode/wicket-jquery-ui/wicket-kendo-ui/6.15.0/wicket-kendo-ui-6.15.0.pom
Downloaded: http://repo1.maven.org/maven2/com/googlecode/wicket-jquery-ui/wicket-kendo-ui/6.15.0/wicket-kendo-ui-6.15.0.pom
(2 KB at 6.1 KB/sec)
Downloading: http://repo1.maven.org/maven2/org/seleniumhq/selenium/selenium-java/2.52.0/selenium-java-2.52.0.pom
Downloaded: http://repo1.maven.org/maven2/org/seleniumhq/selenium/selenium-java/2.52.0/selenium-java-2.52.0.pom
(6 KB at 52.2 KB/sec)
Downloading: http://repo1.maven.org/maven2/org/seleniumhq/selenium/selenium-parent/2.52.0/selenium-parent-2.52.0.pom
Downloaded: http://repo1.maven.org/maven2/org/seleniumhq/selenium/selenium-parent/2.52.0/selenium-parent-2.52.0.pom
(10 KB at 168.3 KB/sec)
Downloading: http://repo1.maven.org/maven2/org/seleniumhq/selenium/selenium-chrome-driver/2.52.0/selenium-chrome-driver-2.52.0.pom
Downloaded: http://repo1.maven.org/maven2/org/seleniumhq/selenium/selenium-chrome-driver/2.52.0/selenium-chrome-driver-2.52.0.pom
(3 KB at 40.5 KB/sec)
Downloading: http://repo1.maven.org/maven2/org/seleniumhq/selenium/selenium-remote-driver/2.52.0/selenium-remote-driver-2.52.0.pom
Downloaded: http://repo1.maven.org/maven2/org/seleniumhq/selenium/selenium-remote-driver/2.52.0/selenium-remote-driver-2.52.0.pom
(4 KB at 61.7 KB/sec)
Downloading: http://repo1.maven.org/maven2/org/seleniumhq/selenium/selenium-api/2.52.0/selenium-api-2.52.0.pom
Downloaded: http://repo1.maven.org/maven2/org/seleniumhq/selenium/selenium-api/2.52.0/selenium-api-2.52.0.pom
(6 KB at 89.4 KB/sec)
Downloading: http://repo1.maven.org/maven2/net/java/dev/jna/jna-platform/4.1.0/jna-platform-4.1.0.pom
Downloaded: http://repo1.maven.org/maven2/net/java/dev/jna/jna-platform/4.1.0/jna-platform-4.1.0.pom
(2 KB at 16.8 KB/sec)
Downloading: http://repo1.maven.org/maven2/org/seleniumhq/selenium/selenium-edge-driver/2.52.0/selenium-edge-driver-2.52.0.pom
Downloaded: http://repo1.maven.org/maven2/org/seleniumhq/selenium/selenium-edge-driver/2.52.0/selenium-edge-driver-2.52.0.pom
(3 KB at 38.6 KB/sec)
Downloading: http://repo1.maven.org/maven2/org/seleniumhq/selenium/selenium-htmlunit-driver/2.52.0/selenium-htmlunit-driver-2.52.0.pom
Downloaded: http://repo1.maven.org/maven2/org/seleniumhq/selenium/selenium-htmlunit-driver/2.52.0/selenium-htmlunit-driver-2.52.0.pom
(3 KB at 14.1 KB/sec)
Downloading: http://repo1.maven.org/maven2/org/seleniumhq/selenium/selenium-support/2.52.0/selenium-support-2.52.0.pom
Downloaded: http://repo1.maven.org/maven2/org/seleniumhq/selenium/selenium-support/2.52.0/selenium-support-2.52.0.pom
(3 KB at 1.4 KB/sec)
Downloading: http://repo1.maven.org/maven2/net/sourceforge/htmlunit/htmlunit/2.18/htmlunit-2.18.pom
Downloaded: http://repo1.maven.org/maven2/net/sourceforge/htmlunit/htmlunit/2.18/htmlunit-2.18.pom
(36 KB at 60.0 KB/sec)
Downloading: http://repo1.maven.org/maven2/org/apache/httpcomponents/httpmime/4.5/httpmime-4.5.pom
Downloaded: http://repo1.maven.org/maven2/org/apache/httpcomponents/httpmime/4.5/httpmime-4.5.pom
(5 KB at 80.5 KB/sec)
Downloading: http://repo1.maven.org/maven2/net/sourceforge/htmlunit/htmlunit-core-js/2.17/htmlunit-core-js-2.17.pom
Downloaded: http://repo1.maven.org/maven2/net/sourceforge/htmlunit/htmlunit-core-js/2.17/htmlunit-core-js-2.17.pom
(2 KB at 13.7 KB/sec)
Downloading: http://repo1.maven.org/maven2/net/sourceforge/nekohtml/nekohtml/1.9.22/nekohtml-1.9.22.pom
Downloaded: http://repo1.maven.org/maven2/net/sourceforge/nekohtml/nekohtml/1.9.22/nekohtml-1.9.22.pom
(2 KB at 20.8 KB/sec)
Downloading: http://repo1.maven.org/maven2/net/sourceforge/cssparser/cssparser/0.9.16/cssparser-0.9.16.pom
Downloaded: http://repo1.maven.org/maven2/net/sourceforge/cssparser/cssparser/0.9.16/cssparser-0.9.16.pom
(13 KB at 208.0 KB/sec)
Downloading: http://repo1.maven.org/maven2/org/eclipse/jetty/websocket/websocket-client/9.2.12.v20150709/websocket-client-9.2.12.v20150709.pom
Downloaded: http://repo1.maven.org/maven2/org/eclipse/jetty/websocket/websocket-client/9.2.12.v20150709/websocket-client-9.2.12.v20150709.pom
(5 KB at 52.5 KB/sec)
Downloading: http://repo1.maven.org/maven2/org/eclipse/jetty/websocket/websocket-parent/9.2.12.v20150709/websocket-parent-9.2.12.v20150709.pom
Downloaded: http://repo1.maven.org/maven2/org/eclipse/jetty/websocket/websocket-parent/9.2.12.v20150709/websocket-parent-9.2.12.v20150709.pom
(4 KB at 61.0 KB/sec)
Downloading: http://repo1.maven.org/maven2/org/eclipse/jetty/jetty-project/9.2.12.v20150709/jetty-project-9.2.12.v20150709.pom
Downloaded: http://repo1.maven.org/maven2/org/eclipse/jetty/jetty-project/9.2.12.v20150709/jetty-project-9.2.12.v20150709.pom
(36 KB at 433.8 KB/sec)
Downloading: http://repo1.maven.org/maven2/org/eclipse/jetty/jetty-util/9.2.12.v20150709/jetty-util-9.2.12.v20150709.pom
Downloaded: http://repo1.maven.org/maven2/org/eclipse/jetty/jetty-util/9.2.12.v20150709/jetty-util-9.2.12.v20150709.pom
(4 KB at 52.4 KB/sec)
Downloading: http://repo1.maven.org/maven2/org/eclipse/jetty/jetty-io/9.2.12.v20150709/jetty-io-9.2.12.v20150709.pom
Downloaded: http://repo1.maven.org/maven2/org/eclipse/jetty/jetty-io/9.2.12.v20150709/jetty-io-9.2.12.v20150709.pom
(3 KB at 40.6 KB/sec)
Downloading: http://repo1.maven.org/maven2/org/eclipse/jetty/websocket/websocket-common/9.2.12.v20150709/websocket-common-9.2.12.v20150709.pom
Downloaded: http://repo1.maven.org/maven2/org/eclipse/jetty/websocket/websocket-common/9.2.12.v20150709/websocket-common-9.2.12.v20150709.pom
(3 KB at 42.4 KB/sec)
Downloading: http://repo1.maven.org/maven2/org/eclipse/jetty/websocket/websocket-api/9.2.12.v20150709/websocket-api-9.2.12.v20150709.pom
Downloaded: http://repo1.maven.org/maven2/org/eclipse/jetty/websocket/websocket-api/9.2.12.v20150709/websocket-api-9.2.12.v20150709.pom
(3 KB at 39.1 KB/sec)
Downloading: http://repo1.maven.org/maven2/org/seleniumhq/selenium/selenium-firefox-driver/2.52.0/selenium-firefox-driver-2.52.0.pom
Downloaded: http://repo1.maven.org/maven2/org/seleniumhq/selenium/selenium-firefox-driver/2.52.0/selenium-firefox-driver-2.52.0.pom
(4 KB at 57.3 KB/sec)
Downloading: http://repo1.maven.org/maven2/org/seleniumhq/selenium/selenium-ie-driver/2.52.0/selenium-ie-driver-2.52.0.pom
Downloaded: http://repo1.maven.org/maven2/org/seleniumhq/selenium/selenium-ie-driver/2.52.0/selenium-ie-driver-2.52.0.pom
(4 KB at 39.4 KB/sec)
Downloading: http://repo1.maven.org/maven2/org/seleniumhq/selenium/selenium-safari-driver/2.52.0/selenium-safari-driver-2.52.0.pom
Downloaded: http://repo1.maven.org/maven2/org/seleniumhq/selenium/selenium-safari-driver/2.52.0/selenium-safari-driver-2.52.0.pom
(4 KB at 54.6 KB/sec)
Downloading: http://repo1.maven.org/maven2/org/seleniumhq/selenium/selenium-leg-rc/2.52.0/selenium-leg-rc-2.52.0.pom
Downloaded: http://repo1.maven.org/maven2/org/seleniumhq/selenium/selenium-leg-rc/2.52.0/selenium-leg-rc-2.52.0.pom
(5 KB at 41.8 KB/sec)
Downloading: http://repo1.maven.org/maven2/org/apache/directory/fortress/fortress-realm-impl/1.0-RC42/fortress-realm-impl-1.0-RC42.jar
Downloading: http://repo1.maven.org/maven2/org/wicketstuff/wicketstuff-jwicket-ui-resize/6.15.0/wicketstuff-jwicket-ui-resize-6.15.0.jar
Downloading: http://repo1.maven.org/maven2/org/wicketstuff/wicketstuff-inmethod-grid/6.15.0/wicketstuff-inmethod-grid-6.15.0.jar
Downloading: http://repo1.maven.org/maven2/org/wicketstuff/wicketstuff-jwicket-core/6.15.0/wicketstuff-jwicket-core-6.15.0.jar
Downloading: http://repo1.maven.org/maven2/com/googlecode/wicket-jquery-ui/wicket-jquery-ui/6.15.0/wicket-jquery-ui-6.15.0.jar
Downloading: http://repo1.maven.org/maven2/com/googlecode/wicket-jquery-ui/wicket-jquery-ui-core/6.15.0/wicket-jquery-ui-core-6.15.0.jar
Downloaded: http://repo1.maven.org/maven2/com/googlecode/wicket-jquery-ui/wicket-jquery-ui/6.15.0/wicket-jquery-ui-6.15.0.jar
(234 KB at 1016.7 KB/sec)
Downloading: http://repo1.maven.org/maven2/com/googlecode/wicket-jquery-ui/wicket-kendo-ui/6.15.0/wicket-kendo-ui-6.15.0.jar
Downloaded: http://repo1.maven.org/maven2/com/googlecode/wicket-jquery-ui/wicket-jquery-ui-core/6.15.0/wicket-jquery-ui-core-6.15.0.jar
(220 KB at 1001.5 KB/sec)
Downloading: http://repo1.maven.org/maven2/org/seleniumhq/selenium/selenium-java/2.52.0/selenium-java-2.52.0.jar
Downloaded: http://repo1.maven.org/maven2/org/wicketstuff/wicketstuff-jwicket-ui-resize/6.15.0/wicketstuff-jwicket-ui-resize-6.15.0.jar
(24 KB at 89.3 KB/sec)
Downloading: http://repo1.maven.org/maven2/org/seleniumhq/selenium/selenium-chrome-driver/2.52.0/selenium-chrome-driver-2.52.0.jar
Downloaded: http://repo1.maven.org/maven2/org/seleniumhq/selenium/selenium-chrome-driver/2.52.0/selenium-chrome-driver-2.52.0.jar
(11 KB at 134.2 KB/sec)
Downloading: http://repo1.maven.org/maven2/org/seleniumhq/selenium/selenium-remote-driver/2.52.0/selenium-remote-driver-2.52.0.jar
Downloaded: http://repo1.maven.org/maven2/org/wicketstuff/wicketstuff-jwicket-core/6.15.0/wicketstuff-jwicket-core-6.15.0.jar
(173 KB at 478.4 KB/sec)
Downloading: http://repo1.maven.org/maven2/org/seleniumhq/selenium/selenium-api/2.52.0/selenium-api-2.52.0.jar
Downloaded: http://repo1.maven.org/maven2/org/seleniumhq/selenium/selenium-java/2.52.0/selenium-java-2.52.0.jar
(3 KB at 15.7 KB/sec)
Downloading: http://repo1.maven.org/maven2/com/google/guava/guava/19.0/guava-19.0.jar
Downloaded: http://repo1.maven.org/maven2/org/wicketstuff/wicketstuff-inmethod-grid/6.15.0/wicketstuff-inmethod-grid-6.15.0.jar
(281 KB at 709.9 KB/sec)
Downloading: http://repo1.maven.org/maven2/org/seleniumhq/selenium/selenium-edge-driver/2.52.0/selenium-edge-driver-2.52.0.jar
Downloaded: http://repo1.maven.org/maven2/org/seleniumhq/selenium/selenium-api/2.52.0/selenium-api-2.52.0.jar
(141 KB at 1101.5 KB/sec)
Downloading: http://repo1.maven.org/maven2/org/seleniumhq/selenium/selenium-htmlunit-driver/2.52.0/selenium-htmlunit-driver-2.52.0.jar
Downloaded: http://repo1.maven.org/maven2/com/googlecode/wicket-jquery-ui/wicket-kendo-ui/6.15.0/wicket-kendo-ui-6.15.0.jar
(549 KB at 1049.0 KB/sec)
Downloading: http://repo1.maven.org/maven2/net/sourceforge/htmlunit/htmlunit/2.18/htmlunit-2.18.jar
Downloaded: http://repo1.maven.org/maven2/org/seleniumhq/selenium/selenium-remote-driver/2.52.0/selenium-remote-driver-2.52.0.jar
(230 KB at 521.5 KB/sec)
Downloading: http://repo1.maven.org/maven2/org/apache/httpcomponents/httpmime/4.5/httpmime-4.5.jar
Downloaded: http://repo1.maven.org/maven2/org/seleniumhq/selenium/selenium-edge-driver/2.52.0/selenium-edge-driver-2.52.0.jar
(7 KB at 15.9 KB/sec)
Downloading: http://repo1.maven.org/maven2/net/sourceforge/htmlunit/htmlunit-core-js/2.17/htmlunit-core-js-2.17.jar
Downloaded: http://repo1.maven.org/maven2/org/apache/httpcomponents/httpmime/4.5/httpmime-4.5.jar
(40 KB at 106.0 KB/sec)
Downloading: http://repo1.maven.org/maven2/net/sourceforge/nekohtml/nekohtml/1.9.22/nekohtml-1.9.22.jar
Downloaded: http://repo1.maven.org/maven2/org/seleniumhq/selenium/selenium-htmlunit-driver/2.52.0/selenium-htmlunit-driver-2.52.0.jar
(61 KB at 90.1 KB/sec)
Downloading: http://repo1.maven.org/maven2/net/sourceforge/cssparser/cssparser/0.9.16/cssparser-0.9.16.jar
Downloaded: http://repo1.maven.org/maven2/net/sourceforge/nekohtml/nekohtml/1.9.22/nekohtml-1.9.22.jar
(123 KB at 1122.7 KB/sec)
Downloading: http://repo1.maven.org/maven2/org/eclipse/jetty/websocket/websocket-client/9.2.12.v20150709/websocket-client-9.2.12.v20150709.jar
Downloaded: http://repo1.maven.org/maven2/net/sourceforge/htmlunit/htmlunit-core-js/2.17/htmlunit-core-js-2.17.jar
(1062 KB at 2109.9 KB/sec)
Downloading: http://repo1.maven.org/maven2/org/eclipse/jetty/jetty-util/9.2.12.v20150709/jetty-util-9.2.12.v20150709.jar
Downloaded: http://repo1.maven.org/maven2/net/sourceforge/cssparser/cssparser/0.9.16/cssparser-0.9.16.jar
(372 KB at 2878.2 KB/sec)
Downloading: http://repo1.maven.org/maven2/org/eclipse/jetty/jetty-io/9.2.12.v20150709/jetty-io-9.2.12.v20150709.jar
Downloaded: http://repo1.maven.org/maven2/com/google/guava/guava/19.0/guava-19.0.jar (2255
KB at 2445.1 KB/sec)
Downloading: http://repo1.maven.org/maven2/org/eclipse/jetty/websocket/websocket-common/9.2.12.v20150709/websocket-common-9.2.12.v20150709.jar
Downloaded: http://repo1.maven.org/maven2/org/eclipse/jetty/websocket/websocket-client/9.2.12.v20150709/websocket-client-9.2.12.v20150709.jar
(36 KB at 571.2 KB/sec)
Downloading: http://repo1.maven.org/maven2/org/eclipse/jetty/websocket/websocket-api/9.2.12.v20150709/websocket-api-9.2.12.v20150709.jar
Downloaded: http://repo1.maven.org/maven2/net/sourceforge/htmlunit/htmlunit/2.18/htmlunit-2.18.jar
(1813 KB at 3026.3 KB/sec)
Downloading: http://repo1.maven.org/maven2/org/seleniumhq/selenium/selenium-firefox-driver/2.52.0/selenium-firefox-driver-2.52.0.jar
Downloaded: http://repo1.maven.org/maven2/org/eclipse/jetty/jetty-util/9.2.12.v20150709/jetty-util-9.2.12.v20150709.jar
(350 KB at 4016.9 KB/sec)
Downloading: http://repo1.maven.org/maven2/org/seleniumhq/selenium/selenium-ie-driver/2.52.0/selenium-ie-driver-2.52.0.jar
Downloaded: http://repo1.maven.org/maven2/org/eclipse/jetty/websocket/websocket-api/9.2.12.v20150709/websocket-api-9.2.12.v20150709.jar
(43 KB at 763.4 KB/sec)
Downloading: http://repo1.maven.org/maven2/net/java/dev/jna/jna-platform/4.1.0/jna-platform-4.1.0.jar
Downloaded: http://repo1.maven.org/maven2/org/eclipse/jetty/websocket/websocket-common/9.2.12.v20150709/websocket-common-9.2.12.v20150709.jar
(176 KB at 2116.0 KB/sec)
Downloading: http://repo1.maven.org/maven2/org/seleniumhq/selenium/selenium-safari-driver/2.52.0/selenium-safari-driver-2.52.0.jar
Downloaded: http://repo1.maven.org/maven2/org/eclipse/jetty/jetty-io/9.2.12.v20150709/jetty-io-9.2.12.v20150709.jar
(106 KB at 911.2 KB/sec)
Downloading: http://repo1.maven.org/maven2/org/seleniumhq/selenium/selenium-support/2.52.0/selenium-support-2.52.0.jar
Downloaded: http://repo1.maven.org/maven2/org/seleniumhq/selenium/selenium-ie-driver/2.52.0/selenium-ie-driver-2.52.0.jar
(12 KB at 212.6 KB/sec)
Downloading: http://repo1.maven.org/maven2/org/seleniumhq/selenium/selenium-leg-rc/2.52.0/selenium-leg-rc-2.52.0.jar
Downloaded: http://repo1.maven.org/maven2/org/seleniumhq/selenium/selenium-safari-driver/2.52.0/selenium-safari-driver-2.52.0.jar
(84 KB at 1440.2 KB/sec)
Downloaded: http://repo1.maven.org/maven2/org/seleniumhq/selenium/selenium-leg-rc/2.52.0/selenium-leg-rc-2.52.0.jar
(391 KB at 5070.3 KB/sec)
Downloaded: http://repo1.maven.org/maven2/org/seleniumhq/selenium/selenium-firefox-driver/2.52.0/selenium-firefox-driver-2.52.0.jar
(798 KB at 5464.7 KB/sec)
Downloaded: http://repo1.maven.org/maven2/net/java/dev/jna/jna-platform/4.1.0/jna-platform-4.1.0.jar
(1431 KB at 10288.5 KB/sec)
Downloaded: http://repo1.maven.org/maven2/org/seleniumhq/selenium/selenium-support/2.52.0/selenium-support-2.52.0.jar
(142 KB at 1098.2 KB/sec)
Downloading: http://repo.maven.apache.org/maven2/org/apache/directory/fortress/fortress-realm-impl/1.0-RC42/fortress-realm-impl-1.0-RC42.jar
[INFO] ------------------------------------------------------------------------
[INFO] BUILD FAILURE
[INFO] ------------------------------------------------------------------------
[INFO] Total time: 19.529s
[INFO] Finished at: Tue Mar 08 09:32:44 UTC 2016
[INFO] Final Memory: 15M/246M
[INFO] ------------------------------------------------------------------------
Waiting for Jenkins to finish collecting data[ERROR] Failed to execute goal on project fortress-web:
Could not resolve dependencies for project org.apache.directory.fortress:fortress-web:war:1.0-RC43-SNAPSHOT:
Could not find artifact org.apache.directory.fortress:fortress-realm-impl:jar:1.0-RC42 in
maven2 (http://repo1.maven.org/maven2) -> [Help 1]
[ERROR] 
[ERROR] To see the full stack trace of the errors, re-run Maven with the -e switch.
[ERROR] Re-run Maven using the -X switch to enable full debug logging.
[ERROR] 
[ERROR] For more information about the errors and possible solutions, please read the following
articles:
[ERROR] [Help 1] http://cwiki.apache.org/confluence/display/MAVEN/DependencyResolutionException

[JENKINS] Archiving <https://analysis.apache.org/jenkins/job/directory-fortress-commander/ws/pom.xml>
to org.apache.directory.fortress/fortress-web/1.0-RC43-SNAPSHOT/fortress-web-1.0-RC43-SNAPSHOT.pom
Sending e-mails to: notifications@directory.apache.org
channel stopped
Skipping sonar analysis due to bad build status FAILURE

Mime
View raw message