directory-notifications mailing list archives

Site index · List index
Message view « Date » · « Thread »
Top « Date » · « Thread »
From Apache Jenkins Server <jenk...@builds.apache.org>
Subject Build failed in Jenkins: dir-studio-ui-tests #136
Date Wed, 24 Feb 2016 10:17:54 GMT
See <https://builds.apache.org/job/dir-studio-ui-tests/136/changes>

Changes:

[seelmann] DIRSTUDIO-1093: Fix UI tests after upgrade to Mars.1

[seelmann] DIRSTUDIO-1093: Upgrade to Eclipse Mars.2
* Upgrade to Mars.1 as a first step
* Upgrade to Tycho 0.24
* Use GTK2 on Linux, GTK3 binding has too many bugs

------------------------------------------
[...truncated 6537 lines...]
[INFO] ------------------------------------------------------------------------
[INFO] 
[INFO] --- maven-clean-plugin:2.6.1:clean (default-clean) @ org.apache.directory.studio.apacheds.help
---
[INFO] Deleting <https://builds.apache.org/job/dir-studio-ui-tests/ws/trunk/helps/apacheds.help/target>
[INFO] 
[INFO] --- maven-remote-resources-plugin:1.5:process (default) @ org.apache.directory.studio.apacheds.help
---
[INFO] 
[INFO] --- maven-bundle-plugin:2.5.3:manifest (generate-manifest) @ org.apache.directory.studio.apacheds.help
---
[INFO] 
[INFO] --- maven-site-plugin:3.4:attach-descriptor (attach-descriptor) @ org.apache.directory.studio.apacheds.help
---
[INFO] 
[INFO] --- tools-maven-plugin:1.4:verify-legal-files (verify-legal-files) @ org.apache.directory.studio.apacheds.help
---
[INFO]                                                                         
[INFO] ------------------------------------------------------------------------
[INFO] Building Apache Directory Studio LDAP Browser Help 2.0.0.qualifier
[INFO] ------------------------------------------------------------------------
[INFO] 
[INFO] --- maven-clean-plugin:2.6.1:clean (default-clean) @ org.apache.directory.studio.ldapbrowser.help
---
[INFO] Deleting <https://builds.apache.org/job/dir-studio-ui-tests/ws/trunk/helps/ldapbrowser.help/target>
[INFO] 
[INFO] --- maven-remote-resources-plugin:1.5:process (default) @ org.apache.directory.studio.ldapbrowser.help
---
[INFO] 
[INFO] --- maven-bundle-plugin:2.5.3:manifest (generate-manifest) @ org.apache.directory.studio.ldapbrowser.help
---
[INFO] 
[INFO] --- maven-site-plugin:3.4:attach-descriptor (attach-descriptor) @ org.apache.directory.studio.ldapbrowser.help
---
[INFO] 
[INFO] --- tools-maven-plugin:1.4:verify-legal-files (verify-legal-files) @ org.apache.directory.studio.ldapbrowser.help
---
[INFO]                                                                         
[INFO] ------------------------------------------------------------------------
[INFO] Building Apache Directory Studio LDIF Editor Help 2.0.0.qualifier
[INFO] ------------------------------------------------------------------------
[INFO] 
[INFO] --- maven-clean-plugin:2.6.1:clean (default-clean) @ org.apache.directory.studio.ldifeditor.help
---
[INFO] Deleting <https://builds.apache.org/job/dir-studio-ui-tests/ws/trunk/helps/ldifeditor.help/target>
[INFO] 
[INFO] --- maven-remote-resources-plugin:1.5:process (default) @ org.apache.directory.studio.ldifeditor.help
---
[INFO] 
[INFO] --- maven-bundle-plugin:2.5.3:manifest (generate-manifest) @ org.apache.directory.studio.ldifeditor.help
---
[INFO] 
[INFO] --- maven-site-plugin:3.4:attach-descriptor (attach-descriptor) @ org.apache.directory.studio.ldifeditor.help
---
[INFO] 
[INFO] --- tools-maven-plugin:1.4:verify-legal-files (verify-legal-files) @ org.apache.directory.studio.ldifeditor.help
---
[INFO]                                                                         
[INFO] ------------------------------------------------------------------------
[INFO] Building Apache Directory Studio RCP Help 2.0.0.qualifier
[INFO] ------------------------------------------------------------------------
[INFO] 
[INFO] --- maven-clean-plugin:2.6.1:clean (default-clean) @ org.apache.directory.studio.rcp.help
---
[INFO] Deleting <https://builds.apache.org/job/dir-studio-ui-tests/ws/trunk/helps/rcp.help/target>
[INFO] 
[INFO] --- maven-remote-resources-plugin:1.5:process (default) @ org.apache.directory.studio.rcp.help
---
[INFO] 
[INFO] --- maven-bundle-plugin:2.5.3:manifest (generate-manifest) @ org.apache.directory.studio.rcp.help
---
[INFO] 
[INFO] --- maven-site-plugin:3.4:attach-descriptor (attach-descriptor) @ org.apache.directory.studio.rcp.help
---
[INFO] 
[INFO] --- tools-maven-plugin:1.4:verify-legal-files (verify-legal-files) @ org.apache.directory.studio.rcp.help
---
[INFO]                                                                         
[INFO] ------------------------------------------------------------------------
[INFO] Building Apache Directory Studio Schema Editor Help 2.0.0.qualifier
[INFO] ------------------------------------------------------------------------
[INFO] 
[INFO] --- maven-clean-plugin:2.6.1:clean (default-clean) @ org.apache.directory.studio.schemaeditor.help
---
[INFO] Deleting <https://builds.apache.org/job/dir-studio-ui-tests/ws/trunk/helps/schemaeditor.help/target>
[INFO] 
[INFO] --- maven-remote-resources-plugin:1.5:process (default) @ org.apache.directory.studio.schemaeditor.help
---
[INFO] 
[INFO] --- maven-bundle-plugin:2.5.3:manifest (generate-manifest) @ org.apache.directory.studio.schemaeditor.help
---
[INFO] 
[INFO] --- maven-site-plugin:3.4:attach-descriptor (attach-descriptor) @ org.apache.directory.studio.schemaeditor.help
---
[INFO] 
[INFO] --- tools-maven-plugin:1.4:verify-legal-files (verify-legal-files) @ org.apache.directory.studio.schemaeditor.help
---
[INFO]                                                                         
[INFO] ------------------------------------------------------------------------
[INFO] Building Apache Directory Studio Test Plugins 2.0.0.qualifier
[INFO] ------------------------------------------------------------------------
[INFO] 
[INFO] --- maven-clean-plugin:2.6.1:clean (default-clean) @ org.apache.directory.studio.tests-parent
---
[INFO] Deleting <https://builds.apache.org/job/dir-studio-ui-tests/ws/trunk/tests/target>
[INFO] 
[INFO] --- maven-remote-resources-plugin:1.5:process (default) @ org.apache.directory.studio.tests-parent
---
[INFO] 
[INFO] --- maven-site-plugin:3.4:attach-descriptor (attach-descriptor) @ org.apache.directory.studio.tests-parent
---
[INFO] 
[INFO] --- tools-maven-plugin:1.4:verify-legal-files (verify-legal-files) @ org.apache.directory.studio.tests-parent
---
[INFO]                                                                         
[INFO] ------------------------------------------------------------------------
[INFO] Building Apache Directory Studio Core Integration Tests 2.0.0.qualifier
[INFO] ------------------------------------------------------------------------
[INFO] 
[INFO] --- maven-clean-plugin:2.6.1:clean (default-clean) @ org.apache.directory.studio.test.integration.core
---
[INFO] Deleting <https://builds.apache.org/job/dir-studio-ui-tests/ws/trunk/tests/test.integration.core/target>
[INFO] 
[INFO] --- maven-remote-resources-plugin:1.5:process (default) @ org.apache.directory.studio.test.integration.core
---
[INFO] 
[INFO] --- maven-bundle-plugin:2.5.3:manifest (generate-manifest) @ org.apache.directory.studio.test.integration.core
---
[INFO] 
[INFO] --- maven-site-plugin:3.4:attach-descriptor (attach-descriptor) @ org.apache.directory.studio.test.integration.core
---
[INFO] 
[INFO] --- tools-maven-plugin:1.4:verify-legal-files (verify-legal-files) @ org.apache.directory.studio.test.integration.core
---
[INFO]                                                                         
[INFO] ------------------------------------------------------------------------
[INFO] Building Apache Directory Studio UI Integration Tests 2.0.0.qualifier
[INFO] ------------------------------------------------------------------------
[INFO] 
[INFO] --- maven-clean-plugin:2.6.1:clean (default-clean) @ org.apache.directory.studio.test.integration.ui
---
[INFO] Deleting <https://builds.apache.org/job/dir-studio-ui-tests/ws/trunk/tests/test.integration.ui/target>
[INFO] 
[INFO] --- maven-remote-resources-plugin:1.5:process (default) @ org.apache.directory.studio.test.integration.ui
---
[INFO] 
[INFO] --- maven-bundle-plugin:2.5.3:manifest (generate-manifest) @ org.apache.directory.studio.test.integration.ui
---
[INFO] 
[INFO] --- maven-site-plugin:3.4:attach-descriptor (attach-descriptor) @ org.apache.directory.studio.test.integration.ui
---
[INFO] 
[INFO] --- tools-maven-plugin:1.4:verify-legal-files (verify-legal-files) @ org.apache.directory.studio.test.integration.ui
---
[INFO] ------------------------------------------------------------------------
[INFO] Reactor Summary:
[INFO] 
[INFO] Apache Directory Studio Setup Parent .............. SUCCESS [  2.579 s]
[INFO] Apache Directory Studio Target Platform for Eclipse  SUCCESS [01:05 min]
[INFO] Apache Directory Studio Plugins Parent ............ SUCCESS [  0.031 s]
[INFO] Apache Directory Studio Common Core ............... SUCCESS [  0.986 s]
[INFO] Apache Directory Studio LDIF Parser ............... SUCCESS [  0.229 s]
[INFO] Apache Directory Studio Common UI ................. SUCCESS [  0.202 s]
[INFO] Apache Directory Studio Connection Core ........... SUCCESS [  0.161 s]
[INFO] Apache Directory Studio Connection UI ............. SUCCESS [  0.148 s]
[INFO] Apache Directory Studio LDAP Browser Core ......... SUCCESS [  0.283 s]
[INFO] Apache Directory Studio LDAP Browser Common ....... SUCCESS [  0.181 s]
[INFO] Apache Directory Studio LDIF Editor ............... SUCCESS [  0.163 s]
[INFO] Apache Directory Studio LDAP Browser UI ........... SUCCESS [  0.143 s]
[INFO] Apache Directory Studio LDAP Servers .............. SUCCESS [  0.118 s]
[INFO] Apache Directory Studio ApacheDS Configuration .... SUCCESS [  0.187 s]
[INFO] Apache Directory Studio Schema Editor ............. SUCCESS [  0.166 s]
[INFO] Apache Directory Studio Value Editors ............. SUCCESS [  0.115 s]
[INFO] Apache Directory Studio ACI Item Editor ........... SUCCESS [  0.107 s]
[INFO] Apache Directory Studio ApacheDS LDAP Server Adapter  SUCCESS [  0.095 s]
[INFO] Apache Directory Studio OpenLDAP Common UI ........ SUCCESS [  0.123 s]
[INFO] Apache Directory Studio OpenLDAP Configuration Editor  SUCCESS [  0.178 s]
[INFO] Apache Directory Studio SyncRepl .................. SUCCESS [  0.122 s]
[INFO] Apache Directory Studio OpenLDAP ACL Configuration Editor  SUCCESS [  1.471 s]
[INFO] Apache Directory Studio RCP ....................... SUCCESS [  0.141 s]
[INFO] Apache Directory Studio Combined Editor ........... SUCCESS [  0.108 s]
[INFO] Apache Directory Studio Template Editor ........... SUCCESS [  0.106 s]
[INFO] Apache Directory Studio SLF4J to Eclipse Log Binding  SUCCESS [  0.081 s]
[INFO] Apache Directory Studio Help Plugins Parent ....... SUCCESS [  0.031 s]
[INFO] Apache Directory Studio Apache DS Help ............ SUCCESS [  0.155 s]
[INFO] Apache Directory Studio LDAP Browser Help ......... SUCCESS [  0.231 s]
[INFO] Apache Directory Studio LDIF Editor Help .......... SUCCESS [  0.236 s]
[INFO] Apache Directory Studio RCP Help .................. SUCCESS [  0.184 s]
[INFO] Apache Directory Studio Schema Editor Help ........ SUCCESS [  0.212 s]
[INFO] Apache Directory Studio Test Plugins .............. SUCCESS [  0.025 s]
[INFO] Apache Directory Studio Core Integration Tests .... SUCCESS [  0.157 s]
[INFO] Apache Directory Studio UI Integration Tests ...... SUCCESS [  0.310 s]
[INFO] ------------------------------------------------------------------------
[INFO] BUILD SUCCESS
[INFO] ------------------------------------------------------------------------
[INFO] Total time: 01:21 min
[INFO] Finished at: 2016-02-24T10:16:38+00:00
[INFO] Final Memory: 45M/728M
[INFO] ------------------------------------------------------------------------
Parsing POMs
Modules changed, recalculating dependency graph
Established TCP socket on 51067
maven32-agent.jar already up to date
maven32-interceptor.jar already up to date
maven3-interceptor-commons.jar already up to date
[trunk] $ /usr/lib/jvm/java-7-openjdk-amd64//bin/java -Xmx1024m -XX:MaxPermSize=512m -cp /home/jenkins/jenkins-slave/maven32-agent.jar:/home/jenkins/jenkins-slave/tools/hudson.tasks.Maven_MavenInstallation/maven-3.2.1/boot/plexus-classworlds-2.5.1.jar:/home/jenkins/jenkins-slave/tools/hudson.tasks.Maven_MavenInstallation/maven-3.2.1/conf/logging
jenkins.maven3.agent.Maven32Main /home/jenkins/jenkins-slave/tools/hudson.tasks.Maven_MavenInstallation/maven-3.2.1
/home/jenkins/jenkins-slave/slave.jar /home/jenkins/jenkins-slave/maven32-interceptor.jar
/home/jenkins/jenkins-slave/maven3-interceptor-commons.jar 51067
<===[JENKINS REMOTING CAPACITY]===>   channel started
Executing Maven:  -B -f <https://builds.apache.org/job/dir-studio-ui-tests/ws/trunk/pom.xml>
-Dmaven.repo.local=<https://builds.apache.org/job/dir-studio-ui-tests/ws/.repository>
-U -V -Denable-ui-tests clean install
Apache Maven 3.2.1 (ea8b2b07643dbb1b84b6d16e1f08391b666bc1e9; 2014-02-14T17:37:52+00:00)
Maven home: /home/jenkins/jenkins-slave/tools/hudson.tasks.Maven_MavenInstallation/maven-3.2.1
Java version: 1.7.0_65, vendor: Oracle Corporation
Java home: /usr/lib/jvm/java-7-openjdk-amd64/jre
Default locale: en_US, platform encoding: ISO-8859-1
OS name: "linux", version: "3.13.0-36-lowlatency", arch: "amd64", family: "unix"
[INFO] Scanning for projects...
[INFO] Downloading: http://repo.maven.apache.org/maven2/org/eclipse/tycho/tycho-compiler-plugin/0.24.0/tycho-compiler-plugin-0.24.0.pom
[INFO] Downloaded: http://repo.maven.apache.org/maven2/org/eclipse/tycho/tycho-compiler-plugin/0.24.0/tycho-compiler-plugin-0.24.0.pom
(3 KB at 11.3 KB/sec)
[INFO] Downloading: http://repo.maven.apache.org/maven2/org/eclipse/tycho/tycho-compiler-plugin/0.24.0/tycho-compiler-plugin-0.24.0.jar
[INFO] Downloaded: http://repo.maven.apache.org/maven2/org/eclipse/tycho/tycho-compiler-plugin/0.24.0/tycho-compiler-plugin-0.24.0.jar
(33 KB at 288.4 KB/sec)
[INFO] Downloading: http://repo.maven.apache.org/maven2/org/eclipse/tycho/target-platform-configuration/0.24.0/target-platform-configuration-0.24.0.pom
[INFO] Downloaded: http://repo.maven.apache.org/maven2/org/eclipse/tycho/target-platform-configuration/0.24.0/target-platform-configuration-0.24.0.pom
(2 KB at 23.4 KB/sec)
[INFO] Downloading: http://repo.maven.apache.org/maven2/org/eclipse/tycho/target-platform-configuration/0.24.0/target-platform-configuration-0.24.0.jar
[INFO] Downloaded: http://repo.maven.apache.org/maven2/org/eclipse/tycho/target-platform-configuration/0.24.0/target-platform-configuration-0.24.0.jar
(8 KB at 110.5 KB/sec)
[INFO] Downloading: http://repo.maven.apache.org/maven2/org/eclipse/tycho/tycho-surefire-plugin/0.24.0/tycho-surefire-plugin-0.24.0.pom
[INFO] Downloaded: http://repo.maven.apache.org/maven2/org/eclipse/tycho/tycho-surefire-plugin/0.24.0/tycho-surefire-plugin-0.24.0.pom
(5 KB at 56.8 KB/sec)
[INFO] Downloading: http://repo.maven.apache.org/maven2/org/eclipse/tycho/tycho-surefire/0.24.0/tycho-surefire-0.24.0.pom
[INFO] Downloaded: http://repo.maven.apache.org/maven2/org/eclipse/tycho/tycho-surefire/0.24.0/tycho-surefire-0.24.0.pom
(4 KB at 45.1 KB/sec)
[INFO] Downloading: http://repo.maven.apache.org/maven2/org/eclipse/tycho/tycho-surefire-plugin/0.24.0/tycho-surefire-plugin-0.24.0.jar
[INFO] Downloaded: http://repo.maven.apache.org/maven2/org/eclipse/tycho/tycho-surefire-plugin/0.24.0/tycho-surefire-plugin-0.24.0.jar
(51 KB at 484.7 KB/sec)
[INFO] Downloading: http://repo.maven.apache.org/maven2/org/eclipse/tycho/org.eclipse.tycho.surefire.osgibooter/0.24.0/org.eclipse.tycho.surefire.osgibooter-0.24.0.pom
[INFO] Downloaded: http://repo.maven.apache.org/maven2/org/eclipse/tycho/org.eclipse.tycho.surefire.osgibooter/0.24.0/org.eclipse.tycho.surefire.osgibooter-0.24.0.pom
(3 KB at 28.7 KB/sec)
[INFO] Downloading: http://repo.maven.apache.org/maven2/org/eclipse/tycho/org.eclipse.tycho.surefire.junit/0.24.0/org.eclipse.tycho.surefire.junit-0.24.0.pom
[INFO] Downloaded: http://repo.maven.apache.org/maven2/org/eclipse/tycho/org.eclipse.tycho.surefire.junit/0.24.0/org.eclipse.tycho.surefire.junit-0.24.0.pom
(2 KB at 20.7 KB/sec)
[INFO] Downloading: http://repo.maven.apache.org/maven2/org/eclipse/tycho/org.eclipse.tycho.surefire.junit4/0.24.0/org.eclipse.tycho.surefire.junit4-0.24.0.pom
[INFO] Downloaded: http://repo.maven.apache.org/maven2/org/eclipse/tycho/org.eclipse.tycho.surefire.junit4/0.24.0/org.eclipse.tycho.surefire.junit4-0.24.0.pom
(2 KB at 22.8 KB/sec)
[INFO] Downloading: http://repo.maven.apache.org/maven2/org/eclipse/tycho/org.eclipse.tycho.surefire.junit47/0.24.0/org.eclipse.tycho.surefire.junit47-0.24.0.pom
[INFO] Downloaded: http://repo.maven.apache.org/maven2/org/eclipse/tycho/org.eclipse.tycho.surefire.junit47/0.24.0/org.eclipse.tycho.surefire.junit47-0.24.0.pom
(2 KB at 27.8 KB/sec)
[INFO] Downloading: http://repo.maven.apache.org/maven2/org/eclipse/tycho/tycho-testing-harness/0.24.0/tycho-testing-harness-0.24.0.pom
[INFO] Downloaded: http://repo.maven.apache.org/maven2/org/eclipse/tycho/tycho-testing-harness/0.24.0/tycho-testing-harness-0.24.0.pom
(3 KB at 35.9 KB/sec)
[INFO] Downloading: http://repo.maven.apache.org/maven2/org/apache/maven/plugin-testing/maven-plugin-testing-harness/2.1/maven-plugin-testing-harness-2.1.pom
[INFO] Downloaded: http://repo.maven.apache.org/maven2/org/apache/maven/plugin-testing/maven-plugin-testing-harness/2.1/maven-plugin-testing-harness-2.1.pom
(4 KB at 45.1 KB/sec)
[INFO] Downloading: http://repo.maven.apache.org/maven2/org/apache/maven/plugin-testing/maven-plugin-testing/2.1/maven-plugin-testing-2.1.pom
[INFO] Downloaded: http://repo.maven.apache.org/maven2/org/apache/maven/plugin-testing/maven-plugin-testing/2.1/maven-plugin-testing-2.1.pom
(10 KB at 138.2 KB/sec)
[INFO] Downloading: http://repo.maven.apache.org/maven2/org/apache/maven/shared/maven-verifier/1.3/maven-verifier-1.3.pom
[INFO] Downloaded: http://repo.maven.apache.org/maven2/org/apache/maven/shared/maven-verifier/1.3/maven-verifier-1.3.pom
(3 KB at 29.6 KB/sec)
[INFO] Downloading: http://repo.maven.apache.org/maven2/org/apache/maven/shared/maven-shared-components/16/maven-shared-components-16.pom
[INFO] Downloaded: http://repo.maven.apache.org/maven2/org/apache/maven/shared/maven-shared-components/16/maven-shared-components-16.pom
(9 KB at 127.7 KB/sec)
[INFO] Downloading: http://repo.maven.apache.org/maven2/org/eclipse/tycho/org.eclipse.tycho.surefire.osgibooter/0.24.0/org.eclipse.tycho.surefire.osgibooter-0.24.0.jar
[INFO] Downloading: http://repo.maven.apache.org/maven2/org/eclipse/tycho/org.eclipse.tycho.surefire.junit/0.24.0/org.eclipse.tycho.surefire.junit-0.24.0.jar
[INFO] Downloading: http://repo.maven.apache.org/maven2/org/eclipse/tycho/org.eclipse.tycho.surefire.junit4/0.24.0/org.eclipse.tycho.surefire.junit4-0.24.0.jar
[INFO] Downloading: http://repo.maven.apache.org/maven2/org/eclipse/tycho/org.eclipse.tycho.surefire.junit47/0.24.0/org.eclipse.tycho.surefire.junit47-0.24.0.jar
[INFO] Downloading: http://repo.maven.apache.org/maven2/org/eclipse/tycho/tycho-testing-harness/0.24.0/tycho-testing-harness-0.24.0.jar
[INFO] Downloaded: http://repo.maven.apache.org/maven2/org/eclipse/tycho/org.eclipse.tycho.surefire.junit/0.24.0/org.eclipse.tycho.surefire.junit-0.24.0.jar
(24 KB at 175.6 KB/sec)
[INFO] Downloading: http://repo.maven.apache.org/maven2/org/apache/maven/plugin-testing/maven-plugin-testing-harness/2.1/maven-plugin-testing-harness-2.1.jar
[INFO] Downloaded: http://repo.maven.apache.org/maven2/org/eclipse/tycho/tycho-testing-harness/0.24.0/tycho-testing-harness-0.24.0.jar
(40 KB at 292.0 KB/sec)
[INFO] Downloading: http://repo.maven.apache.org/maven2/org/apache/maven/shared/maven-verifier/1.3/maven-verifier-1.3.jar
[INFO] Downloaded: http://repo.maven.apache.org/maven2/org/eclipse/tycho/org.eclipse.tycho.surefire.junit4/0.24.0/org.eclipse.tycho.surefire.junit4-0.24.0.jar
(57 KB at 341.2 KB/sec)
[INFO] Downloaded: http://repo.maven.apache.org/maven2/org/eclipse/tycho/org.eclipse.tycho.surefire.osgibooter/0.24.0/org.eclipse.tycho.surefire.osgibooter-0.24.0.jar
(408 KB at 2300.9 KB/sec)
[INFO] Downloaded: http://repo.maven.apache.org/maven2/org/eclipse/tycho/org.eclipse.tycho.surefire.junit47/0.24.0/org.eclipse.tycho.surefire.junit47-0.24.0.jar
(157 KB at 805.0 KB/sec)
[INFO] Downloaded: http://repo.maven.apache.org/maven2/org/apache/maven/plugin-testing/maven-plugin-testing-harness/2.1/maven-plugin-testing-harness-2.1.jar
(39 KB at 388.0 KB/sec)
[INFO] Downloaded: http://repo.maven.apache.org/maven2/org/apache/maven/shared/maven-verifier/1.3/maven-verifier-1.3.jar
(88 KB at 885.1 KB/sec)
[INFO] Downloading: http://repo.maven.apache.org/maven2/org/eclipse/tycho/tycho-p2-repository-plugin/0.24.0/tycho-p2-repository-plugin-0.24.0.pom
[INFO] Downloaded: http://repo.maven.apache.org/maven2/org/eclipse/tycho/tycho-p2-repository-plugin/0.24.0/tycho-p2-repository-plugin-0.24.0.pom
(2 KB at 20.7 KB/sec)
[INFO] Downloading: http://repo.maven.apache.org/maven2/org/eclipse/tycho/tycho-p2-repository-plugin/0.24.0/tycho-p2-repository-plugin-0.24.0.jar
[INFO] Downloaded: http://repo.maven.apache.org/maven2/org/eclipse/tycho/tycho-p2-repository-plugin/0.24.0/tycho-p2-repository-plugin-0.24.0.jar
(14 KB at 187.6 KB/sec)
[INFO] Downloading: http://repo.maven.apache.org/maven2/org/eclipse/tycho/tycho-p2-publisher-plugin/0.24.0/tycho-p2-publisher-plugin-0.24.0.pom
[INFO] Downloaded: http://repo.maven.apache.org/maven2/org/eclipse/tycho/tycho-p2-publisher-plugin/0.24.0/tycho-p2-publisher-plugin-0.24.0.pom
(3 KB at 29.7 KB/sec)
[INFO] Downloading: http://repo.maven.apache.org/maven2/org/eclipse/tycho/tycho-p2-publisher-plugin/0.24.0/tycho-p2-publisher-plugin-0.24.0.jar
[INFO] Downloaded: http://repo.maven.apache.org/maven2/org/eclipse/tycho/tycho-p2-publisher-plugin/0.24.0/tycho-p2-publisher-plugin-0.24.0.jar
(20 KB at 285.2 KB/sec)
[INFO] Downloading: http://repo.maven.apache.org/maven2/org/eclipse/tycho/tycho-p2-director-plugin/0.24.0/tycho-p2-director-plugin-0.24.0.pom
[INFO] Downloaded: http://repo.maven.apache.org/maven2/org/eclipse/tycho/tycho-p2-director-plugin/0.24.0/tycho-p2-director-plugin-0.24.0.pom
(3 KB at 37.6 KB/sec)
[INFO] Downloading: http://repo.maven.apache.org/maven2/org/eclipse/tycho/tycho-p2-director-plugin/0.24.0/tycho-p2-director-plugin-0.24.0.jar
[INFO] Downloaded: http://repo.maven.apache.org/maven2/org/eclipse/tycho/tycho-p2-director-plugin/0.24.0/tycho-p2-director-plugin-0.24.0.jar
(44 KB at 626.4 KB/sec)
[INFO] Downloading: http://repo.maven.apache.org/maven2/org/eclipse/tycho/tycho-standalone-p2-director/0.24.0/tycho-standalone-p2-director-0.24.0.pom
[INFO] Downloaded: http://repo.maven.apache.org/maven2/org/eclipse/tycho/tycho-standalone-p2-director/0.24.0/tycho-standalone-p2-director-0.24.0.pom
(2 KB at 25.1 KB/sec)
[INFO] Downloading: http://repo.maven.apache.org/maven2/org/eclipse/tycho/tycho-standalone-p2-director/0.24.0/tycho-standalone-p2-director-0.24.0.zip
[INFO] Downloaded: http://repo.maven.apache.org/maven2/org/eclipse/tycho/tycho-standalone-p2-director/0.24.0/tycho-standalone-p2-director-0.24.0.zip
(6989 KB at 21111.8 KB/sec)
[INFO] Computing target platform for MavenProject: org.apache.directory.studio:org.apache.directory.studio.aciitemeditor:2.0.0-SNAPSHOT
@ <https://builds.apache.org/job/dir-studio-ui-tests/ws/trunk/plugins/aciitemeditor/pom.xml>
[INFO] Adding repository file://<https://builds.apache.org/job/dir-studio-ui-tests/ws/trunk/eclipse-trgt-platform/target/repository>
[ERROR] Failed to resolve target definition <https://builds.apache.org/job/dir-studio-ui-tests/ws/trunk/eclipse-trgt-platform/org.apache.directory.studio.eclipse-trgt-platform.target>:
Could not find "org.apache.servicemix.bundles.xpp3/1.1.0.4c_6" in the repositories of the
current location -> [Help 1]
[ERROR] 
[ERROR] To see the full stack trace of the errors, re-run Maven with the -e switch.
[ERROR] Re-run Maven using the -X switch to enable full debug logging.
[ERROR] 
[ERROR] For more information about the errors and possible solutions, please read the following
articles:
[ERROR] [Help 1] http://cwiki.apache.org/confluence/display/MAVEN/MavenExecutionException
Xvfb stopping
channel stopped

Mime
View raw message