directory-notifications mailing list archives

Site index · List index
Message view « Date » · « Thread »
Top « Date » · « Thread »
From gmcdon...@apache.org
Subject Build failed in Jenkins: directory-kerby » Kerby Config #287
Date Mon, 01 Feb 2016 06:21:30 GMT
See <https://analysis.apache.org/jenkins/job/directory-kerby/org.apache.kerby$kerby-config/287/>

------------------------------------------
[INFO]                                                                         
[INFO] ------------------------------------------------------------------------
[INFO] Building Kerby Config 1.0.0-RC2-SNAPSHOT
[INFO] ------------------------------------------------------------------------
[INFO] 
[INFO] --- maven-clean-plugin:2.5:clean (default-clean) @ kerby-config ---
[INFO] 
[INFO] --- maven-pmd-plugin:3.5:pmd (pmd) @ kerby-config ---
[INFO] 
[INFO] --- maven-pmd-plugin:3.5:check (validate) @ kerby-config ---
[INFO] 
[INFO] 
[INFO] --- maven-checkstyle-plugin:2.17:check (validate) @ kerby-config ---
[INFO] 
[INFO] --- maven-remote-resources-plugin:1.5:process (default) @ kerby-config ---
[INFO] 
[INFO] --- maven-resources-plugin:2.7:resources (default-resources) @ kerby-config ---
[INFO] Using 'UTF-8' encoding to copy filtered resources.
[INFO] skip non existing resourceDirectory <https://analysis.apache.org/jenkins/job/directory-kerby/org.apache.kerby$kerby-config/ws/src/main/resources>
[INFO] Copying 3 resources
[INFO] 
[INFO] --- maven-compiler-plugin:3.3:compile (default-compile) @ kerby-config ---
[INFO] Changes detected - recompiling the module!
[INFO] Compiling 15 source files to <https://analysis.apache.org/jenkins/job/directory-kerby/org.apache.kerby$kerby-config/ws/target/classes>
[INFO] <https://analysis.apache.org/jenkins/job/directory-kerby/org.apache.kerby$kerby-config/ws/src/main/java/org/apache/kerby/config/ConfigImpl.java>:
Some input files use unchecked or unsafe operations.
[INFO] <https://analysis.apache.org/jenkins/job/directory-kerby/org.apache.kerby$kerby-config/ws/src/main/java/org/apache/kerby/config/ConfigImpl.java>:
Recompile with -Xlint:unchecked for details.
[INFO] 
[INFO] --- maven-resources-plugin:2.7:testResources (default-testResources) @ kerby-config
---
[INFO] Using 'UTF-8' encoding to copy filtered resources.
[INFO] skip non existing resourceDirectory <https://analysis.apache.org/jenkins/job/directory-kerby/org.apache.kerby$kerby-config/ws/src/test/resources>
[INFO] Copying 3 resources
[INFO] 
[INFO] --- maven-compiler-plugin:3.3:testCompile (default-testCompile) @ kerby-config ---
[INFO] Changes detected - recompiling the module!
[INFO] Compiling 3 source files to <https://analysis.apache.org/jenkins/job/directory-kerby/org.apache.kerby$kerby-config/ws/target/test-classes>
[INFO] -------------------------------------------------------------
[ERROR] COMPILATION ERROR : 
[INFO] -------------------------------------------------------------
[ERROR] <https://analysis.apache.org/jenkins/job/directory-kerby/org.apache.kerby$kerby-config/ws/src/test/java/org/apache/kerby/config/ConfTest.java>:[48,9]
cannot access java.util.concurrent.CompletableFuture
  class file for java.util.concurrent.CompletableFuture not found
[ERROR] <https://analysis.apache.org/jenkins/job/directory-kerby/org.apache.kerby$kerby-config/ws/src/test/java/org/apache/kerby/config/ConfTest.java>:[49,9]
cannot access java.util.Optional
  class file for java.util.Optional not found
[ERROR] <https://analysis.apache.org/jenkins/job/directory-kerby/org.apache.kerby$kerby-config/ws/src/test/java/org/apache/kerby/config/ConfTest.java>:[50,9]
cannot access java.util.OptionalDouble
  class file for java.util.OptionalDouble not found
[ERROR] <https://analysis.apache.org/jenkins/job/directory-kerby/org.apache.kerby$kerby-config/ws/src/test/java/org/apache/kerby/config/ConfTest.java>:[65,9]
cannot access java.util.OptionalInt
  class file for java.util.OptionalInt not found
[ERROR] <https://analysis.apache.org/jenkins/job/directory-kerby/org.apache.kerby$kerby-config/ws/src/test/java/org/apache/kerby/config/ConfTest.java>:[66,9]
cannot access java.util.OptionalLong
  class file for java.util.OptionalLong not found
[ERROR] <https://analysis.apache.org/jenkins/job/directory-kerby/org.apache.kerby$kerby-config/ws/src/test/java/org/apache/kerby/config/ConfTest.java>:[67,9]
cannot access java.time.ZonedDateTime
  class file for java.time.ZonedDateTime not found
[ERROR] <https://analysis.apache.org/jenkins/job/directory-kerby/org.apache.kerby$kerby-config/ws/src/test/java/org/apache/kerby/config/ConfTest.java>:[90,9]
cannot access java.time.LocalDateTime
  class file for java.time.LocalDateTime not found
[ERROR] <https://analysis.apache.org/jenkins/job/directory-kerby/org.apache.kerby$kerby-config/ws/src/test/java/org/apache/kerby/config/ConfTest.java>:[91,9]
cannot access java.time.OffsetDateTime
  class file for java.time.OffsetDateTime not found
[ERROR] <https://analysis.apache.org/jenkins/job/directory-kerby/org.apache.kerby$kerby-config/ws/src/test/java/org/apache/kerby/config/ConfTest.java>:[92,9]
cannot access java.time.OffsetTime
  class file for java.time.OffsetTime not found
[ERROR] <https://analysis.apache.org/jenkins/job/directory-kerby/org.apache.kerby$kerby-config/ws/src/test/java/org/apache/kerby/config/ConfTest.java>:[93,9]
cannot access java.time.LocalTime
  class file for java.time.LocalTime not found
[ERROR] <https://analysis.apache.org/jenkins/job/directory-kerby/org.apache.kerby$kerby-config/ws/src/test/java/org/apache/kerby/config/ConfTest.java>:[94,9]
cannot access java.time.LocalDate
  class file for java.time.LocalDate not found
[ERROR] <https://analysis.apache.org/jenkins/job/directory-kerby/org.apache.kerby$kerby-config/ws/src/test/java/org/apache/kerby/config/ConfTest.java>:[122,9]
cannot access java.util.stream.Stream
  class file for java.util.stream.Stream not found
[INFO] 12 errors 
[INFO] -------------------------------------------------------------

Mime
View raw message