directory-notifications mailing list archives

Site index · List index
Message view « Date » · « Thread »
Top « Date » · « Thread »
From gmcdon...@apache.org
Subject Build failed in Jenkins: directory-kerby » Kerby-kerb core #263
Date Sun, 10 Jan 2016 06:22:01 GMT
See <https://analysis.apache.org/jenkins/job/directory-kerby/org.apache.kerby$kerb-core/263/changes>

Changes:

[elecharny] Fixed PMD errors

------------------------------------------
[INFO]                                                                         
[INFO] ------------------------------------------------------------------------
[INFO] Building Kerby-kerb core 1.0.0-RC2-SNAPSHOT
[INFO] ------------------------------------------------------------------------
[INFO] 
[INFO] --- maven-clean-plugin:2.5:clean (default-clean) @ kerb-core ---
[INFO] 
[INFO] --- maven-pmd-plugin:3.5:pmd (pmd) @ kerb-core ---
[INFO] 
[INFO] --- maven-pmd-plugin:3.5:check (validate) @ kerb-core ---
[INFO] 
[INFO] 
[INFO] --- maven-checkstyle-plugin:2.15:check (validate) @ kerb-core ---
[INFO] There are 3 errors reported by Checkstyle 6.1.1 with kerby-checkstyle.xml ruleset.
[ERROR] src/main/java/org/apache/kerby/kerberos/kerb/type/base/CheckSum.java[145:15] (whitespace)
ParenPad: '(' is followed by whitespace.
[ERROR] src/main/java/org/apache/kerby/kerberos/kerb/type/base/CheckSum.java[145:41] (whitespace)
ParenPad: ')' is preceded with whitespace.
[ERROR] src/main/java/org/apache/kerby/kerberos/kerb/type/base/EncryptedData.java[148:15]
(whitespace) ParenPad: '(' is followed by whitespace.

Mime
View raw message