directory-notifications mailing list archives

Site index · List index
Message view « Date » · « Thread »
Top « Date » · « Thread »
From gmcdon...@apache.org
Subject Build failed in Jenkins: directory-kerby » Kerby ASN1 Project #285
Date Sat, 30 Jan 2016 06:21:46 GMT
See <https://analysis.apache.org/jenkins/job/directory-kerby/org.apache.kerby$kerby-asn1/285/>

------------------------------------------
[INFO]                                                                         
[INFO] ------------------------------------------------------------------------
[INFO] Building Kerby ASN1 Project 1.0.0-RC2-SNAPSHOT
[INFO] ------------------------------------------------------------------------
[INFO] 
[INFO] --- maven-clean-plugin:2.5:clean (default-clean) @ kerby-asn1 ---
[INFO] 
[INFO] --- maven-pmd-plugin:3.5:pmd (pmd) @ kerby-asn1 ---
[INFO] 
[INFO] --- maven-pmd-plugin:3.5:check (validate) @ kerby-asn1 ---
[INFO] 
[INFO] 
[INFO] --- maven-checkstyle-plugin:2.17:check (validate) @ kerby-asn1 ---
[INFO] 
[INFO] --- maven-remote-resources-plugin:1.5:process (default) @ kerby-asn1 ---
[INFO] 
[INFO] --- maven-resources-plugin:2.7:resources (default-resources) @ kerby-asn1 ---
[INFO] Using 'UTF-8' encoding to copy filtered resources.
[INFO] skip non existing resourceDirectory <https://analysis.apache.org/jenkins/job/directory-kerby/org.apache.kerby$kerby-asn1/ws/src/main/resources>
[INFO] Copying 3 resources
[INFO] 
[INFO] --- maven-compiler-plugin:3.3:compile (default-compile) @ kerby-asn1 ---
[INFO] Changes detected - recompiling the module!
[INFO] Compiling 69 source files to <https://analysis.apache.org/jenkins/job/directory-kerby/org.apache.kerby$kerby-asn1/ws/target/classes>
[INFO] <https://analysis.apache.org/jenkins/job/directory-kerby/org.apache.kerby$kerby-asn1/ws/src/main/java/org/apache/kerby/asn1/type/Asn1CollectionOf.java>:
Some input files use unchecked or unsafe operations.
[INFO] <https://analysis.apache.org/jenkins/job/directory-kerby/org.apache.kerby$kerby-asn1/ws/src/main/java/org/apache/kerby/asn1/type/Asn1CollectionOf.java>:
Recompile with -Xlint:unchecked for details.
[INFO] 
[INFO] --- maven-resources-plugin:2.7:testResources (default-testResources) @ kerby-asn1 ---
[INFO] Using 'UTF-8' encoding to copy filtered resources.
[INFO] Copying 5 resources
[INFO] Copying 3 resources
[INFO] 
[INFO] --- maven-compiler-plugin:3.3:testCompile (default-testCompile) @ kerby-asn1 ---
[INFO] Changes detected - recompiling the module!
[INFO] Compiling 13 source files to <https://analysis.apache.org/jenkins/job/directory-kerby/org.apache.kerby$kerby-asn1/ws/target/test-classes>
[INFO] -------------------------------------------------------------
[ERROR] COMPILATION ERROR : 
[INFO] -------------------------------------------------------------
[ERROR] <https://analysis.apache.org/jenkins/job/directory-kerby/org.apache.kerby$kerby-asn1/ws/src/test/java/org/apache/kerby/asn1/Asn1CollectionTest.java>:[46,9]
cannot access java.util.concurrent.CompletableFuture
  class file for java.util.concurrent.CompletableFuture not found
[ERROR] <https://analysis.apache.org/jenkins/job/directory-kerby/org.apache.kerby$kerby-asn1/ws/src/test/java/org/apache/kerby/asn1/Asn1CollectionTest.java>:[55,9]
cannot access java.util.Optional
  class file for java.util.Optional not found
[ERROR] <https://analysis.apache.org/jenkins/job/directory-kerby/org.apache.kerby$kerby-asn1/ws/src/test/java/org/apache/kerby/asn1/Asn1CollectionTest.java>:[58,9]
cannot access java.util.OptionalDouble
  class file for java.util.OptionalDouble not found
[ERROR] <https://analysis.apache.org/jenkins/job/directory-kerby/org.apache.kerby$kerby-asn1/ws/src/test/java/org/apache/kerby/asn1/Asn1ObjectIdentifierTest.java>:[51,9]
cannot access java.util.OptionalInt
  class file for java.util.OptionalInt not found
[ERROR] <https://analysis.apache.org/jenkins/job/directory-kerby/org.apache.kerby$kerby-asn1/ws/src/test/java/org/apache/kerby/asn1/Asn1ObjectIdentifierTest.java>:[64,9]
cannot access java.util.OptionalLong
  class file for java.util.OptionalLong not found
[ERROR] <https://analysis.apache.org/jenkins/job/directory-kerby/org.apache.kerby$kerby-asn1/ws/src/test/java/org/apache/kerby/asn1/PersonnelRecordTest.java>:[72,9]
cannot access java.time.ZonedDateTime
  class file for java.time.ZonedDateTime not found
[ERROR] <https://analysis.apache.org/jenkins/job/directory-kerby/org.apache.kerby$kerby-asn1/ws/src/test/java/org/apache/kerby/asn1/PersonnelRecordTest.java>:[84,9]
cannot access java.time.LocalDateTime
  class file for java.time.LocalDateTime not found
[ERROR] <https://analysis.apache.org/jenkins/job/directory-kerby/org.apache.kerby$kerby-asn1/ws/src/test/java/org/apache/kerby/asn1/PersonnelRecordTest.java>:[86,9]
cannot access java.time.OffsetDateTime
  class file for java.time.OffsetDateTime not found
[ERROR] <https://analysis.apache.org/jenkins/job/directory-kerby/org.apache.kerby$kerby-asn1/ws/src/test/java/org/apache/kerby/asn1/PersonnelRecordTest.java>:[88,9]
cannot access java.time.OffsetTime
  class file for java.time.OffsetTime not found
[ERROR] <https://analysis.apache.org/jenkins/job/directory-kerby/org.apache.kerby$kerby-asn1/ws/src/test/java/org/apache/kerby/asn1/PersonnelRecordTest.java>:[90,9]
cannot access java.time.LocalTime
  class file for java.time.LocalTime not found
[ERROR] <https://analysis.apache.org/jenkins/job/directory-kerby/org.apache.kerby$kerby-asn1/ws/src/test/java/org/apache/kerby/asn1/PersonnelRecordTest.java>:[92,9]
cannot access java.time.LocalDate
  class file for java.time.LocalDate not found
[ERROR] <https://analysis.apache.org/jenkins/job/directory-kerby/org.apache.kerby$kerby-asn1/ws/src/test/java/org/apache/kerby/asn1/PersonnelRecordTest.java>:[94,9]
cannot access java.util.stream.Stream
  class file for java.util.stream.Stream not found
[INFO] 12 errors 
[INFO] -------------------------------------------------------------

Mime
View raw message