directory-notifications mailing list archives

Site index · List index
Message view « Date » · « Thread »
Top « Date » · « Thread »
From Apache Jenkins Server <jenk...@builds.apache.org>
Subject Build failed in Jenkins: dir-kerby #147
Date Thu, 28 Jan 2016 17:56:42 GMT
See <https://builds.apache.org/job/dir-kerby/147/changes>

Changes:

[jiajia.li] Add pkinit_identity property in kdc.conf.

[coheigea] Updating plugins

[coheigea] Fixing ldap tests following DS update

[coheigea] Dependency updates

[coheigea] More failing tests fixed

------------------------------------------
[...truncated 99 lines...]
[INFO] --- maven-pmd-plugin:3.5:check (validate) @ kerby-all ---
[INFO] 
[INFO] --- maven-checkstyle-plugin:2.17:check (validate) @ kerby-all ---
[WARNING] Failed to getClass for org.apache.maven.plugin.source.SourceJarMojo
[INFO] 
[INFO] --- maven-source-plugin:2.4:jar (attach-sources) @ kerby-all ---
[INFO] 
[INFO] --- maven-install-plugin:2.5.2:install (default-install) @ kerby-all ---
[INFO] Installing <https://builds.apache.org/job/dir-kerby/ws/pom.xml> to /home/jenkins/jenkins-slave/maven-repositories/0/org/apache/kerby/kerby-all/1.0.0-RC2-SNAPSHOT/kerby-all-1.0.0-RC2-SNAPSHOT.pom
[INFO] 
[INFO] --- maven-deploy-plugin:2.8.2:deploy (default-deploy) @ kerby-all ---
Downloading: https://repository.apache.org/content/repositories/snapshots/org/apache/kerby/kerby-all/1.0.0-RC2-SNAPSHOT/maven-metadata.xml
Downloaded: https://repository.apache.org/content/repositories/snapshots/org/apache/kerby/kerby-all/1.0.0-RC2-SNAPSHOT/maven-metadata.xml
(612 B at 1.0 KB/sec)
Uploading: https://repository.apache.org/content/repositories/snapshots/org/apache/kerby/kerby-all/1.0.0-RC2-SNAPSHOT/kerby-all-1.0.0-RC2-20160128.175624-39.pom
Uploaded: https://repository.apache.org/content/repositories/snapshots/org/apache/kerby/kerby-all/1.0.0-RC2-SNAPSHOT/kerby-all-1.0.0-RC2-20160128.175624-39.pom
(15 KB at 63.3 KB/sec)
Downloading: https://repository.apache.org/content/repositories/snapshots/org/apache/kerby/kerby-all/maven-metadata.xml
Downloaded: https://repository.apache.org/content/repositories/snapshots/org/apache/kerby/kerby-all/maven-metadata.xml
(289 B at 2.0 KB/sec)
Uploading: https://repository.apache.org/content/repositories/snapshots/org/apache/kerby/kerby-all/1.0.0-RC2-SNAPSHOT/maven-metadata.xml
Uploaded: https://repository.apache.org/content/repositories/snapshots/org/apache/kerby/kerby-all/1.0.0-RC2-SNAPSHOT/maven-metadata.xml
(612 B at 3.8 KB/sec)
Uploading: https://repository.apache.org/content/repositories/snapshots/org/apache/kerby/kerby-all/maven-metadata.xml
Uploaded: https://repository.apache.org/content/repositories/snapshots/org/apache/kerby/kerby-all/maven-metadata.xml
(289 B at 0.8 KB/sec)
[JENKINS] Archiving disabled
[INFO]                                                                         
[INFO] ------------------------------------------------------------------------
[INFO] Building Kerby-common Project 1.0.0-RC2-SNAPSHOT
[INFO] ------------------------------------------------------------------------
[INFO] 
[INFO] --- maven-clean-plugin:2.5:clean (default-clean) @ kerby-common ---
[INFO] 
[INFO] --- maven-pmd-plugin:3.5:pmd (pmd) @ kerby-common ---
[INFO] 
[INFO] --- maven-pmd-plugin:3.5:check (validate) @ kerby-common ---
[INFO] 
[INFO] --- maven-checkstyle-plugin:2.17:check (validate) @ kerby-common ---
[INFO] 
[INFO] --- maven-remote-resources-plugin:1.5:process (default) @ kerby-common ---
[INFO] 
[INFO] --- maven-site-plugin:3.4:attach-descriptor (attach-descriptor) @ kerby-common ---
[INFO] 
[INFO] --- maven-pmd-plugin:3.5:pmd (pmd) @ kerby-common ---
[INFO] 
[INFO] --- maven-pmd-plugin:3.5:check (validate) @ kerby-common ---
[INFO] 
[INFO] --- maven-checkstyle-plugin:2.17:check (validate) @ kerby-common ---
[WARNING] Failed to getClass for org.apache.maven.plugin.source.SourceJarMojo
[INFO] 
[INFO] --- maven-source-plugin:2.4:jar (attach-sources) @ kerby-common ---
[INFO] 
[INFO] --- maven-install-plugin:2.5.2:install (default-install) @ kerby-common ---
[INFO] Installing <https://builds.apache.org/job/dir-kerby/ws/kerby-common/pom.xml>
to /home/jenkins/jenkins-slave/maven-repositories/0/org/apache/kerby/kerby-common/1.0.0-RC2-SNAPSHOT/kerby-common-1.0.0-RC2-SNAPSHOT.pom
[INFO] 
[INFO] --- maven-deploy-plugin:2.8.2:deploy (default-deploy) @ kerby-common ---
Downloading: https://repository.apache.org/content/repositories/snapshots/org/apache/kerby/kerby-common/1.0.0-RC2-SNAPSHOT/maven-metadata.xml
Downloaded: https://repository.apache.org/content/repositories/snapshots/org/apache/kerby/kerby-common/1.0.0-RC2-SNAPSHOT/maven-metadata.xml
(615 B at 2.1 KB/sec)
Uploading: https://repository.apache.org/content/repositories/snapshots/org/apache/kerby/kerby-common/1.0.0-RC2-SNAPSHOT/kerby-common-1.0.0-RC2-20160128.175628-11.pom
Uploaded: https://repository.apache.org/content/repositories/snapshots/org/apache/kerby/kerby-common/1.0.0-RC2-SNAPSHOT/kerby-common-1.0.0-RC2-20160128.175628-11.pom
(2 KB at 8.1 KB/sec)
Downloading: https://repository.apache.org/content/repositories/snapshots/org/apache/kerby/kerby-common/maven-metadata.xml
Downloaded: https://repository.apache.org/content/repositories/snapshots/org/apache/kerby/kerby-common/maven-metadata.xml
(292 B at 0.8 KB/sec)
Uploading: https://repository.apache.org/content/repositories/snapshots/org/apache/kerby/kerby-common/1.0.0-RC2-SNAPSHOT/maven-metadata.xml
Uploaded: https://repository.apache.org/content/repositories/snapshots/org/apache/kerby/kerby-common/1.0.0-RC2-SNAPSHOT/maven-metadata.xml
(615 B at 3.6 KB/sec)
Uploading: https://repository.apache.org/content/repositories/snapshots/org/apache/kerby/kerby-common/maven-metadata.xml
Uploaded: https://repository.apache.org/content/repositories/snapshots/org/apache/kerby/kerby-common/maven-metadata.xml
(292 B at 1.7 KB/sec)
[JENKINS] Archiving disabled
[INFO]                                                                         
[INFO] ------------------------------------------------------------------------
[INFO] Building Kerby ASN1 Project 1.0.0-RC2-SNAPSHOT
[INFO] ------------------------------------------------------------------------
[INFO] 
[INFO] --- maven-clean-plugin:2.5:clean (default-clean) @ kerby-asn1 ---
[INFO] 
[INFO] --- maven-pmd-plugin:3.5:pmd (pmd) @ kerby-asn1 ---
[INFO] 
[INFO] --- maven-pmd-plugin:3.5:check (validate) @ kerby-asn1 ---
[INFO] 
[INFO] 
[INFO] --- maven-checkstyle-plugin:2.17:check (validate) @ kerby-asn1 ---
[INFO] 
[INFO] --- maven-remote-resources-plugin:1.5:process (default) @ kerby-asn1 ---
[INFO] 
[INFO] --- maven-resources-plugin:2.7:resources (default-resources) @ kerby-asn1 ---
[INFO] Using 'UTF-8' encoding to copy filtered resources.
[INFO] skip non existing resourceDirectory <https://builds.apache.org/job/dir-kerby/ws/kerby-common/kerby-asn1/src/main/resources>
[INFO] Copying 3 resources
[INFO] 
[INFO] --- maven-compiler-plugin:3.3:compile (default-compile) @ kerby-asn1 ---
[INFO] Changes detected - recompiling the module!
[INFO] Compiling 69 source files to <https://builds.apache.org/job/dir-kerby/ws/kerby-common/kerby-asn1/target/classes>
[INFO] <https://builds.apache.org/job/dir-kerby/ws/kerby-common/kerby-asn1/src/main/java/org/apache/kerby/asn1/type/Asn1Any.java>:
Some input files use unchecked or unsafe operations.
[INFO] <https://builds.apache.org/job/dir-kerby/ws/kerby-common/kerby-asn1/src/main/java/org/apache/kerby/asn1/type/Asn1Any.java>:
Recompile with -Xlint:unchecked for details.
[INFO] 
[INFO] --- maven-resources-plugin:2.7:testResources (default-testResources) @ kerby-asn1 ---
[INFO] Using 'UTF-8' encoding to copy filtered resources.
[INFO] Copying 5 resources
[INFO] Copying 3 resources
[INFO] 
[INFO] --- maven-compiler-plugin:3.3:testCompile (default-testCompile) @ kerby-asn1 ---
[INFO] Changes detected - recompiling the module!
[INFO] Compiling 13 source files to <https://builds.apache.org/job/dir-kerby/ws/kerby-common/kerby-asn1/target/test-classes>
[INFO] -------------------------------------------------------------
[ERROR] COMPILATION ERROR : 
[INFO] -------------------------------------------------------------
[ERROR] <https://builds.apache.org/job/dir-kerby/ws/kerby-common/kerby-asn1/src/test/java/org/apache/kerby/asn1/Asn1BooleanTest.java>:[48,9]
cannot access java.util.concurrent.CompletableFuture
  class file for java.util.concurrent.CompletableFuture not found
[ERROR] <https://builds.apache.org/job/dir-kerby/ws/kerby-common/kerby-asn1/src/test/java/org/apache/kerby/asn1/Asn1BooleanTest.java>:[68,9]
cannot access java.util.Optional
  class file for java.util.Optional not found
[ERROR] <https://builds.apache.org/job/dir-kerby/ws/kerby-common/kerby-asn1/src/test/java/org/apache/kerby/asn1/PersonnelRecordTest.java>:[72,9]
cannot access java.util.OptionalDouble
  class file for java.util.OptionalDouble not found
[ERROR] <https://builds.apache.org/job/dir-kerby/ws/kerby-common/kerby-asn1/src/test/java/org/apache/kerby/asn1/PersonnelRecordTest.java>:[84,9]
cannot access java.util.OptionalInt
  class file for java.util.OptionalInt not found
[ERROR] <https://builds.apache.org/job/dir-kerby/ws/kerby-common/kerby-asn1/src/test/java/org/apache/kerby/asn1/PersonnelRecordTest.java>:[86,9]
cannot access java.util.OptionalLong
  class file for java.util.OptionalLong not found
[ERROR] <https://builds.apache.org/job/dir-kerby/ws/kerby-common/kerby-asn1/src/test/java/org/apache/kerby/asn1/PersonnelRecordTest.java>:[88,9]
cannot access java.time.ZonedDateTime
  class file for java.time.ZonedDateTime not found
[ERROR] <https://builds.apache.org/job/dir-kerby/ws/kerby-common/kerby-asn1/src/test/java/org/apache/kerby/asn1/PersonnelRecordTest.java>:[90,9]
cannot access java.time.LocalDateTime
  class file for java.time.LocalDateTime not found
[ERROR] <https://builds.apache.org/job/dir-kerby/ws/kerby-common/kerby-asn1/src/test/java/org/apache/kerby/asn1/PersonnelRecordTest.java>:[92,9]
cannot access java.time.OffsetDateTime
  class file for java.time.OffsetDateTime not found
[ERROR] <https://builds.apache.org/job/dir-kerby/ws/kerby-common/kerby-asn1/src/test/java/org/apache/kerby/asn1/PersonnelRecordTest.java>:[94,9]
cannot access java.time.OffsetTime
  class file for java.time.OffsetTime not found
[ERROR] <https://builds.apache.org/job/dir-kerby/ws/kerby-common/kerby-asn1/src/test/java/org/apache/kerby/asn1/PersonnelRecordTest.java>:[96,9]
cannot access java.time.LocalTime
  class file for java.time.LocalTime not found
[ERROR] <https://builds.apache.org/job/dir-kerby/ws/kerby-common/kerby-asn1/src/test/java/org/apache/kerby/asn1/PersonnelRecordTest.java>:[98,9]
cannot access java.time.LocalDate
  class file for java.time.LocalDate not found
[ERROR] <https://builds.apache.org/job/dir-kerby/ws/kerby-common/kerby-asn1/src/test/java/org/apache/kerby/asn1/PersonnelRecordTest.java>:[100,9]
cannot access java.util.stream.Stream
  class file for java.util.stream.Stream not found
[INFO] 12 errors 
[INFO] -------------------------------------------------------------
[JENKINS] Archiving disabled
[INFO] ------------------------------------------------------------------------
[INFO] Reactor Summary:
[INFO] 
[INFO] Apache Kerby Project .............................. SUCCESS [10.617s]
[INFO] Kerby-common Project .............................. SUCCESS [3.065s]
[INFO] Kerby ASN1 Project ................................ FAILURE [10.763s]
[INFO] Kerby Config ...................................... SKIPPED
[INFO] Kerby Util ........................................ SKIPPED
[INFO] Kerby PKIX Project ................................ SKIPPED
[INFO] Kerby-kerb Project ................................ SKIPPED
[INFO] Kerby-kerb core ................................... SKIPPED
[INFO] Kerby-kerb Crypto ................................. SKIPPED
[INFO] Kerby-kerb Common ................................. SKIPPED
[INFO] Kerby-kerb Util ................................... SKIPPED
[INFO] Kerby-kerb Identity ............................... SKIPPED
[INFO] Kerby-kerb Identity Test .......................... SKIPPED
[INFO] Kerby-kerb Client ................................. SKIPPED
[INFO] Kerby-kerb Server ................................. SKIPPED
[INFO] Kerby-kerb Admin .................................. SKIPPED
[INFO] Kerb Simple Kdc ................................... SKIPPED
[INFO] Kerb Kdc Test ..................................... SKIPPED
[INFO] Kerby providers ................................... SKIPPED
[INFO] Token provider .................................... SKIPPED
[INFO] Kerb Integration Test ............................. SKIPPED
[INFO] Kerby-kerb client api all ......................... SKIPPED
[INFO] Kerby-kerb server all ............................. SKIPPED
[INFO] Kerby KDC Server .................................. SKIPPED
[INFO] Kdc Tool Project .................................. SKIPPED
[INFO] Client Tool ....................................... SKIPPED
[INFO] KDC Tool .......................................... SKIPPED
[INFO] Kerby Backend ..................................... SKIPPED
[INFO] Json identity backend ............................. SKIPPED
[INFO] Zookeeper identity backend ........................ SKIPPED
[INFO] Ldap identity backend ............................. SKIPPED
[INFO] Kerby Kdc Test .................................... SKIPPED
[INFO] Mavibot based backend ............................. SKIPPED
[INFO] Kerby Distribution ................................ SKIPPED
[INFO] KDC Dist .......................................... SKIPPED
[INFO] Tool Dist ......................................... SKIPPED
[INFO] Kerby benchmark ................................... SKIPPED
[INFO] ------------------------------------------------------------------------
[INFO] BUILD FAILURE
[INFO] ------------------------------------------------------------------------
[INFO] Total time: 27.256s
[INFO] Finished at: Thu Jan 28 17:56:41 UTC 2016
[INFO] Final Memory: 43M/450M
[INFO] ------------------------------------------------------------------------
[JENKINS] Archiving disabled
[JENKINS] Archiving disabled
[JENKINS] Archiving disabled
[JENKINS] Archiving disabled
[JENKINS] Archiving disabled
[JENKINS] Archiving disabled
[JENKINS] Archiving disabled
[JENKINS] Archiving disabled
[JENKINS] Archiving disabled
[JENKINS] Archiving disabled
[JENKINS] Archiving disabled
[JENKINS] Archiving disabled
[JENKINS] Archiving disabled
[JENKINS] Archiving disabled
[JENKINS] Archiving disabled
[JENKINS] Archiving disabled
[JENKINS] Archiving disabled
[JENKINS] Archiving disabled
[JENKINS] Archiving disabled
[JENKINS] Archiving disabled
[JENKINS] Archiving disabled
[JENKINS] Archiving disabled
[JENKINS] Archiving disabled
[JENKINS] Archiving disabled
[JENKINS] Archiving disabled
[JENKINS] Archiving disabled
[JENKINS] Archiving disabled
[JENKINS] Archiving disabled
[JENKINS] Archiving disabled
[JENKINS] Archiving disabled
[JENKINS] Archiving disabled
[JENKINS] Archiving disabled
[JENKINS] Archiving disabled
[JENKINS] Archiving disabled
[JENKINS] Archiving disabled
[JENKINS] Archiving disabled
[JENKINS] Archiving disabled
Waiting for Jenkins to finish collecting data[ERROR] Failed to execute goal org.apache.maven.plugins:maven-compiler-plugin:3.3:testCompile
(default-testCompile) on project kerby-asn1: Compilation failure: Compilation failure:
[ERROR] <https://builds.apache.org/job/dir-kerby/ws/kerby-common/kerby-asn1/src/test/java/org/apache/kerby/asn1/Asn1BooleanTest.java>:[48,9]
cannot access java.util.concurrent.CompletableFuture
[ERROR] class file for java.util.concurrent.CompletableFuture not found
[ERROR] <https://builds.apache.org/job/dir-kerby/ws/kerby-common/kerby-asn1/src/test/java/org/apache/kerby/asn1/Asn1BooleanTest.java>:[68,9]
cannot access java.util.Optional
[ERROR] class file for java.util.Optional not found
[ERROR] <https://builds.apache.org/job/dir-kerby/ws/kerby-common/kerby-asn1/src/test/java/org/apache/kerby/asn1/PersonnelRecordTest.java>:[72,9]
cannot access java.util.OptionalDouble
[ERROR] class file for java.util.OptionalDouble not found
[ERROR] <https://builds.apache.org/job/dir-kerby/ws/kerby-common/kerby-asn1/src/test/java/org/apache/kerby/asn1/PersonnelRecordTest.java>:[84,9]
cannot access java.util.OptionalInt
[ERROR] class file for java.util.OptionalInt not found
[ERROR] <https://builds.apache.org/job/dir-kerby/ws/kerby-common/kerby-asn1/src/test/java/org/apache/kerby/asn1/PersonnelRecordTest.java>:[86,9]
cannot access java.util.OptionalLong
[ERROR] class file for java.util.OptionalLong not found
[ERROR] <https://builds.apache.org/job/dir-kerby/ws/kerby-common/kerby-asn1/src/test/java/org/apache/kerby/asn1/PersonnelRecordTest.java>:[88,9]
cannot access java.time.ZonedDateTime
[ERROR] class file for java.time.ZonedDateTime not found
[ERROR] <https://builds.apache.org/job/dir-kerby/ws/kerby-common/kerby-asn1/src/test/java/org/apache/kerby/asn1/PersonnelRecordTest.java>:[90,9]
cannot access java.time.LocalDateTime
[ERROR] class file for java.time.LocalDateTime not found
[ERROR] <https://builds.apache.org/job/dir-kerby/ws/kerby-common/kerby-asn1/src/test/java/org/apache/kerby/asn1/PersonnelRecordTest.java>:[92,9]
cannot access java.time.OffsetDateTime
[ERROR] class file for java.time.OffsetDateTime not found
[ERROR] <https://builds.apache.org/job/dir-kerby/ws/kerby-common/kerby-asn1/src/test/java/org/apache/kerby/asn1/PersonnelRecordTest.java>:[94,9]
cannot access java.time.OffsetTime
[ERROR] class file for java.time.OffsetTime not found
[ERROR] <https://builds.apache.org/job/dir-kerby/ws/kerby-common/kerby-asn1/src/test/java/org/apache/kerby/asn1/PersonnelRecordTest.java>:[96,9]
cannot access java.time.LocalTime
[ERROR] class file for java.time.LocalTime not found
[ERROR] <https://builds.apache.org/job/dir-kerby/ws/kerby-common/kerby-asn1/src/test/java/org/apache/kerby/asn1/PersonnelRecordTest.java>:[98,9]
cannot access java.time.LocalDate
[ERROR] class file for java.time.LocalDate not found
[ERROR] <https://builds.apache.org/job/dir-kerby/ws/kerby-common/kerby-asn1/src/test/java/org/apache/kerby/asn1/PersonnelRecordTest.java>:[100,9]
cannot access java.util.stream.Stream
[ERROR] class file for java.util.stream.Stream not found
[ERROR] -> [Help 1]
[ERROR] 
[ERROR] To see the full stack trace of the errors, re-run Maven with the -e switch.
[ERROR] Re-run Maven using the -X switch to enable full debug logging.
[ERROR] 
[ERROR] For more information about the errors and possible solutions, please read the following
articles:
[ERROR] [Help 1] http://cwiki.apache.org/confluence/display/MAVEN/MojoFailureException
[ERROR] 
[ERROR] After correcting the problems, you can resume the build with the command
[ERROR]   mvn <goals> -rf :kerby-asn1

channel stopped

Mime
View raw message