directory-notifications mailing list archives

Site index · List index
Message view « Date » · « Thread »
Top « Date » · « Thread »
From gmcdon...@apache.org
Subject Build failed in Jenkins: directory-kerby #225
Date Mon, 07 Dec 2015 06:32:17 GMT
See <https://analysis.apache.org/jenkins/job/directory-kerby/225/changes>

Changes:

[kai.zheng] Consolidate the relevant hex-bytes converting utilities for more tests

[kai.zheng] Fixed two style issues

[linchen7] DIRKRB-484 Refactor configuration items for TokenPreauth in KDC side

[kai.zheng] ASN1. Use Tag class to simplify

[kai.zheng] ASN1. Getting rid of LimitedByteBuffer, use ByteBuffer directly

[kai.zheng] ASN1. Added Asn1Util for those static functions in Asn1Object

[kai.zheng] ASN1. Simplified a bit some codes for collection types

[coheigea] Remove logging output from console during build

[coheigea] Minor grammatical fix

[kai.zheng] ASN1. Introduced Asn1Constructed for support of some primitive types

[kai.zheng] DIRKRB-486. Initial work for the support, introducing toStr() method

[kai.zheng] Renamed Asn1EnumType.

[jiajia.li] DIRKRB-486 Dumping support for built-in ASN1 types and user defined

[kai.zheng] ASN1. Allowing to return a header

[kai.zheng] DIRKRB-485. An ASN1 dumping utility

[kai.zheng] ASN1. Avoiding the clone of field info array

[kai.zheng] ASN1. Refined dumping support codes for user defined types

[kai.zheng] ASN1. Renamed some classes to be consistent

[kai.zheng] DIRKRB-487. Introduced the Asn1 API class

[kai.zheng] ASN1. Consolidate utility classes into the util package

[jiajia.li] Refine some code of pkinit.

------------------------------------------
[...truncated 536 lines...]
[INFO] --- maven-pmd-plugin:3.4:check (validate) @ kerby-tool ---
[INFO] 
[INFO] --- maven-checkstyle-plugin:2.15:check (validate) @ kerby-tool ---
[INFO] 
[INFO] --- maven-remote-resources-plugin:1.5:process (default) @ kerby-tool ---
[INFO] 
[INFO] --- maven-site-plugin:3.4:attach-descriptor (attach-descriptor) @ kerby-tool ---
[INFO] 
[INFO] --- maven-pmd-plugin:3.4:pmd (pmd) @ kerby-tool ---
[INFO] 
[INFO] --- maven-pmd-plugin:3.4:check (validate) @ kerby-tool ---
[INFO] 
[INFO] --- maven-checkstyle-plugin:2.15:check (validate) @ kerby-tool ---
[WARNING] Failed to getClass for org.apache.maven.plugin.source.SourceJarMojo
[INFO] 
[INFO] --- maven-source-plugin:2.4:jar (attach-sources) @ kerby-tool ---
[INFO] 
[INFO] --- maven-install-plugin:2.5.2:install (default-install) @ kerby-tool ---
[INFO] Installing <https://analysis.apache.org/jenkins/job/directory-kerby/ws/kerby-tool/pom.xml>
to /x1/jenkins/mvn-repo/org/apache/kerby/kerby-tool/1.0.0-RC2-SNAPSHOT/kerby-tool-1.0.0-RC2-SNAPSHOT.pom
[INFO]                                                                         
[INFO] ------------------------------------------------------------------------
[INFO] Skipping Client Tool
[INFO] This project has been banned from the build due to previous failures.
[INFO] ------------------------------------------------------------------------
[INFO]                                                                         
[INFO] ------------------------------------------------------------------------
[INFO] Skipping KDC Tool
[INFO] This project has been banned from the build due to previous failures.
[INFO] ------------------------------------------------------------------------
[INFO]                                                                         
[INFO] ------------------------------------------------------------------------
[INFO] Building Kerby Backend 1.0.0-RC2-SNAPSHOT
[INFO] ------------------------------------------------------------------------
[INFO] 
[INFO] --- maven-clean-plugin:2.5:clean (default-clean) @ kerby-backend ---
[INFO] 
[INFO] --- maven-pmd-plugin:3.4:pmd (pmd) @ kerby-backend ---
[INFO] 
[INFO] --- maven-pmd-plugin:3.4:check (validate) @ kerby-backend ---
[INFO] 
[INFO] --- maven-checkstyle-plugin:2.15:check (validate) @ kerby-backend ---
[INFO] 
[INFO] --- maven-remote-resources-plugin:1.5:process (default) @ kerby-backend ---
[INFO] 
[INFO] --- maven-site-plugin:3.4:attach-descriptor (attach-descriptor) @ kerby-backend ---
[INFO] 
[INFO] --- maven-pmd-plugin:3.4:pmd (pmd) @ kerby-backend ---
[INFO] 
[INFO] --- maven-pmd-plugin:3.4:check (validate) @ kerby-backend ---
[INFO] 
[INFO] --- maven-checkstyle-plugin:2.15:check (validate) @ kerby-backend ---
[WARNING] Failed to getClass for org.apache.maven.plugin.source.SourceJarMojo
[INFO] 
[INFO] --- maven-source-plugin:2.4:jar (attach-sources) @ kerby-backend ---
[INFO] 
[INFO] --- maven-install-plugin:2.5.2:install (default-install) @ kerby-backend ---
[INFO] Installing <https://analysis.apache.org/jenkins/job/directory-kerby/ws/kerby-backend/pom.xml>
to /x1/jenkins/mvn-repo/org/apache/kerby/kerby-backend/1.0.0-RC2-SNAPSHOT/kerby-backend-1.0.0-RC2-SNAPSHOT.pom
[INFO]                                                                         
[INFO] ------------------------------------------------------------------------
[INFO] Skipping Json identity backend
[INFO] This project has been banned from the build due to previous failures.
[INFO] ------------------------------------------------------------------------
[INFO]                                                                         
[INFO] ------------------------------------------------------------------------
[INFO] Skipping Zookeeper identity backend
[INFO] This project has been banned from the build due to previous failures.
[INFO] ------------------------------------------------------------------------
[INFO]                                                                         
[INFO] ------------------------------------------------------------------------
[INFO] Skipping Ldap identity backend
[INFO] This project has been banned from the build due to previous failures.
[INFO] ------------------------------------------------------------------------
[INFO]                                                                         
[INFO] ------------------------------------------------------------------------
[INFO] Skipping Kerby Kdc Test
[INFO] This project has been banned from the build due to previous failures.
[INFO] ------------------------------------------------------------------------
[INFO]                                                                         
[INFO] ------------------------------------------------------------------------
[INFO] Skipping Mavibot based backend
[INFO] This project has been banned from the build due to previous failures.
[INFO] ------------------------------------------------------------------------
[INFO]                                                                         
[INFO] ------------------------------------------------------------------------
[INFO] Building Kerby Distribution 1.0.0-RC2-SNAPSHOT
[INFO] ------------------------------------------------------------------------
[INFO] 
[INFO] --- maven-clean-plugin:2.5:clean (default-clean) @ kerby-dist ---
[INFO] 
[INFO] --- maven-pmd-plugin:3.4:pmd (pmd) @ kerby-dist ---
[INFO] 
[INFO] --- maven-pmd-plugin:3.4:check (validate) @ kerby-dist ---
[INFO] 
[INFO] --- maven-checkstyle-plugin:2.15:check (validate) @ kerby-dist ---
[INFO] 
[INFO] --- maven-remote-resources-plugin:1.5:process (default) @ kerby-dist ---
[INFO] 
[INFO] --- maven-site-plugin:3.4:attach-descriptor (attach-descriptor) @ kerby-dist ---
[INFO] 
[INFO] --- maven-pmd-plugin:3.4:pmd (pmd) @ kerby-dist ---
[INFO] 
[INFO] --- maven-pmd-plugin:3.4:check (validate) @ kerby-dist ---
[INFO] 
[INFO] --- maven-checkstyle-plugin:2.15:check (validate) @ kerby-dist ---
[WARNING] Failed to getClass for org.apache.maven.plugin.source.SourceJarMojo
[INFO] 
[INFO] --- maven-source-plugin:2.4:jar (attach-sources) @ kerby-dist ---
[INFO] 
[INFO] --- maven-install-plugin:2.5.2:install (default-install) @ kerby-dist ---
[INFO] Installing <https://analysis.apache.org/jenkins/job/directory-kerby/ws/kerby-dist/pom.xml>
to /x1/jenkins/mvn-repo/org/apache/kerby/kerby-dist/1.0.0-RC2-SNAPSHOT/kerby-dist-1.0.0-RC2-SNAPSHOT.pom
[INFO]                                                                         
[INFO] ------------------------------------------------------------------------
[INFO] Skipping KDC Dist
[INFO] This project has been banned from the build due to previous failures.
[INFO] ------------------------------------------------------------------------
[INFO]                                                                         
[INFO] ------------------------------------------------------------------------
[INFO] Skipping Tool Dist
[INFO] This project has been banned from the build due to previous failures.
[INFO] ------------------------------------------------------------------------
[INFO]                                                                         
[INFO] ------------------------------------------------------------------------
[INFO] Skipping Kerby benchmark
[INFO] This project has been banned from the build due to previous failures.
[INFO] ------------------------------------------------------------------------
[INFO] ------------------------------------------------------------------------
[INFO] Reactor Summary:
[INFO] 
[INFO] Apache Kerby Project .............................. SUCCESS [7.444s]
[INFO] Kerby ASN1 Project ................................ SUCCESS [25.613s]
[INFO] Kerby Util ........................................ SUCCESS [6.356s]
[INFO] Third Party Projects .............................. SUCCESS [2.984s]
[INFO] not-yet-commons-ssl ............................... FAILURE [4.779s]
[INFO] Kerby Config ...................................... SUCCESS [4.816s]
[INFO] Kerby PKIX Project ................................ FAILURE [4.020s]
[INFO] Kerby-kerb Project ................................ SUCCESS [1.684s]
[INFO] Kerby-kerb core ................................... SKIPPED
[INFO] Kerby-kerb Crypto ................................. SKIPPED
[INFO] Kerby-kerb Util ................................... SKIPPED
[INFO] kerby-kerb-coreTest ............................... SKIPPED
[INFO] Kerby-kerb Common ................................. SKIPPED
[INFO] Kerby-kerb Identity ............................... SKIPPED
[INFO] Kerby-kerb Identity Test .......................... SKIPPED
[INFO] Kerby-kerb Client ................................. SKIPPED
[INFO] Kerby-kerb Server ................................. SKIPPED
[INFO] Kerby-kerb Admin .................................. SKIPPED
[INFO] Kerb Simple Kdc ................................... SKIPPED
[INFO] Kerb Kdc Test ..................................... SKIPPED
[INFO] Kerby providers ................................... SUCCESS [1.303s]
[INFO] Token provider .................................... SKIPPED
[INFO] Kerb Integration Test ............................. SKIPPED
[INFO] Kerby-kerb client api all ......................... SKIPPED
[INFO] Kerby-kerb server all ............................. SKIPPED
[INFO] Kerby KDC Server .................................. SKIPPED
[INFO] Pki provider ...................................... SKIPPED
[INFO] Kdc Tool Project .................................. SUCCESS [1.269s]
[INFO] Client Tool ....................................... SKIPPED
[INFO] KDC Tool .......................................... SKIPPED
[INFO] Kerby Backend ..................................... SUCCESS [1.169s]
[INFO] Json identity backend ............................. SKIPPED
[INFO] Zookeeper identity backend ........................ SKIPPED
[INFO] Ldap identity backend ............................. SKIPPED
[INFO] Kerby Kdc Test .................................... SKIPPED
[INFO] Mavibot based backend ............................. SKIPPED
[INFO] Kerby Distribution ................................ SUCCESS [1.555s]
[INFO] KDC Dist .......................................... SKIPPED
[INFO] Tool Dist ......................................... SKIPPED
[INFO] Kerby benchmark ................................... SKIPPED
[INFO] ------------------------------------------------------------------------
[INFO] BUILD FAILURE
[INFO] ------------------------------------------------------------------------
[INFO] Total time: 1:07.905s
[INFO] Finished at: Mon Dec 07 06:32:14 UTC 2015
[INFO] Final Memory: 42M/304M
[INFO] ------------------------------------------------------------------------
[ERROR] Failed to execute goal org.apache.maven.plugins:maven-compiler-plugin:3.1:compile
(default-compile) on project not-yet-commons-ssl: Compilation failure: Compilation failure:
[ERROR] <https://analysis.apache.org/jenkins/job/directory-kerby/ws/3rdparty/not-yet-commons-ssl/src/main/java/org/apache/commons/ssl/Asn1PkcsUtil.java>:[28,29]
cannot find symbol
[ERROR] symbol:   class Asn1InputBuffer
[ERROR] location: package org.apache.kerby.asn1
[ERROR] <https://analysis.apache.org/jenkins/job/directory-kerby/ws/3rdparty/not-yet-commons-ssl/src/main/java/org/apache/commons/ssl/Asn1PkcsUtil.java>:[59,9]
cannot find symbol
[ERROR] symbol:   class Asn1InputBuffer
[ERROR] location: class org.apache.commons.ssl.Asn1PkcsUtil
[ERROR] <https://analysis.apache.org/jenkins/job/directory-kerby/ws/3rdparty/not-yet-commons-ssl/src/main/java/org/apache/commons/ssl/Asn1PkcsUtil.java>:[59,35]
cannot find symbol
[ERROR] symbol:   class Asn1InputBuffer
[ERROR] location: class org.apache.commons.ssl.Asn1PkcsUtil
[ERROR] <https://analysis.apache.org/jenkins/job/directory-kerby/ws/3rdparty/not-yet-commons-ssl/src/main/java/org/apache/commons/ssl/Asn1PkcsUtil.java>:[79,49]
incompatible types
[ERROR] required: java.util.List<org.apache.kerby.asn1.type.Asn1Item>
[ERROR] found:    java.util.List<org.apache.kerby.asn1.type.Asn1Type>
[ERROR] -> [Help 1]
[ERROR] Failed to execute goal org.apache.maven.plugins:maven-pmd-plugin:3.4:check (validate)
on project kerby-pkix: You have 1 PMD violation. For more details see: <https://analysis.apache.org/jenkins/job/directory-kerby/ws/kerby-pkix/target/pmd.xml>
-> [Help 1]
[ERROR] 
[ERROR] To see the full stack trace of the errors, re-run Maven with the -e switch.
[ERROR] Re-run Maven using the -X switch to enable full debug logging.
[ERROR] 
[ERROR] For more information about the errors and possible solutions, please read the following
articles:
[ERROR] [Help 1] http://cwiki.apache.org/confluence/display/MAVEN/MojoFailureException
[ERROR] 
[ERROR] After correcting the problems, you can resume the build with the command
[ERROR]   mvn <goals> -rf :not-yet-commons-ssl
[JENKINS] Archiving <https://analysis.apache.org/jenkins/job/directory-kerby/ws/kerby-backend/ldap-backend/pom.xml>
to org.apache.kerby/ldap-backend/1.0.0-RC2-SNAPSHOT/ldap-backend-1.0.0-RC2-SNAPSHOT.pom
[JENKINS] Archiving <https://analysis.apache.org/jenkins/job/directory-kerby/ws/kerby-backend/json-backend/pom.xml>
to org.apache.kerby/json-backend/1.0.0-RC2-SNAPSHOT/json-backend-1.0.0-RC2-SNAPSHOT.pom
[JENKINS] Archiving <https://analysis.apache.org/jenkins/job/directory-kerby/ws/kerby-pkix/pom.xml>
to org.apache.kerby/kerby-pkix/1.0.0-RC2-SNAPSHOT/kerby-pkix-1.0.0-RC2-SNAPSHOT.pom
[JENKINS] Archiving <https://analysis.apache.org/jenkins/job/directory-kerby/ws/kerby-kdc-test/pom.xml>
to org.apache.kerby/kerby-kdc-test/1.0.0-RC2-SNAPSHOT/kerby-kdc-test-1.0.0-RC2-SNAPSHOT.pom
[JENKINS] Archiving <https://analysis.apache.org/jenkins/job/directory-kerby/ws/kerby-kerb/kerb-util/pom.xml>
to org.apache.kerby/kerb-util/1.0.0-RC2-SNAPSHOT/kerb-util-1.0.0-RC2-SNAPSHOT.pom
[JENKINS] Archiving <https://analysis.apache.org/jenkins/job/directory-kerby/ws/kerby-kerb/kerb-crypto/pom.xml>
to org.apache.kerby/kerb-crypto/1.0.0-RC2-SNAPSHOT/kerb-crypto-1.0.0-RC2-SNAPSHOT.pom
[JENKINS] Archiving <https://analysis.apache.org/jenkins/job/directory-kerby/ws/kerby-provider/token-provider/pom.xml>
to org.apache.kerby/token-provider/1.0.0-RC2-SNAPSHOT/token-provider-1.0.0-RC2-SNAPSHOT.pom
[JENKINS] Archiving <https://analysis.apache.org/jenkins/job/directory-kerby/ws/kerby-kerb/kerb-client-api-all/pom.xml>
to org.apache.kerby/kerb-client-api-all/1.0.0-RC2-SNAPSHOT/kerb-client-api-all-1.0.0-RC2-SNAPSHOT.pom
[JENKINS] Archiving <https://analysis.apache.org/jenkins/job/directory-kerby/ws/kerby-tool/client-tool/pom.xml>
to org.apache.kerby/client-tool/1.0.0-RC2-SNAPSHOT/client-tool-1.0.0-RC2-SNAPSHOT.pom
[JENKINS] Archiving <https://analysis.apache.org/jenkins/job/directory-kerby/ws/kerby-dist/pom.xml>
to org.apache.kerby/kerby-dist/1.0.0-RC2-SNAPSHOT/kerby-dist-1.0.0-RC2-SNAPSHOT.pom
[JENKINS] Archiving <https://analysis.apache.org/jenkins/job/directory-kerby/ws/3rdparty/pom.xml>
to org.apache.kerby/3rdparty/1.0.0-RC2-SNAPSHOT/3rdparty-1.0.0-RC2-SNAPSHOT.pom
[JENKINS] Archiving <https://analysis.apache.org/jenkins/job/directory-kerby/ws/kerby-kerb/kerb-server/pom.xml>
to org.apache.kerby/kerb-server/1.0.0-RC2-SNAPSHOT/kerb-server-1.0.0-RC2-SNAPSHOT.pom
[JENKINS] Archiving <https://analysis.apache.org/jenkins/job/directory-kerby/ws/kerby-tool/kdc-tool/pom.xml>
to org.apache.kerby/kdc-tool/1.0.0-RC2-SNAPSHOT/kdc-tool-1.0.0-RC2-SNAPSHOT.pom
[JENKINS] Archiving <https://analysis.apache.org/jenkins/job/directory-kerby/ws/kerby-dist/kdc-dist/pom.xml>
to org.apache.kerby/kdc-dist/1.0.0-RC2-SNAPSHOT/kdc-dist-1.0.0-RC2-SNAPSHOT.pom
[JENKINS] Archiving <https://analysis.apache.org/jenkins/job/directory-kerby/ws/kerby-asn1/pom.xml>
to org.apache.kerby/kerby-asn1/1.0.0-RC2-SNAPSHOT/kerby-asn1-1.0.0-RC2-SNAPSHOT.pom
[JENKINS] Archiving <https://analysis.apache.org/jenkins/job/directory-kerby/ws/kerby-asn1/target/kerby-asn1-1.0.0-RC2-SNAPSHOT.jar>
to org.apache.kerby/kerby-asn1/1.0.0-RC2-SNAPSHOT/kerby-asn1-1.0.0-RC2-SNAPSHOT.jar
[JENKINS] Archiving <https://analysis.apache.org/jenkins/job/directory-kerby/ws/kerby-asn1/target/kerby-asn1-1.0.0-RC2-SNAPSHOT-sources.jar>
to org.apache.kerby/kerby-asn1/1.0.0-RC2-SNAPSHOT/kerby-asn1-1.0.0-RC2-SNAPSHOT-sources.jar
[JENKINS] Archiving <https://analysis.apache.org/jenkins/job/directory-kerby/ws/benchmark/pom.xml>
to org.apache.kerby/benchmark/1.0.0-RC2-SNAPSHOT/benchmark-1.0.0-RC2-SNAPSHOT.pom
[JENKINS] Archiving <https://analysis.apache.org/jenkins/job/directory-kerby/ws/kerby-provider/pom.xml>
to org.apache.kerby/kerby-provider/1.0.0-RC2-SNAPSHOT/kerby-provider-1.0.0-RC2-SNAPSHOT.pom
[JENKINS] Archiving <https://analysis.apache.org/jenkins/job/directory-kerby/ws/kerby-kerb/kerb-admin/pom.xml>
to org.apache.kerby/kerb-admin/1.0.0-RC2-SNAPSHOT/kerb-admin-1.0.0-RC2-SNAPSHOT.pom
[JENKINS] Archiving <https://analysis.apache.org/jenkins/job/directory-kerby/ws/kerby-kerb/integration-test/pom.xml>
to org.apache.kerby/integration-test/1.0.0-RC2-SNAPSHOT/integration-test-1.0.0-RC2-SNAPSHOT.pom
[JENKINS] Archiving <https://analysis.apache.org/jenkins/job/directory-kerby/ws/kerby-kerb/kerb-simplekdc/pom.xml>
to org.apache.kerby/kerb-simplekdc/1.0.0-RC2-SNAPSHOT/kerb-simplekdc-1.0.0-RC2-SNAPSHOT.pom
[JENKINS] Archiving <https://analysis.apache.org/jenkins/job/directory-kerby/ws/kerby-kerb/kerb-core-test/pom.xml>
to org.apache.kerby/kerb-core-test/1.0.0-RC2-SNAPSHOT/kerb-core-test-1.0.0-RC2-SNAPSHOT.pom
[JENKINS] Archiving <https://analysis.apache.org/jenkins/job/directory-kerby/ws/3rdparty/not-yet-commons-ssl/pom.xml>
to org.apache.kerby/not-yet-commons-ssl/1.0.0-RC2-SNAPSHOT/not-yet-commons-ssl-1.0.0-RC2-SNAPSHOT.pom
[JENKINS] Archiving <https://analysis.apache.org/jenkins/job/directory-kerby/ws/kerby-kerb/kerb-client/pom.xml>
to org.apache.kerby/kerb-client/1.0.0-RC2-SNAPSHOT/kerb-client-1.0.0-RC2-SNAPSHOT.pom
[JENKINS] Archiving <https://analysis.apache.org/jenkins/job/directory-kerby/ws/kerby-kerb/pom.xml>
to org.apache.kerby/kerby-kerb/1.0.0-RC2-SNAPSHOT/kerby-kerb-1.0.0-RC2-SNAPSHOT.pom
[JENKINS] Archiving <https://analysis.apache.org/jenkins/job/directory-kerby/ws/kerby-backend/mavibot-backend/pom.xml>
to org.apache.kerby/mavibot-backend/1.0.0-RC2-SNAPSHOT/mavibot-backend-1.0.0-RC2-SNAPSHOT.pom
[JENKINS] Archiving <https://analysis.apache.org/jenkins/job/directory-kerby/ws/kerby-backend/zookeeper-backend/pom.xml>
to org.apache.kerby/zookeeper-backend/1.0.0-RC2-SNAPSHOT/zookeeper-backend-1.0.0-RC2-SNAPSHOT.pom
[JENKINS] Archiving <https://analysis.apache.org/jenkins/job/directory-kerby/ws/kerby-config/pom.xml>
to org.apache.kerby/kerby-config/1.0.0-RC2-SNAPSHOT/kerby-config-1.0.0-RC2-SNAPSHOT.pom
[JENKINS] Archiving <https://analysis.apache.org/jenkins/job/directory-kerby/ws/kerby-config/target/kerby-config-1.0.0-RC2-SNAPSHOT.jar>
to org.apache.kerby/kerby-config/1.0.0-RC2-SNAPSHOT/kerby-config-1.0.0-RC2-SNAPSHOT.jar
[JENKINS] Archiving <https://analysis.apache.org/jenkins/job/directory-kerby/ws/kerby-config/target/kerby-config-1.0.0-RC2-SNAPSHOT-sources.jar>
to org.apache.kerby/kerby-config/1.0.0-RC2-SNAPSHOT/kerby-config-1.0.0-RC2-SNAPSHOT-sources.jar
[JENKINS] Archiving <https://analysis.apache.org/jenkins/job/directory-kerby/ws/kerby-util/pom.xml>
to org.apache.kerby/kerby-util/1.0.0-RC2-SNAPSHOT/kerby-util-1.0.0-RC2-SNAPSHOT.pom
[JENKINS] Archiving <https://analysis.apache.org/jenkins/job/directory-kerby/ws/kerby-util/target/kerby-util-1.0.0-RC2-SNAPSHOT.jar>
to org.apache.kerby/kerby-util/1.0.0-RC2-SNAPSHOT/kerby-util-1.0.0-RC2-SNAPSHOT.jar
[JENKINS] Archiving <https://analysis.apache.org/jenkins/job/directory-kerby/ws/kerby-util/target/kerby-util-1.0.0-RC2-SNAPSHOT-sources.jar>
to org.apache.kerby/kerby-util/1.0.0-RC2-SNAPSHOT/kerby-util-1.0.0-RC2-SNAPSHOT-sources.jar
[JENKINS] Archiving <https://analysis.apache.org/jenkins/job/directory-kerby/ws/kerby-kerb/kerb-common/pom.xml>
to org.apache.kerby/kerb-common/1.0.0-RC2-SNAPSHOT/kerb-common-1.0.0-RC2-SNAPSHOT.pom
[JENKINS] Archiving <https://analysis.apache.org/jenkins/job/directory-kerby/ws/kerby-kerb/kerb-core/pom.xml>
to org.apache.kerby/kerb-core/1.0.0-RC2-SNAPSHOT/kerb-core-1.0.0-RC2-SNAPSHOT.pom
[JENKINS] Archiving <https://analysis.apache.org/jenkins/job/directory-kerby/ws/kerby-kdc/pom.xml>
to org.apache.kerby/kerby-kdc/1.0.0-RC2-SNAPSHOT/kerby-kdc-1.0.0-RC2-SNAPSHOT.pom
[JENKINS] Archiving <https://analysis.apache.org/jenkins/job/directory-kerby/ws/kerby-kerb/kerb-identity/pom.xml>
to org.apache.kerby/kerb-identity/1.0.0-RC2-SNAPSHOT/kerb-identity-1.0.0-RC2-SNAPSHOT.pom
[JENKINS] Archiving <https://analysis.apache.org/jenkins/job/directory-kerby/ws/kerby-backend/pom.xml>
to org.apache.kerby/kerby-backend/1.0.0-RC2-SNAPSHOT/kerby-backend-1.0.0-RC2-SNAPSHOT.pom
[JENKINS] Archiving <https://analysis.apache.org/jenkins/job/directory-kerby/ws/kerby-tool/pom.xml>
to org.apache.kerby/kerby-tool/1.0.0-RC2-SNAPSHOT/kerby-tool-1.0.0-RC2-SNAPSHOT.pom
[JENKINS] Archiving <https://analysis.apache.org/jenkins/job/directory-kerby/ws/pom.xml>
to org.apache.kerby/kerby-all/1.0.0-RC2-SNAPSHOT/kerby-all-1.0.0-RC2-SNAPSHOT.pom
[JENKINS] Archiving <https://analysis.apache.org/jenkins/job/directory-kerby/ws/kerby-kerb/kerb-kdc-test/pom.xml>
to org.apache.kerby/kerb-kdc-test/1.0.0-RC2-SNAPSHOT/kerb-kdc-test-1.0.0-RC2-SNAPSHOT.pom
[JENKINS] Archiving <https://analysis.apache.org/jenkins/job/directory-kerby/ws/kerby-dist/tool-dist/pom.xml>
to org.apache.kerby/tool-dist/1.0.0-RC2-SNAPSHOT/tool-dist-1.0.0-RC2-SNAPSHOT.pom
[JENKINS] Archiving <https://analysis.apache.org/jenkins/job/directory-kerby/ws/kerby-provider/pki-provider/pom.xml>
to org.apache.kerby/pki-provider/1.0.0-RC2-SNAPSHOT/pki-provider-1.0.0-RC2-SNAPSHOT.pom
[JENKINS] Archiving <https://analysis.apache.org/jenkins/job/directory-kerby/ws/kerby-kerb/kerb-identity-test/pom.xml>
to org.apache.kerby/kerb-identity-test/1.0.0-RC2-SNAPSHOT/kerb-identity-test-1.0.0-RC2-SNAPSHOT.pom
[JENKINS] Archiving <https://analysis.apache.org/jenkins/job/directory-kerby/ws/kerby-kerb/kerb-server-api-all/pom.xml>
to org.apache.kerby/kerb-server-api-all/1.0.0-RC2-SNAPSHOT/kerb-server-api-all-1.0.0-RC2-SNAPSHOT.pom
Sending e-mails to: notifications@directory.apache.org
Sending e-mails to: notifications@directory.apache.org
channel stopped
Skipping sonar analysis due to bad build status FAILURE

Mime
View raw message