directory-notifications mailing list archives

Site index · List index
Message view « Date » · « Thread »
Top « Date » · « Thread »
From Apache Jenkins Server <jenk...@builds.apache.org>
Subject Build failed in Jenkins: dir-kerby #108
Date Thu, 03 Dec 2015 18:04:37 GMT
See <https://builds.apache.org/job/dir-kerby/108/changes>

Changes:

[kai.zheng] DIRKRB-486. Initial work for the support, introducing toStr() method

[kai.zheng] Renamed Asn1EnumType.

[jiajia.li] DIRKRB-486 Dumping support for built-in ASN1 types and user defined

[kai.zheng] ASN1. Allowing to return a header

------------------------------------------
[...truncated 2598 lines...]

Tests run: 10, Failures: 0, Errors: 0, Skipped: 0

[JENKINS] Recording test results
[INFO] 
[INFO] --- maven-surefire-plugin:2.18.1:test (default) @ ldap-backend ---
[INFO] Skipping execution of surefire because it has already been run for this configuration
[JENKINS] Recording test results
[INFO] 
[INFO] --- maven-jar-plugin:2.5:jar (default-jar) @ ldap-backend ---
[INFO] Building jar: <https://builds.apache.org/job/dir-kerby/ws/kerby-backend/ldap-backend/target/ldap-backend-1.0.0-RC2-SNAPSHOT.jar>
[INFO] 
[INFO] --- maven-site-plugin:3.4:attach-descriptor (attach-descriptor) @ ldap-backend ---
[INFO] 
[INFO] --- maven-pmd-plugin:3.4:pmd (pmd) @ ldap-backend ---
[INFO] 
[INFO] --- maven-pmd-plugin:3.4:check (validate) @ ldap-backend ---
[INFO] 
[INFO] 
[INFO] --- maven-checkstyle-plugin:2.15:check (validate) @ ldap-backend ---
[WARNING] Failed to getClass for org.apache.maven.plugin.source.SourceJarMojo
[INFO] 
[INFO] --- maven-source-plugin:2.4:jar (attach-sources) @ ldap-backend ---
[INFO] Building jar: <https://builds.apache.org/job/dir-kerby/ws/kerby-backend/ldap-backend/target/ldap-backend-1.0.0-RC2-SNAPSHOT-sources.jar>
[INFO] 
[INFO] --- maven-install-plugin:2.5.2:install (default-install) @ ldap-backend ---
[INFO] Installing <https://builds.apache.org/job/dir-kerby/ws/kerby-backend/ldap-backend/target/ldap-backend-1.0.0-RC2-SNAPSHOT.jar>
to /home/jenkins/jenkins-slave/maven-repositories/0/org/apache/kerby/ldap-backend/1.0.0-RC2-SNAPSHOT/ldap-backend-1.0.0-RC2-SNAPSHOT.jar
[INFO] Installing <https://builds.apache.org/job/dir-kerby/ws/kerby-backend/ldap-backend/pom.xml>
to /home/jenkins/jenkins-slave/maven-repositories/0/org/apache/kerby/ldap-backend/1.0.0-RC2-SNAPSHOT/ldap-backend-1.0.0-RC2-SNAPSHOT.pom
[INFO] Installing <https://builds.apache.org/job/dir-kerby/ws/kerby-backend/ldap-backend/target/ldap-backend-1.0.0-RC2-SNAPSHOT-sources.jar>
to /home/jenkins/jenkins-slave/maven-repositories/0/org/apache/kerby/ldap-backend/1.0.0-RC2-SNAPSHOT/ldap-backend-1.0.0-RC2-SNAPSHOT-sources.jar
[INFO] 
[INFO] --- maven-deploy-plugin:2.8.2:deploy (default-deploy) @ ldap-backend ---
Downloading: https://repository.apache.org/content/repositories/snapshots/org/apache/kerby/ldap-backend/1.0.0-RC2-SNAPSHOT/maven-metadata.xml
Downloaded: https://repository.apache.org/content/repositories/snapshots/org/apache/kerby/ldap-backend/1.0.0-RC2-SNAPSHOT/maven-metadata.xml
(1012 B at 0.5 KB/sec)
Uploading: https://repository.apache.org/content/repositories/snapshots/org/apache/kerby/ldap-backend/1.0.0-RC2-SNAPSHOT/ldap-backend-1.0.0-RC2-20151203.180317-16.jar
Uploaded: https://repository.apache.org/content/repositories/snapshots/org/apache/kerby/ldap-backend/1.0.0-RC2-SNAPSHOT/ldap-backend-1.0.0-RC2-20151203.180317-16.jar
(18 KB at 9.7 KB/sec)
Uploading: https://repository.apache.org/content/repositories/snapshots/org/apache/kerby/ldap-backend/1.0.0-RC2-SNAPSHOT/ldap-backend-1.0.0-RC2-20151203.180317-16.pom
Uploaded: https://repository.apache.org/content/repositories/snapshots/org/apache/kerby/ldap-backend/1.0.0-RC2-SNAPSHOT/ldap-backend-1.0.0-RC2-20151203.180317-16.pom
(4 KB at 2.0 KB/sec)
Downloading: https://repository.apache.org/content/repositories/snapshots/org/apache/kerby/ldap-backend/maven-metadata.xml
Downloaded: https://repository.apache.org/content/repositories/snapshots/org/apache/kerby/ldap-backend/maven-metadata.xml
(292 B at 0.1 KB/sec)
Uploading: https://repository.apache.org/content/repositories/snapshots/org/apache/kerby/ldap-backend/1.0.0-RC2-SNAPSHOT/maven-metadata.xml
Uploaded: https://repository.apache.org/content/repositories/snapshots/org/apache/kerby/ldap-backend/1.0.0-RC2-SNAPSHOT/maven-metadata.xml
(1012 B at 0.6 KB/sec)
Uploading: https://repository.apache.org/content/repositories/snapshots/org/apache/kerby/ldap-backend/maven-metadata.xml
Uploaded: https://repository.apache.org/content/repositories/snapshots/org/apache/kerby/ldap-backend/maven-metadata.xml
(292 B at 0.1 KB/sec)
Uploading: https://repository.apache.org/content/repositories/snapshots/org/apache/kerby/ldap-backend/1.0.0-RC2-SNAPSHOT/ldap-backend-1.0.0-RC2-20151203.180317-16-sources.jar
Uploaded: https://repository.apache.org/content/repositories/snapshots/org/apache/kerby/ldap-backend/1.0.0-RC2-SNAPSHOT/ldap-backend-1.0.0-RC2-20151203.180317-16-sources.jar
(13 KB at 11.1 KB/sec)
Uploading: https://repository.apache.org/content/repositories/snapshots/org/apache/kerby/ldap-backend/1.0.0-RC2-SNAPSHOT/maven-metadata.xml
Uploaded: https://repository.apache.org/content/repositories/snapshots/org/apache/kerby/ldap-backend/1.0.0-RC2-SNAPSHOT/maven-metadata.xml
(1012 B at 0.1 KB/sec)
[JENKINS] Archiving disabled
[INFO]                                                                         
[INFO] ------------------------------------------------------------------------
[INFO] Building Kerby Kdc Test 1.0.0-RC2-SNAPSHOT
[INFO] ------------------------------------------------------------------------
[INFO] 
[INFO] --- maven-clean-plugin:2.5:clean (default-clean) @ kerby-kdc-test ---
[INFO] Deleting <https://builds.apache.org/job/dir-kerby/ws/kerby-kdc-test/target>
[INFO] 
[INFO] --- maven-pmd-plugin:3.4:pmd (pmd) @ kerby-kdc-test ---
[INFO] 
[INFO] --- maven-pmd-plugin:3.4:check (validate) @ kerby-kdc-test ---
[INFO] 
[INFO] 
[INFO] --- maven-checkstyle-plugin:2.15:check (validate) @ kerby-kdc-test ---
[INFO] 
[INFO] --- maven-remote-resources-plugin:1.5:process (default) @ kerby-kdc-test ---
[INFO] 
[INFO] --- maven-resources-plugin:2.7:resources (default-resources) @ kerby-kdc-test ---
[INFO] Using 'UTF-8' encoding to copy filtered resources.
[INFO] Copying 9 resources
[INFO] Copying 3 resources
[INFO] 
[INFO] --- maven-compiler-plugin:3.1:compile (default-compile) @ kerby-kdc-test ---
[INFO] No sources to compile
[INFO] 
[INFO] --- maven-resources-plugin:2.7:testResources (default-testResources) @ kerby-kdc-test
---
[INFO] Using 'UTF-8' encoding to copy filtered resources.
[INFO] Copying 3 resources
[INFO] Copying 3 resources
[INFO] 
[INFO] --- maven-compiler-plugin:3.1:testCompile (default-testCompile) @ kerby-kdc-test ---
[INFO] Changes detected - recompiling the module!
[INFO] Compiling 14 source files to <https://builds.apache.org/job/dir-kerby/ws/kerby-kdc-test/target/test-classes>
[INFO] 
[INFO] --- maven-surefire-plugin:2.18.1:test (default-test) @ kerby-kdc-test ---
[INFO] Surefire report directory: <https://builds.apache.org/job/dir-kerby/ws/kerby-kdc-test/target/surefire-reports>

-------------------------------------------------------
 T E S T S
-------------------------------------------------------
Running org.apache.kerby.kerberos.kdc.GssUdpInteropTest
Tests run: 1, Failures: 0, Errors: 0, Skipped: 0, Time elapsed: 1.091 sec - in org.apache.kerby.kerberos.kdc.GssUdpInteropTest
Running org.apache.kerby.kerberos.kdc.JsonBackendKdcTest
Tests run: 1, Failures: 0, Errors: 0, Skipped: 0, Time elapsed: 1.148 sec - in org.apache.kerby.kerberos.kdc.JsonBackendKdcTest
Running org.apache.kerby.kerberos.kdc.WithIdentityTokenKdcTest
Tests run: 7, Failures: 0, Errors: 0, Skipped: 0, Time elapsed: 2.803 sec - in org.apache.kerby.kerberos.kdc.WithIdentityTokenKdcTest
Running org.apache.kerby.kerberos.kdc.EncryptionTypeKdcTest
Tests run: 1, Failures: 0, Errors: 0, Skipped: 0, Time elapsed: 1.247 sec - in org.apache.kerby.kerberos.kdc.EncryptionTypeKdcTest
Running org.apache.kerby.kerberos.kdc.OnlyTcpForNettyKdcNetworkTest
Tests run: 1, Failures: 0, Errors: 0, Skipped: 0, Time elapsed: 1.071 sec - in org.apache.kerby.kerberos.kdc.OnlyTcpForNettyKdcNetworkTest
Running org.apache.kerby.kerberos.kdc.LdapBackendKdcTest
Tests run: 1, Failures: 0, Errors: 0, Skipped: 0, Time elapsed: 16.816 sec - in org.apache.kerby.kerberos.kdc.LdapBackendKdcTest
Running org.apache.kerby.kerberos.kdc.OnlyUdpForNettyKdcNetworkTest
Tests run: 1, Failures: 0, Errors: 0, Skipped: 0, Time elapsed: 1.028 sec - in org.apache.kerby.kerberos.kdc.OnlyUdpForNettyKdcNetworkTest
Running org.apache.kerby.kerberos.kdc.WithAccessTokenKdcTest
Tests run: 7, Failures: 0, Errors: 0, Skipped: 0, Time elapsed: 2.747 sec - in org.apache.kerby.kerberos.kdc.WithAccessTokenKdcTest
Running org.apache.kerby.kerberos.kdc.GssTcpInteropTest
Tests run: 1, Failures: 0, Errors: 0, Skipped: 0, Time elapsed: 1.185 sec - in org.apache.kerby.kerberos.kdc.GssTcpInteropTest
Running org.apache.kerby.kerberos.kdc.ZookeeperBackendKdcTest
Tests run: 1, Failures: 0, Errors: 0, Skipped: 0, Time elapsed: 1.05 sec - in org.apache.kerby.kerberos.kdc.ZookeeperBackendKdcTest

Results :

Tests run: 22, Failures: 0, Errors: 0, Skipped: 0

[JENKINS] Recording test results
[INFO] 
[INFO] --- maven-surefire-plugin:2.18.1:test (default) @ kerby-kdc-test ---
[INFO] Skipping execution of surefire because it has already been run for this configuration
[JENKINS] Recording test results
[INFO] 
[INFO] --- maven-jar-plugin:2.5:jar (default-jar) @ kerby-kdc-test ---
[INFO] Building jar: <https://builds.apache.org/job/dir-kerby/ws/kerby-kdc-test/target/kerby-kdc-test-1.0.0-RC2-SNAPSHOT.jar>
[INFO] 
[INFO] --- maven-site-plugin:3.4:attach-descriptor (attach-descriptor) @ kerby-kdc-test ---
[INFO] 
[INFO] --- maven-pmd-plugin:3.4:pmd (pmd) @ kerby-kdc-test ---
[INFO] 
[INFO] --- maven-pmd-plugin:3.4:check (validate) @ kerby-kdc-test ---
[INFO] 
[INFO] 
[INFO] --- maven-checkstyle-plugin:2.15:check (validate) @ kerby-kdc-test ---
[WARNING] Failed to getClass for org.apache.maven.plugin.source.SourceJarMojo
[INFO] 
[INFO] --- maven-source-plugin:2.4:jar (attach-sources) @ kerby-kdc-test ---
[INFO] Building jar: <https://builds.apache.org/job/dir-kerby/ws/kerby-kdc-test/target/kerby-kdc-test-1.0.0-RC2-SNAPSHOT-sources.jar>
[INFO] 
[INFO] --- maven-install-plugin:2.5.2:install (default-install) @ kerby-kdc-test ---
[INFO] Installing <https://builds.apache.org/job/dir-kerby/ws/kerby-kdc-test/target/kerby-kdc-test-1.0.0-RC2-SNAPSHOT.jar>
to /home/jenkins/jenkins-slave/maven-repositories/0/org/apache/kerby/kerby-kdc-test/1.0.0-RC2-SNAPSHOT/kerby-kdc-test-1.0.0-RC2-SNAPSHOT.jar
[INFO] Installing <https://builds.apache.org/job/dir-kerby/ws/kerby-kdc-test/pom.xml>
to /home/jenkins/jenkins-slave/maven-repositories/0/org/apache/kerby/kerby-kdc-test/1.0.0-RC2-SNAPSHOT/kerby-kdc-test-1.0.0-RC2-SNAPSHOT.pom
[INFO] Installing <https://builds.apache.org/job/dir-kerby/ws/kerby-kdc-test/target/kerby-kdc-test-1.0.0-RC2-SNAPSHOT-sources.jar>
to /home/jenkins/jenkins-slave/maven-repositories/0/org/apache/kerby/kerby-kdc-test/1.0.0-RC2-SNAPSHOT/kerby-kdc-test-1.0.0-RC2-SNAPSHOT-sources.jar
[INFO] 
[INFO] --- maven-deploy-plugin:2.8.2:deploy (default-deploy) @ kerby-kdc-test ---
Downloading: https://repository.apache.org/content/repositories/snapshots/org/apache/kerby/kerby-kdc-test/1.0.0-RC2-SNAPSHOT/maven-metadata.xml
Downloaded: https://repository.apache.org/content/repositories/snapshots/org/apache/kerby/kerby-kdc-test/1.0.0-RC2-SNAPSHOT/maven-metadata.xml
(1014 B at 0.2 KB/sec)
Uploading: https://repository.apache.org/content/repositories/snapshots/org/apache/kerby/kerby-kdc-test/1.0.0-RC2-SNAPSHOT/kerby-kdc-test-1.0.0-RC2-20151203.180422-15.jar
Uploaded: https://repository.apache.org/content/repositories/snapshots/org/apache/kerby/kerby-kdc-test/1.0.0-RC2-SNAPSHOT/kerby-kdc-test-1.0.0-RC2-20151203.180422-15.jar
(19 KB at 11.3 KB/sec)
Uploading: https://repository.apache.org/content/repositories/snapshots/org/apache/kerby/kerby-kdc-test/1.0.0-RC2-SNAPSHOT/kerby-kdc-test-1.0.0-RC2-20151203.180422-15.pom
Uploaded: https://repository.apache.org/content/repositories/snapshots/org/apache/kerby/kerby-kdc-test/1.0.0-RC2-SNAPSHOT/kerby-kdc-test-1.0.0-RC2-20151203.180422-15.pom
(3 KB at 1.8 KB/sec)
Downloading: https://repository.apache.org/content/repositories/snapshots/org/apache/kerby/kerby-kdc-test/maven-metadata.xml
Downloaded: https://repository.apache.org/content/repositories/snapshots/org/apache/kerby/kerby-kdc-test/maven-metadata.xml
(294 B at 0.2 KB/sec)
Uploading: https://repository.apache.org/content/repositories/snapshots/org/apache/kerby/kerby-kdc-test/1.0.0-RC2-SNAPSHOT/maven-metadata.xml
Uploaded: https://repository.apache.org/content/repositories/snapshots/org/apache/kerby/kerby-kdc-test/1.0.0-RC2-SNAPSHOT/maven-metadata.xml
(1014 B at 0.7 KB/sec)
Uploading: https://repository.apache.org/content/repositories/snapshots/org/apache/kerby/kerby-kdc-test/maven-metadata.xml
[JENKINS] Archiving disabled
[INFO] ------------------------------------------------------------------------
[INFO] Reactor Summary:
[INFO] 
[INFO] Apache Kerby Project .............................. SUCCESS [18.378s]
[INFO] Kerby Config ...................................... SUCCESS [33.558s]
[INFO] Kerby Util ........................................ SUCCESS [18.824s]
[INFO] Kerby ASN1 Project ................................ SUCCESS [29.336s]
[INFO] Kerby PKIX Project ................................ SUCCESS [10.926s]
[INFO] Kerby-kerb Project ................................ SUCCESS [6.459s]
[INFO] Kerby-kerb core ................................... SUCCESS [20.297s]
[INFO] Kerby-kerb Crypto ................................. SUCCESS [21.362s]
[INFO] Kerby-kerb Util ................................... SUCCESS [19.458s]
[INFO] kerby-kerb-coreTest ............................... SUCCESS [13.936s]
[INFO] Kerby-kerb Common ................................. SUCCESS [22.746s]
[INFO] Kerby-kerb Identity ............................... SUCCESS [8.551s]
[INFO] Kerby-kerb Identity Test .......................... SUCCESS [18.760s]
[INFO] Kerby-kerb Client ................................. SUCCESS [19.253s]
[INFO] Kerby-kerb Server ................................. SUCCESS [16.897s]
[INFO] Kerby-kerb Admin .................................. SUCCESS [7.574s]
[INFO] Kerb Simple Kdc ................................... SUCCESS [10.914s]
[INFO] Kerb Kdc Test ..................................... SUCCESS [26.977s]
[INFO] Kerby providers ................................... SUCCESS [7.331s]
[INFO] Token provider .................................... SUCCESS [21.334s]
[INFO] Kerb Integration Test ............................. SUCCESS [24.984s]
[INFO] Kerby-kerb client api all ......................... SUCCESS [9.660s]
[INFO] Kerby-kerb server all ............................. SUCCESS [15.213s]
[INFO] Kerby KDC Server .................................. SUCCESS [15.340s]
[INFO] Kdc Tool Project .................................. SUCCESS [6.036s]
[INFO] Client Tool ....................................... SUCCESS [11.211s]
[INFO] KDC Tool .......................................... SUCCESS [20.522s]
[INFO] Kerby Backend ..................................... SUCCESS [4.768s]
[INFO] Json identity backend ............................. SUCCESS [21.087s]
[INFO] Zookeeper identity backend ........................ SUCCESS [20.906s]
[INFO] Ldap identity backend ............................. SUCCESS [2:38.457s]
[INFO] Kerby Kdc Test .................................... FAILURE [53.640s]
[INFO] Mavibot based backend ............................. SKIPPED
[INFO] Kerby Distribution ................................ SKIPPED
[INFO] KDC Dist .......................................... SKIPPED
[INFO] Tool Dist ......................................... SKIPPED
[INFO] Kerby benchmark ................................... SKIPPED
[INFO] ------------------------------------------------------------------------
[INFO] BUILD FAILURE
[INFO] ------------------------------------------------------------------------
[INFO] Total time: 12:13.212s
[INFO] Finished at: Thu Dec 03 18:04:29 UTC 2015
[INFO] Final Memory: 204M/491M
[INFO] ------------------------------------------------------------------------
[JENKINS] Archiving disabled
[JENKINS] Archiving disabled
[JENKINS] Archiving disabled
[JENKINS] Archiving disabled
[JENKINS] Archiving disabled
[JENKINS] Archiving disabled
[JENKINS] Archiving disabled
[JENKINS] Archiving disabled
[JENKINS] Archiving disabled
[JENKINS] Archiving disabled
[JENKINS] Archiving disabled
[JENKINS] Archiving disabled
[JENKINS] Archiving disabled
[JENKINS] Archiving disabled
[JENKINS] Archiving disabled
[JENKINS] Archiving disabled
[JENKINS] Archiving disabled
[JENKINS] Archiving disabled
[JENKINS] Archiving disabled
[JENKINS] Archiving disabled
[JENKINS] Archiving disabled
[JENKINS] Archiving disabled
[JENKINS] Archiving disabled
[JENKINS] Archiving disabled
[JENKINS] Archiving disabled
[JENKINS] Archiving disabled
[JENKINS] Archiving disabled
[JENKINS] Archiving disabled
[JENKINS] Archiving disabled
[JENKINS] Archiving disabled
[JENKINS] Archiving disabled
[JENKINS] Archiving disabled
[JENKINS] Archiving disabled
[JENKINS] Archiving disabled
[JENKINS] Archiving disabled
[JENKINS] Archiving disabled
[JENKINS] Archiving disabled
Waiting for Jenkins to finish collecting data[ERROR] Failed to execute goal org.apache.maven.plugins:maven-deploy-plugin:2.8.2:deploy
(default-deploy) on project kerby-kdc-test: Failed to deploy metadata: Could not transfer
metadata org.apache.kerby:kerby-kdc-test/maven-metadata.xml from/to apache.snapshots.https
(https://repository.apache.org/content/repositories/snapshots): The target server failed to
respond -> [Help 1]
[ERROR] 
[ERROR] To see the full stack trace of the errors, re-run Maven with the -e switch.
[ERROR] Re-run Maven using the -X switch to enable full debug logging.
[ERROR] 
[ERROR] For more information about the errors and possible solutions, please read the following
articles:
[ERROR] [Help 1] http://cwiki.apache.org/confluence/display/MAVEN/MojoExecutionException
[ERROR] 
[ERROR] After correcting the problems, you can resume the build with the command
[ERROR]   mvn <goals> -rf :kerby-kdc-test

channel stopped

Mime
View raw message