directory-notifications mailing list archives

Site index · List index
Message view « Date » · « Thread »
Top « Date » · « Thread »
From gmcdon...@apache.org
Subject Build failed in Jenkins: directory-kerby » not-yet-commons-ssl #225
Date Mon, 07 Dec 2015 06:32:16 GMT
See <https://analysis.apache.org/jenkins/job/directory-kerby/org.apache.kerby$not-yet-commons-ssl/225/>

------------------------------------------
[INFO]                                                                         
[INFO] ------------------------------------------------------------------------
[INFO] Building not-yet-commons-ssl 1.0.0-RC2-SNAPSHOT
[INFO] ------------------------------------------------------------------------
[INFO] 
[INFO] --- maven-clean-plugin:2.5:clean (default-clean) @ not-yet-commons-ssl ---
[INFO] 
[INFO] --- maven-pmd-plugin:3.4:pmd (pmd) @ not-yet-commons-ssl ---
[INFO] 
[INFO] --- maven-pmd-plugin:3.4:check (validate) @ not-yet-commons-ssl ---
[INFO] 
[INFO] --- maven-checkstyle-plugin:2.15:check (validate) @ not-yet-commons-ssl ---
[INFO] 
[INFO] --- maven-remote-resources-plugin:1.5:process (default) @ not-yet-commons-ssl ---
[INFO] 
[INFO] --- maven-resources-plugin:2.7:resources (default-resources) @ not-yet-commons-ssl
---
[INFO] Using 'UTF-8' encoding to copy filtered resources.
[INFO] skip non existing resourceDirectory <https://analysis.apache.org/jenkins/job/directory-kerby/org.apache.kerby$not-yet-commons-ssl/ws/src/main/resources>
[INFO] Copying 3 resources
[INFO] 
[INFO] --- maven-compiler-plugin:3.1:compile (default-compile) @ not-yet-commons-ssl ---
[INFO] Changes detected - recompiling the module!
[INFO] Compiling 41 source files to <https://analysis.apache.org/jenkins/job/directory-kerby/org.apache.kerby$not-yet-commons-ssl/ws/target/classes>
[INFO] -------------------------------------------------------------
[WARNING] COMPILATION WARNING : 
[INFO] -------------------------------------------------------------
[WARNING] <https://analysis.apache.org/jenkins/job/directory-kerby/org.apache.kerby$not-yet-commons-ssl/ws/src/main/java/org/apache/commons/ssl/Certificates.java>:
Some input files use unchecked or unsafe operations.
[WARNING] <https://analysis.apache.org/jenkins/job/directory-kerby/org.apache.kerby$not-yet-commons-ssl/ws/src/main/java/org/apache/commons/ssl/Certificates.java>:
Recompile with -Xlint:unchecked for details.
[INFO] 2 warnings 
[INFO] -------------------------------------------------------------
[INFO] -------------------------------------------------------------
[ERROR] COMPILATION ERROR : 
[INFO] -------------------------------------------------------------
[ERROR] <https://analysis.apache.org/jenkins/job/directory-kerby/org.apache.kerby$not-yet-commons-ssl/ws/src/main/java/org/apache/commons/ssl/Asn1PkcsUtil.java>:[28,29]
cannot find symbol
  symbol:   class Asn1InputBuffer
  location: package org.apache.kerby.asn1
[ERROR] <https://analysis.apache.org/jenkins/job/directory-kerby/org.apache.kerby$not-yet-commons-ssl/ws/src/main/java/org/apache/commons/ssl/Asn1PkcsUtil.java>:[59,9]
cannot find symbol
  symbol:   class Asn1InputBuffer
  location: class org.apache.commons.ssl.Asn1PkcsUtil
[ERROR] <https://analysis.apache.org/jenkins/job/directory-kerby/org.apache.kerby$not-yet-commons-ssl/ws/src/main/java/org/apache/commons/ssl/Asn1PkcsUtil.java>:[59,35]
cannot find symbol
  symbol:   class Asn1InputBuffer
  location: class org.apache.commons.ssl.Asn1PkcsUtil
[ERROR] <https://analysis.apache.org/jenkins/job/directory-kerby/org.apache.kerby$not-yet-commons-ssl/ws/src/main/java/org/apache/commons/ssl/Asn1PkcsUtil.java>:[79,49]
incompatible types
  required: java.util.List<org.apache.kerby.asn1.type.Asn1Item>
  found:    java.util.List<org.apache.kerby.asn1.type.Asn1Type>
[INFO] 4 errors 
[INFO] -------------------------------------------------------------

Mime
View raw message