directory-notifications mailing list archives

Site index · List index
Message view « Date » · « Thread »
Top « Date » · « Thread »
From gmcdon...@apache.org
Subject Build failed in Jenkins: directory-apacheds #364
Date Mon, 21 Dec 2015 17:56:31 GMT
See <https://analysis.apache.org/jenkins/job/directory-apacheds/364/changes>

Changes:

[seelmann] Increase timeout

------------------------------------------
[...truncated 2129 lines...]
[INFO] ------------------------------------------------------------------------
[INFO] Installing org/apache/directory/server/apacheds-server-config/2.0.0-M22-SNAPSHOT/apacheds-server-config-2.0.0-M22-SNAPSHOT.jar
[INFO] Writing OBR metadata
[JENKINS] Archiving disabled
[INFO]                                                                         
[INFO] ------------------------------------------------------------------------
[INFO] Skipping ApacheDS All
[INFO] This project has been banned from the build due to previous failures.
[INFO] ------------------------------------------------------------------------
[INFO]                                                                         
[INFO] ------------------------------------------------------------------------
[INFO] Building ApacheDS Password Hashing Interceptor 2.0.0-M22-SNAPSHOT
[INFO] ------------------------------------------------------------------------
[INFO] 
[INFO] --- maven-clean-plugin:2.6.1:clean (default-clean) @ apacheds-interceptors-hash ---
[INFO] Deleting <https://analysis.apache.org/jenkins/job/directory-apacheds/ws/interceptors/hash/target>
[INFO] 
[INFO] --- maven-checkstyle-plugin:2.16:check (validate) @ apacheds-interceptors-hash ---
[INFO] 
[INFO] --- maven-remote-resources-plugin:1.5:process (default) @ apacheds-interceptors-hash
---
[INFO] 
[INFO] --- maven-resources-plugin:2.7:resources (default-resources) @ apacheds-interceptors-hash
---
[INFO] Using 'UTF-8' encoding to copy filtered resources.
[INFO] skip non existing resourceDirectory <https://analysis.apache.org/jenkins/job/directory-apacheds/ws/interceptors/hash/src/main/resources>
[INFO] Copying 3 resources
[INFO] 
[INFO] --- maven-compiler-plugin:3.3:compile (default-compile) @ apacheds-interceptors-hash
---
[INFO] Changes detected - recompiling the module!
[INFO] Compiling 14 source files to <https://analysis.apache.org/jenkins/job/directory-apacheds/ws/interceptors/hash/target/classes>
[INFO] 
[INFO] --- maven-resources-plugin:2.7:testResources (default-testResources) @ apacheds-interceptors-hash
---
[INFO] Using 'UTF-8' encoding to copy filtered resources.
[INFO] skip non existing resourceDirectory <https://analysis.apache.org/jenkins/job/directory-apacheds/ws/interceptors/hash/src/test/resources>
[INFO] Copying 3 resources
[INFO] 
[INFO] --- maven-compiler-plugin:3.3:testCompile (default-testCompile) @ apacheds-interceptors-hash
---
[INFO] Nothing to compile - all classes are up to date
[INFO] 
[INFO] --- maven-surefire-plugin:2.18.1:test (default-test) @ apacheds-interceptors-hash ---
[INFO] Tests are skipped.
[INFO] 
[INFO] --- maven-bundle-plugin:2.5.3:bundle (default-bundle) @ apacheds-interceptors-hash
---
[INFO] 
[INFO] --- maven-site-plugin:3.4:attach-descriptor (attach-descriptor) @ apacheds-interceptors-hash
---
[INFO] 
[INFO] --- tools-maven-plugin:1.4:verify-legal-files (verify-legal-files) @ apacheds-interceptors-hash
---
[INFO] Checking legal files in: apacheds-interceptors-hash-2.0.0-M22-SNAPSHOT.jar
[INFO] 
[INFO] >>> maven-source-plugin:2.4:jar (attach-sources) > generate-sources @ apacheds-interceptors-hash
>>>
[INFO] 
[INFO] --- maven-checkstyle-plugin:2.16:check (validate) @ apacheds-interceptors-hash ---
[WARNING] Failed to getClass for org.apache.maven.plugin.source.SourceJarMojo
[INFO] 
[INFO] <<< maven-source-plugin:2.4:jar (attach-sources) < generate-sources @ apacheds-interceptors-hash
<<<
[INFO] 
[INFO] --- maven-source-plugin:2.4:jar (attach-sources) @ apacheds-interceptors-hash ---
[INFO] Building jar: <https://analysis.apache.org/jenkins/job/directory-apacheds/ws/interceptors/hash/target/apacheds-interceptors-hash-2.0.0-M22-SNAPSHOT-sources.jar>
[INFO] 
[INFO] --- maven-install-plugin:2.5.2:install (default-install) @ apacheds-interceptors-hash
---
[INFO] Installing <https://analysis.apache.org/jenkins/job/directory-apacheds/ws/interceptors/hash/target/apacheds-interceptors-hash-2.0.0-M22-SNAPSHOT.jar>
to /x1/jenkins/mvn-repo/org/apache/directory/server/apacheds-interceptors-hash/2.0.0-M22-SNAPSHOT/apacheds-interceptors-hash-2.0.0-M22-SNAPSHOT.jar
[INFO] Installing <https://analysis.apache.org/jenkins/job/directory-apacheds/ws/interceptors/hash/pom.xml>
to /x1/jenkins/mvn-repo/org/apache/directory/server/apacheds-interceptors-hash/2.0.0-M22-SNAPSHOT/apacheds-interceptors-hash-2.0.0-M22-SNAPSHOT.pom
[INFO] Installing <https://analysis.apache.org/jenkins/job/directory-apacheds/ws/interceptors/hash/target/apacheds-interceptors-hash-2.0.0-M22-SNAPSHOT-sources.jar>
to /x1/jenkins/mvn-repo/org/apache/directory/server/apacheds-interceptors-hash/2.0.0-M22-SNAPSHOT/apacheds-interceptors-hash-2.0.0-M22-SNAPSHOT-sources.jar
[INFO] 
[INFO] --- maven-bundle-plugin:2.5.3:install (default-install) @ apacheds-interceptors-hash
---
[INFO] Installing org/apache/directory/server/apacheds-interceptors-hash/2.0.0-M22-SNAPSHOT/apacheds-interceptors-hash-2.0.0-M22-SNAPSHOT.jar
[INFO] Writing OBR metadata
[JENKINS] Archiving disabled
[INFO]                                                                         
[INFO] ------------------------------------------------------------------------
[INFO] Skipping ApacheDS Service Builder
[INFO] This project has been banned from the build due to previous failures.
[INFO] ------------------------------------------------------------------------
[INFO]                                                                         
[INFO] ------------------------------------------------------------------------
[INFO] Skipping ApacheDS Core Integration
[INFO] This project has been banned from the build due to previous failures.
[INFO] ------------------------------------------------------------------------
[INFO]                                                                         
[INFO] ------------------------------------------------------------------------
[INFO] Skipping ApacheDS OSGi Integration Tests
[INFO] This project has been banned from the build due to previous failures.
[INFO] ------------------------------------------------------------------------
[INFO]                                                                         
[INFO] ------------------------------------------------------------------------
[INFO] Skipping ApacheDS Service
[INFO] This project has been banned from the build due to previous failures.
[INFO] ------------------------------------------------------------------------
[INFO]                                                                         
[INFO] ------------------------------------------------------------------------
[INFO] Skipping ApacheDS Server Integration
[INFO] This project has been banned from the build due to previous failures.
[INFO] ------------------------------------------------------------------------
[INFO]                                                                         
[INFO] ------------------------------------------------------------------------
[INFO] Skipping ApacheDS Wrapper
[INFO] This project has been banned from the build due to previous failures.
[INFO] ------------------------------------------------------------------------
[INFO]                                                                         
[INFO] ------------------------------------------------------------------------
[INFO] Skipping ApacheDS Installers Maven Plugin
[INFO] This project has been banned from the build due to previous failures.
[INFO] ------------------------------------------------------------------------
[INFO]                                                                         
[INFO] ------------------------------------------------------------------------
[INFO] Skipping ApacheDS Installers
[INFO] This project has been banned from the build due to previous failures.
[INFO] ------------------------------------------------------------------------
[JENKINS] Archiving disabled
[JENKINS] Archiving disabled
[JENKINS] Archiving disabled
[JENKINS] Archiving disabled
[JENKINS] Archiving disabled
[JENKINS] Archiving disabled
[JENKINS] Archiving disabled
[JENKINS] Archiving disabled
[JENKINS] Archiving disabled
[JENKINS] Archiving disabled
[JENKINS] Archiving disabled
[JENKINS] Archiving disabled
[JENKINS] Archiving disabled
[JENKINS] Archiving disabled
[JENKINS] Archiving disabled
[JENKINS] Archiving disabled
[JENKINS] Archiving disabled
[JENKINS] Archiving disabled
[JENKINS] Archiving disabled
[JENKINS] Archiving disabled
[JENKINS] Archiving disabled
[JENKINS] Archiving disabled
[JENKINS] Archiving disabled
[JENKINS] Archiving disabled
[JENKINS] Archiving disabled
[JENKINS] Archiving disabled
[JENKINS] Archiving disabled
[JENKINS] Archiving disabled
[JENKINS] Archiving disabled
[JENKINS] Archiving disabled
[JENKINS] Archiving disabled
[JENKINS] Archiving disabled
[JENKINS] Archiving disabled
[JENKINS] Archiving disabled
[JENKINS] Archiving disabled
[JENKINS] Archiving disabled
[JENKINS] Archiving disabled
[JENKINS] Archiving disabled
[JENKINS] Archiving disabled
[JENKINS] Archiving disabled
[JENKINS] Archiving disabled
[JENKINS] Archiving disabled
[JENKINS] Archiving disabled
[JENKINS] Archiving disabled
[JENKINS] Archiving disabled
[JENKINS] Archiving disabled
[JENKINS] Archiving disabled
[JENKINS] Archiving disabled
[JENKINS] Archiving disabled
[JENKINS] Archiving disabled
[JENKINS] Archiving disabled
[JENKINS] Archiving disabled
[JENKINS] Archiving disabled
[JENKINS] Archiving disabled
[JENKINS] Archiving disabled
[JENKINS] Archiving disabled
[JENKINS] Archiving disabled[INFO] ------------------------------------------------------------------------
[INFO] Reactor Summary:
[INFO] 
[INFO] ApacheDS ........................................... SUCCESS [ 17.271 s]
[INFO] ApacheDS I18n ...................................... SUCCESS [ 16.015 s]
[INFO] ApacheDS Core Constants ............................ SUCCESS [ 14.632 s]
[INFO] ApacheDS Core API .................................. SUCCESS [ 51.335 s]
[INFO] ApacheDS Core Shared ............................... SUCCESS [ 10.313 s]
[INFO] ApacheDS Interceptors .............................. SUCCESS [  3.356 s]
[INFO] ApacheDS AdministrativePoint Interceptor ........... SUCCESS [ 13.200 s]
[INFO] ApacheDS Authentication Interceptor ................ SUCCESS [ 13.770 s]
[INFO] ApacheDS Interceptor to increment numeric attributes SUCCESS [  8.486 s]
[INFO] ApacheDS Authorization Interceptor ................. FAILURE [  3.404 s]
[INFO] ApacheDS ChangeLog Interceptor ..................... SUCCESS [  9.088 s]
[INFO] ApacheDS Collective Attribute Interceptor .......... SUCCESS [ 15.878 s]
[INFO] ApacheDS Event Interceptor ......................... SUCCESS [ 14.320 s]
[INFO] ApacheDS Exception Interceptor ..................... SUCCESS [  8.427 s]
[INFO] ApacheDS Journal Interceptor ....................... SUCCESS [ 12.939 s]
[INFO] ApacheDS Normalization Interceptor ................. SUCCESS [  9.708 s]
[INFO] ApacheDS Operational Attribute Interceptor ......... SUCCESS [  6.435 s]
[INFO] ApacheDS Referral Interceptor ...................... SUCCESS [  9.090 s]
[INFO] ApacheDS Schema Interceptor ........................ SUCCESS [ 17.154 s]
[INFO] ApacheDS Subtree Interceptor ....................... SUCCESS [ 16.623 s]
[INFO] ApacheDS Triggers Interceptor ...................... SUCCESS [  9.974 s]
[INFO] ApacheDS Core ...................................... SKIPPED
[INFO] ApacheDS Core AVL .................................. SUCCESS [ 29.283 s]
[INFO] ApacheDS Generalized (X) DBM Partition ............. SUCCESS [ 18.492 s]
[INFO] ApacheDS LDIF Partition ............................ SUCCESS [ 21.261 s]
[INFO] ApacheDS JDBM Partition ............................ SUCCESS [ 13.409 s]
[INFO] ApacheDS Mavibot Partition ......................... SUCCESS [  9.670 s]
[INFO] ApacheDS Core Annotations .......................... SKIPPED
[INFO] ApacheDS Core JNDI ................................. SUCCESS [ 17.232 s]
[INFO] ApacheDS Protocol Kerberos Codec ................... SUCCESS [ 56.161 s]
[INFO] ApacheDS Interceptors for Kerberos ................. SKIPPED
[INFO] ApacheDS Protocol Dhcp ............................. SUCCESS [ 15.186 s]
[INFO] ApacheDS Protocol Shared ........................... SUCCESS [ 10.861 s]
[INFO] ApacheDS Protocol Dns .............................. SKIPPED
[INFO] ApacheDS Protocol Kerberos ......................... SUCCESS [ 22.883 s]
[INFO] ApacheDS Protocol Ldap ............................. SKIPPED
[INFO] ApacheDS Protocol Ntp .............................. SUCCESS [ 19.017 s]
[INFO] Apacheds Server Annotations ........................ SKIPPED
[INFO] ApacheDS Server Config ............................. SUCCESS [  9.751 s]
[INFO] ApacheDS Server JNDI ............................... SKIPPED
[INFO] ApacheDS Test Framework ............................ SKIPPED
[INFO] ApacheDS All ....................................... SKIPPED
[INFO] ApacheDS Logger Interceptor ........................ SUCCESS [ 11.194 s]
[INFO] ApacheDS Password Hashing Interceptor .............. SUCCESS [  3.681 s]
[INFO] ApacheDS Core Integration .......................... SKIPPED
[INFO] ApacheDS Protocol Kerberos Test .................... SKIPPED
[INFO] ApacheDS Server Integration ........................ SKIPPED
[INFO] ApacheDS DirectoryService-WebApp bridge ............ SUCCESS [  6.467 s]
[INFO] ApacheDS Jetty HTTP Server Integration ............. SKIPPED
[INFO] ApacheDS Service Builder ........................... SKIPPED
[INFO] Apache Directory LDAP Client API test .............. SKIPPED
[INFO] kerberos-client .................................... SKIPPED
[INFO] ApacheDS Service ................................... SKIPPED
[INFO] ApacheDS Wrapper ................................... SKIPPED
[INFO] ApacheDS Installers Maven Plugin ................... SKIPPED
[INFO] ApacheDS Installers ................................ SKIPPED
[INFO] ApacheDS OSGi Integration Tests .................... SKIPPED
[INFO] ------------------------------------------------------------------------
[INFO] BUILD FAILURE
[INFO] ------------------------------------------------------------------------
[INFO] Total time: 03:42 min (Wall Clock)
[INFO] Finished at: 2015-12-21T17:56:29+00:00

[INFO] Final Memory: 98M/442M
[INFO] ------------------------------------------------------------------------
Waiting for Jenkins to finish collecting data
[ERROR] Failed to execute goal org.apache.maven.plugins:maven-remote-resources-plugin:1.5:process
(default) on project apacheds-interceptors-authz: Execution default of goal org.apache.maven.plugins:maven-remote-resources-plugin:1.5:process
failed. ConcurrentModificationException -> [Help 1]
[ERROR] 
[ERROR] To see the full stack trace of the errors, re-run Maven with the -e switch.
[ERROR] Re-run Maven using the -X switch to enable full debug logging.
[ERROR] 
[ERROR] For more information about the errors and possible solutions, please read the following
articles:
[ERROR] [Help 1] http://cwiki.apache.org/confluence/display/MAVEN/PluginExecutionException
[ERROR] 
[ERROR] After correcting the problems, you can resume the build with the command
[ERROR]   mvn <goals> -rf :apacheds-interceptors-authz
Sending e-mails to: notifications@directory.apache.org
Sending e-mails to: notifications@directory.apache.org
Sending e-mails to: notifications@directory.apache.org
Sending e-mails to: notifications@directory.apache.org
Sending e-mails to: notifications@directory.apache.org
channel stopped
Skipping sonar analysis due to bad build status FAILURE

Mime
View raw message