directory-notifications mailing list archives

Site index · List index
Message view « Date » · « Thread »
Top « Date » · « Thread »
From Apache Jenkins Server <jenk...@builds.apache.org>
Subject Build failed in Jenkins: dir-kerby #82
Date Tue, 27 Oct 2015 19:26:05 GMT
See <https://builds.apache.org/job/dir-kerby/82/changes>

Changes:

[jiajia.li] DIRKRB-435 JWT Audience restriction validation is not working. Add check

[jiajia.li] DIRKRB-437 Update the assertj version to 3.2.0.

------------------------------------------
[...truncated 38 lines...]
[INFO] Kerby-kerb Project
[INFO] Kerby-kerb core
[INFO] Kerby-kerb Crypto
[INFO] Kerby-kerb Util
[INFO] kerby-kerb-coreTest
[INFO] Kerby-kerb Common
[INFO] Kerby-kerb Identity
[INFO] Kerby-kerb Identity Test
[INFO] Kerby-kerb Client
[INFO] Kerby providers
[INFO] Token provider
[INFO] Kerby-kerb Server
[INFO] Kerby-kerb Admin
[INFO] Kerb Simple Kdc
[INFO] Kerb Kdc Test
[INFO] Kerb Integration Test
[INFO] Kerby-kerb client api all
[INFO] Kerby-kerb server all
[INFO] Kerby KDC Server
[INFO] Kdc Tool Project
[INFO] Client Tool
[INFO] KDC Tool
[INFO] Kerby Backend
[INFO] Json identity backend
[INFO] Zookeeper identity backend
[INFO] Ldap identity backend
[INFO] Kerby Kdc Test
[INFO] Mavibot based backend
[INFO] Kerby Distribution
[INFO] KDC Dist
[INFO] Tool Dist
[INFO] Kerby benchmark
[INFO]                                                                         
[INFO] ------------------------------------------------------------------------
[INFO] Building Apache Kerby Project 1.0.0-RC2-SNAPSHOT
[INFO] ------------------------------------------------------------------------
Downloading: http://repo.maven.apache.org/maven2/org/assertj/assertj-core/3.2.0/assertj-core-3.2.0.pom
Downloaded: http://repo.maven.apache.org/maven2/org/assertj/assertj-core/3.2.0/assertj-core-3.2.0.pom
(10 KB at 31.1 KB/sec)
Downloading: http://repo.maven.apache.org/maven2/org/assertj/assertj-parent-pom/1.3.6/assertj-parent-pom-1.3.6.pom
Downloaded: http://repo.maven.apache.org/maven2/org/assertj/assertj-parent-pom/1.3.6/assertj-parent-pom-1.3.6.pom
(15 KB at 84.6 KB/sec)
Downloading: http://repo.maven.apache.org/maven2/org/assertj/assertj-core/3.2.0/assertj-core-3.2.0.jar
Downloaded: http://repo.maven.apache.org/maven2/org/assertj/assertj-core/3.2.0/assertj-core-3.2.0.jar
(755 KB at 1725.6 KB/sec)
[INFO] 
[INFO] --- maven-clean-plugin:2.5:clean (default-clean) @ kerby-all ---
[INFO] Deleting <https://builds.apache.org/job/dir-kerby/ws/target>
[INFO] 
[INFO] --- maven-pmd-plugin:3.4:pmd (pmd) @ kerby-all ---
[INFO] 
[INFO] --- maven-pmd-plugin:3.4:check (validate) @ kerby-all ---
[INFO] 
[INFO] --- maven-checkstyle-plugin:2.15:check (validate) @ kerby-all ---
[INFO] 
[INFO] --- maven-remote-resources-plugin:1.5:process (default) @ kerby-all ---
[INFO] 
[INFO] --- maven-site-plugin:3.4:attach-descriptor (attach-descriptor) @ kerby-all ---
[INFO] 
[INFO] --- maven-pmd-plugin:3.4:pmd (pmd) @ kerby-all ---
[INFO] 
[INFO] --- maven-pmd-plugin:3.4:check (validate) @ kerby-all ---
[INFO] 
[INFO] --- maven-checkstyle-plugin:2.15:check (validate) @ kerby-all ---
[WARNING] Failed to getClass for org.apache.maven.plugin.source.SourceJarMojo
[INFO] 
[INFO] --- maven-source-plugin:2.4:jar (attach-sources) @ kerby-all ---
[INFO] 
[INFO] --- maven-install-plugin:2.5.2:install (default-install) @ kerby-all ---
[INFO] Installing <https://builds.apache.org/job/dir-kerby/ws/pom.xml> to /home/jenkins/jenkins-slave/maven-repositories/1/org/apache/kerby/kerby-all/1.0.0-RC2-SNAPSHOT/kerby-all-1.0.0-RC2-SNAPSHOT.pom
[JENKINS] Archiving disabled
[INFO]                                                                         
[INFO] ------------------------------------------------------------------------
[INFO] Building Kerby Config 1.0.0-RC2-SNAPSHOT
[INFO] ------------------------------------------------------------------------
[INFO] 
[INFO] --- maven-clean-plugin:2.5:clean (default-clean) @ kerby-config ---
[INFO] Deleting <https://builds.apache.org/job/dir-kerby/ws/kerby-config/target>
[INFO] 
[INFO] --- maven-pmd-plugin:3.4:pmd (pmd) @ kerby-config ---
[INFO] 
[INFO] --- maven-pmd-plugin:3.4:check (validate) @ kerby-config ---
[INFO] 
[INFO] 
[INFO] --- maven-checkstyle-plugin:2.15:check (validate) @ kerby-config ---
[INFO] 
[INFO] --- maven-remote-resources-plugin:1.5:process (default) @ kerby-config ---
[INFO] 
[INFO] --- maven-resources-plugin:2.7:resources (default-resources) @ kerby-config ---
[INFO] Using 'UTF-8' encoding to copy filtered resources.
[INFO] skip non existing resourceDirectory <https://builds.apache.org/job/dir-kerby/ws/kerby-config/src/main/resources>
[INFO] Copying 3 resources
[INFO] 
[INFO] --- maven-compiler-plugin:3.1:compile (default-compile) @ kerby-config ---
[INFO] Changes detected - recompiling the module!
[INFO] Compiling 15 source files to <https://builds.apache.org/job/dir-kerby/ws/kerby-config/target/classes>
[WARNING] <https://builds.apache.org/job/dir-kerby/ws/kerby-config/src/main/java/org/apache/kerby/config/ConfigImpl.java>:
<https://builds.apache.org/job/dir-kerby/ws/kerby-config/src/main/java/org/apache/kerby/config/ConfigImpl.java>
uses unchecked or unsafe operations.
[WARNING] <https://builds.apache.org/job/dir-kerby/ws/kerby-config/src/main/java/org/apache/kerby/config/ConfigImpl.java>:
Recompile with -Xlint:unchecked for details.
[INFO] 
[INFO] --- maven-resources-plugin:2.7:testResources (default-testResources) @ kerby-config
---
[INFO] Using 'UTF-8' encoding to copy filtered resources.
[INFO] skip non existing resourceDirectory <https://builds.apache.org/job/dir-kerby/ws/kerby-config/src/test/resources>
[INFO] Copying 3 resources
[INFO] 
[INFO] --- maven-compiler-plugin:3.1:testCompile (default-testCompile) @ kerby-config ---
[INFO] Changes detected - recompiling the module!
[INFO] Compiling 3 source files to <https://builds.apache.org/job/dir-kerby/ws/kerby-config/target/test-classes>
[INFO] -------------------------------------------------------------
[ERROR] COMPILATION ERROR : 
[INFO] -------------------------------------------------------------
[ERROR] <https://builds.apache.org/job/dir-kerby/ws/kerby-config/src/test/java/org/apache/kerby/config/ConfigImplTest.java>:[50,9]
cannot access java.util.concurrent.CompletableFuture
  class file for java.util.concurrent.CompletableFuture not found
[ERROR] <https://builds.apache.org/job/dir-kerby/ws/kerby-config/src/test/java/org/apache/kerby/config/ConfigImplTest.java>:[51,9]
cannot access java.util.Optional
  class file for java.util.Optional not found
[ERROR] <https://builds.apache.org/job/dir-kerby/ws/kerby-config/src/test/java/org/apache/kerby/config/ConfigImplTest.java>:[54,9]
cannot access java.util.OptionalDouble
  class file for java.util.OptionalDouble not found
[ERROR] <https://builds.apache.org/job/dir-kerby/ws/kerby-config/src/test/java/org/apache/kerby/config/ConfigImplTest.java>:[55,9]
cannot access java.util.OptionalInt
  class file for java.util.OptionalInt not found
[ERROR] <https://builds.apache.org/job/dir-kerby/ws/kerby-config/src/test/java/org/apache/kerby/config/ConfigImplTest.java>:[56,9]
cannot access java.util.OptionalLong
  class file for java.util.OptionalLong not found
[ERROR] <https://builds.apache.org/job/dir-kerby/ws/kerby-config/src/test/java/org/apache/kerby/config/ConfigImplTest.java>:[59,9]
cannot access java.time.ZonedDateTime
  class file for java.time.ZonedDateTime not found
[ERROR] <https://builds.apache.org/job/dir-kerby/ws/kerby-config/src/test/java/org/apache/kerby/config/ConfigImplTest.java>:[60,9]
cannot access java.time.LocalDateTime
  class file for java.time.LocalDateTime not found
[ERROR] <https://builds.apache.org/job/dir-kerby/ws/kerby-config/src/test/java/org/apache/kerby/config/ConfigImplTest.java>:[61,9]
cannot access java.time.OffsetDateTime
  class file for java.time.OffsetDateTime not found
[ERROR] <https://builds.apache.org/job/dir-kerby/ws/kerby-config/src/test/java/org/apache/kerby/config/IniConfigTest.java>:[73,9]
cannot access java.time.OffsetTime
  class file for java.time.OffsetTime not found
[ERROR] <https://builds.apache.org/job/dir-kerby/ws/kerby-config/src/test/java/org/apache/kerby/config/IniConfigTest.java>:[74,9]
cannot access java.time.LocalTime
  class file for java.time.LocalTime not found
[ERROR] <https://builds.apache.org/job/dir-kerby/ws/kerby-config/src/test/java/org/apache/kerby/config/IniConfigTest.java>:[77,9]
cannot access java.time.LocalDate
  class file for java.time.LocalDate not found
[INFO] 11 errors 
[INFO] -------------------------------------------------------------
[JENKINS] Archiving disabled
[INFO] ------------------------------------------------------------------------
[INFO] Reactor Summary:
[INFO] 
[INFO] Apache Kerby Project .............................. SUCCESS [7.574s]
[INFO] Kerby Config ...................................... FAILURE [5.567s]
[INFO] Kerby Util ........................................ SKIPPED
[INFO] Kerby ASN1 Project ................................ SKIPPED
[INFO] Kerby-kerb Project ................................ SKIPPED
[INFO] Kerby-kerb core ................................... SKIPPED
[INFO] Kerby-kerb Crypto ................................. SKIPPED
[INFO] Kerby-kerb Util ................................... SKIPPED
[INFO] kerby-kerb-coreTest ............................... SKIPPED
[INFO] Kerby-kerb Common ................................. SKIPPED
[INFO] Kerby-kerb Identity ............................... SKIPPED
[INFO] Kerby-kerb Identity Test .......................... SKIPPED
[INFO] Kerby-kerb Client ................................. SKIPPED
[INFO] Kerby providers ................................... SKIPPED
[INFO] Token provider .................................... SKIPPED
[INFO] Kerby-kerb Server ................................. SKIPPED
[INFO] Kerby-kerb Admin .................................. SKIPPED
[INFO] Kerb Simple Kdc ................................... SKIPPED
[INFO] Kerb Kdc Test ..................................... SKIPPED
[INFO] Kerb Integration Test ............................. SKIPPED
[INFO] Kerby-kerb client api all ......................... SKIPPED
[INFO] Kerby-kerb server all ............................. SKIPPED
[INFO] Kerby KDC Server .................................. SKIPPED
[INFO] Kdc Tool Project .................................. SKIPPED
[INFO] Client Tool ....................................... SKIPPED
[INFO] KDC Tool .......................................... SKIPPED
[INFO] Kerby Backend ..................................... SKIPPED
[INFO] Json identity backend ............................. SKIPPED
[INFO] Zookeeper identity backend ........................ SKIPPED
[INFO] Ldap identity backend ............................. SKIPPED
[INFO] Kerby Kdc Test .................................... SKIPPED
[INFO] Mavibot based backend ............................. SKIPPED
[INFO] Kerby Distribution ................................ SKIPPED
[INFO] KDC Dist .......................................... SKIPPED
[INFO] Tool Dist ......................................... SKIPPED
[INFO] Kerby benchmark ................................... SKIPPED
[INFO] ------------------------------------------------------------------------
[INFO] BUILD FAILURE
[INFO] ------------------------------------------------------------------------
[INFO] Total time: 17.701s
[INFO] Finished at: Tue Oct 27 19:26:56 UTC 2015
[INFO] Final Memory: 35M/215M
[INFO] ------------------------------------------------------------------------
[JENKINS] Archiving disabled
[JENKINS] Archiving disabled
[JENKINS] Archiving disabled
[JENKINS] Archiving disabled
[JENKINS] Archiving disabled
[JENKINS] Archiving disabled
[JENKINS] Archiving disabled
[JENKINS] Archiving disabled
[JENKINS] Archiving disabled
[JENKINS] Archiving disabled
[JENKINS] Archiving disabled
[JENKINS] Archiving disabled
[JENKINS] Archiving disabled
[JENKINS] Archiving disabled
[JENKINS] Archiving disabled
[JENKINS] Archiving disabled
[JENKINS] Archiving disabled
[JENKINS] Archiving disabled
[JENKINS] Archiving disabled
[JENKINS] Archiving disabled
[JENKINS] Archiving disabled
[JENKINS] Archiving disabled
[JENKINS] Archiving disabled
[JENKINS] Archiving disabled
[JENKINS] Archiving disabled
[JENKINS] Archiving disabled
[JENKINS] Archiving disabled
[JENKINS] Archiving disabled
[JENKINS] Archiving disabled
[JENKINS] Archiving disabled
[JENKINS] Archiving disabled
[JENKINS] Archiving disabled
[JENKINS] Archiving disabled
[JENKINS] Archiving disabled
[JENKINS] Archiving disabled
[JENKINS] Archiving disabled
Waiting for Jenkins to finish collecting data[ERROR] Failed to execute goal org.apache.maven.plugins:maven-compiler-plugin:3.1:testCompile
(default-testCompile) on project kerby-config: Compilation failure: Compilation failure:
[ERROR] <https://builds.apache.org/job/dir-kerby/ws/kerby-config/src/test/java/org/apache/kerby/config/ConfigImplTest.java>:[50,9]
cannot access java.util.concurrent.CompletableFuture
[ERROR] class file for java.util.concurrent.CompletableFuture not found
[ERROR] <https://builds.apache.org/job/dir-kerby/ws/kerby-config/src/test/java/org/apache/kerby/config/ConfigImplTest.java>:[51,9]
cannot access java.util.Optional
[ERROR] class file for java.util.Optional not found
[ERROR] <https://builds.apache.org/job/dir-kerby/ws/kerby-config/src/test/java/org/apache/kerby/config/ConfigImplTest.java>:[54,9]
cannot access java.util.OptionalDouble
[ERROR] class file for java.util.OptionalDouble not found
[ERROR] <https://builds.apache.org/job/dir-kerby/ws/kerby-config/src/test/java/org/apache/kerby/config/ConfigImplTest.java>:[55,9]
cannot access java.util.OptionalInt
[ERROR] class file for java.util.OptionalInt not found
[ERROR] <https://builds.apache.org/job/dir-kerby/ws/kerby-config/src/test/java/org/apache/kerby/config/ConfigImplTest.java>:[56,9]
cannot access java.util.OptionalLong
[ERROR] class file for java.util.OptionalLong not found
[ERROR] <https://builds.apache.org/job/dir-kerby/ws/kerby-config/src/test/java/org/apache/kerby/config/ConfigImplTest.java>:[59,9]
cannot access java.time.ZonedDateTime
[ERROR] class file for java.time.ZonedDateTime not found
[ERROR] <https://builds.apache.org/job/dir-kerby/ws/kerby-config/src/test/java/org/apache/kerby/config/ConfigImplTest.java>:[60,9]
cannot access java.time.LocalDateTime
[ERROR] class file for java.time.LocalDateTime not found
[ERROR] <https://builds.apache.org/job/dir-kerby/ws/kerby-config/src/test/java/org/apache/kerby/config/ConfigImplTest.java>:[61,9]
cannot access java.time.OffsetDateTime
[ERROR] class file for java.time.OffsetDateTime not found
[ERROR] <https://builds.apache.org/job/dir-kerby/ws/kerby-config/src/test/java/org/apache/kerby/config/IniConfigTest.java>:[73,9]
cannot access java.time.OffsetTime
[ERROR] class file for java.time.OffsetTime not found
[ERROR] <https://builds.apache.org/job/dir-kerby/ws/kerby-config/src/test/java/org/apache/kerby/config/IniConfigTest.java>:[74,9]
cannot access java.time.LocalTime
[ERROR] class file for java.time.LocalTime not found
[ERROR] <https://builds.apache.org/job/dir-kerby/ws/kerby-config/src/test/java/org/apache/kerby/config/IniConfigTest.java>:[77,9]
cannot access java.time.LocalDate
[ERROR] class file for java.time.LocalDate not found
[ERROR] -> [Help 1]
[ERROR] 
[ERROR] To see the full stack trace of the errors, re-run Maven with the -e switch.
[ERROR] Re-run Maven using the -X switch to enable full debug logging.
[ERROR] 
[ERROR] For more information about the errors and possible solutions, please read the following
articles:
[ERROR] [Help 1] http://cwiki.apache.org/confluence/display/MAVEN/MojoFailureException
[ERROR] 
[ERROR] After correcting the problems, you can resume the build with the command
[ERROR]   mvn <goals> -rf :kerby-config

channel stopped

Mime
View raw message