directory-notifications mailing list archives

Site index · List index
Message view « Date » · « Thread »
Top « Date » · « Thread »
From gmcdon...@apache.org
Subject Build failed in Jenkins: directory-kerby #139
Date Sat, 19 Sep 2015 06:34:28 GMT
See <https://analysis.apache.org/jenkins/job/directory-kerby/139/changes>

Changes:

[jiajia.li] DIRKRB-413 Add the implementation of creating DHParameterSpec.

------------------------------------------
[...truncated 1797 lines...]
Iteration  14: 1.780 ms/op
Iteration  15: 1.632 ms/op
Iteration  16: 2.247 ms/op
Iteration  17: 2.381 ms/op
Iteration  18: 1.944 ms/op
Iteration  19: 1.710 ms/op
Iteration  20: 1.847 ms/op


Result "queryTest":
  1.889 ±(99.9%) 0.302 ms/op [Average]
  (min, avg, max) = (1.544, 1.889, 2.704), stdev = 0.348
  CI (99.9%): [1.588, 2.191] (assumes normal distribution)


# JMH 1.10.3 (released 64 days ago)
# VM version: JDK 1.7.0_65, VM 24.65-b04
# VM invoker: /x1/jenkins/jenkins-master/jenkins-home/tools/hudson.model.JDK/jdk1.7.0_65/jre/bin/java
# VM options: <none>
# Warmup: 5 iterations, 1 s each
# Measurement: 20 iterations, 1 s each
# Timeout: 10 min per iteration
# Threads: 1 thread, will synchronize iterations
# Benchmark mode: Average time, time/op
# Benchmark: org.apache.kerby.benchmark.KrbCodecBenchmark.decodeWithApacheDS

# Run progress: 44.44% complete, ETA 00:01:00
# Fork: 1 of 1
# Warmup Iteration   1: log4j:WARN No appenders could be found for logger (org.apache.directory.api.asn1.ber.Asn1Decoder).
log4j:WARN Please initialize the log4j system properly.
log4j:WARN See http://logging.apache.org/log4j/1.2/faq.html#noconfig for more info.
8.564 ms/op
# Warmup Iteration   2: 1.985 ms/op
# Warmup Iteration   3: 1.740 ms/op
# Warmup Iteration   4: 1.787 ms/op
# Warmup Iteration   5: 1.215 ms/op
Iteration   1: 1.222 ms/op
Iteration   2: 1.035 ms/op
Iteration   3: 1.078 ms/op
Iteration   4: 0.999 ms/op
Iteration   5: 1.241 ms/op
Iteration   6: 1.369 ms/op
Iteration   7: 1.405 ms/op
Iteration   8: 1.279 ms/op
Iteration   9: 1.248 ms/op
Iteration  10: 1.596 ms/op
Iteration  11: 1.494 ms/op
Iteration  12: 1.314 ms/op
Iteration  13: 1.118 ms/op
Iteration  14: 1.298 ms/op
Iteration  15: 1.246 ms/op
Iteration  16: 0.968 ms/op
Iteration  17: 1.061 ms/op
Iteration  18: 1.033 ms/op
Iteration  19: 1.021 ms/op
Iteration  20: 1.229 ms/op


Result "decodeWithApacheDS":
  1.213 ±(99.9%) 0.150 ms/op [Average]
  (min, avg, max) = (0.968, 1.213, 1.596), stdev = 0.173
  CI (99.9%): [1.063, 1.363] (assumes normal distribution)


# JMH 1.10.3 (released 64 days ago)
# VM version: JDK 1.7.0_65, VM 24.65-b04
# VM invoker: /x1/jenkins/jenkins-master/jenkins-home/tools/hudson.model.JDK/jdk1.7.0_65/jre/bin/java
# VM options: <none>
# Warmup: 5 iterations, 1 s each
# Measurement: 20 iterations, 1 s each
# Timeout: 10 min per iteration
# Threads: 1 thread, will synchronize iterations
# Benchmark mode: Average time, time/op
# Benchmark: org.apache.kerby.benchmark.KrbCodecBenchmark.decodeWithKerby

# Run progress: 72.22% complete, ETA 00:00:28
# Fork: 1 of 1
# Warmup Iteration   1: 1.289 ms/op
# Warmup Iteration   2: 0.155 ms/op
# Warmup Iteration   3: 0.031 ms/op
# Warmup Iteration   4: 0.027 ms/op
# Warmup Iteration   5: 0.020 ms/op
Iteration   1: 0.014 ms/op
Iteration   2: 0.022 ms/op
Iteration   3: 0.022 ms/op
Iteration   4: 0.026 ms/op
Iteration   5: 0.020 ms/op
Iteration   6: 0.027 ms/op
Iteration   7: 0.035 ms/op
Iteration   8: 0.017 ms/op
Iteration   9: 0.013 ms/op
Iteration  10: 0.010 ms/op
Iteration  11: 0.014 ms/op
Iteration  12: 0.016 ms/op
Iteration  13: 0.015 ms/op
Iteration  14: 0.011 ms/op
Iteration  15: 0.013 ms/op
Iteration  16: 0.010 ms/op
Iteration  17: 0.013 ms/op
Iteration  18: 0.017 ms/op
Iteration  19: 0.026 ms/op
Iteration  20: 0.013 ms/op


Result "decodeWithKerby":
  0.018 ±(99.9%) 0.006 ms/op [Average]
  (min, avg, max) = (0.010, 0.018, 0.035), stdev = 0.007
  CI (99.9%): [0.012, 0.024] (assumes normal distribution)


# Run complete. Total time: 00:01:40

Benchmark                             Mode  Cnt  Score   Error  Units
JsonBackendBenchmark.queryTest        avgt   20  1.889 ± 0.302  ms/op
KrbCodecBenchmark.decodeWithApacheDS  avgt   20  1.213 ± 0.150  ms/op
KrbCodecBenchmark.decodeWithKerby     avgt   20  0.018 ± 0.006  ms/op
[INFO] 
[INFO] --- maven-install-plugin:2.5.2:install (default-install) @ benchmark ---
[INFO] Installing <https://analysis.apache.org/jenkins/job/directory-kerby/ws/benchmark/target/benchmark-1.0.0-RC2-SNAPSHOT.jar>
to /x1/jenkins/mvn-repo/org/apache/kerby/benchmark/1.0.0-RC2-SNAPSHOT/benchmark-1.0.0-RC2-SNAPSHOT.jar
[INFO] Installing <https://analysis.apache.org/jenkins/job/directory-kerby/ws/benchmark/pom.xml>
to /x1/jenkins/mvn-repo/org/apache/kerby/benchmark/1.0.0-RC2-SNAPSHOT/benchmark-1.0.0-RC2-SNAPSHOT.pom
[INFO] ------------------------------------------------------------------------
[INFO] Reactor Summary:
[INFO] 
[INFO] Apache Kerby Project .............................. SUCCESS [8.910s]
[INFO] Kerby ASN1 Project ................................ SUCCESS [24.368s]
[INFO] Kerby Util ........................................ SUCCESS [4.541s]
[INFO] Third Party Projects .............................. SUCCESS [1.690s]
[INFO] not-yet-commons-ssl ............................... FAILURE [5.133s]
[INFO] Kerby Config ...................................... SUCCESS [6.316s]
[INFO] Kerby-kerb Project ................................ SUCCESS [1.603s]
[INFO] Kerby-kerb core ................................... SUCCESS [8.612s]
[INFO] Kerby-kerb Crypto ................................. SUCCESS [13.710s]
[INFO] Kerby-kerb Util ................................... SUCCESS [3.553s]
[INFO] kerby-kerb-coreTest ............................... SUCCESS [1.373s]
[INFO] Kerby-kerb Common ................................. SUCCESS [2.094s]
[INFO] Kerby-kerb Identity ............................... SUCCESS [1.608s]
[INFO] Kerby-kerb Identity Test .......................... SUCCESS [2.293s]
[INFO] Kerby-kerb Client ................................. SUCCESS [6.633s]
[INFO] Kerby-kerb Server ................................. SUCCESS [4.349s]
[INFO] Kerby-kerb Admin .................................. SUCCESS [4.540s]
[INFO] Kerb Simple Kdc ................................... SUCCESS [1.628s]
[INFO] Kerb Kdc Test ..................................... SUCCESS [1.834s]
[INFO] Kerby providers ................................... SUCCESS [0.863s]
[INFO] Token provider .................................... SUCCESS [2.851s]
[INFO] Kerb Integration Test ............................. SUCCESS [3.168s]
[INFO] Kerby-kerb client api all ......................... SUCCESS [1.456s]
[INFO] Kerby-kerb server all ............................. SUCCESS [1.881s]
[INFO] Kerby KDC Server .................................. SUCCESS [1.951s]
[INFO] Pki provider ...................................... SKIPPED
[INFO] Kdc Tool Project .................................. SUCCESS [0.621s]
[INFO] Client Tool ....................................... SKIPPED
[INFO] KDC Tool .......................................... SUCCESS [2.559s]
[INFO] Kerby Backend ..................................... SUCCESS [2.451s]
[INFO] Json identity backend ............................. SUCCESS [1.777s]
[INFO] Zookeeper identity backend ........................ SUCCESS [2.142s]
[INFO] Ldap identity backend ............................. SUCCESS [15.145s]
[INFO] Kerby Kdc Test .................................... SKIPPED
[INFO] Mavibot based backend ............................. SUCCESS [3.914s]
[INFO] Kerby Distribution ................................ SUCCESS [1.226s]
[INFO] KDC Dist .......................................... SUCCESS [1.676s]
[INFO] Tool Dist ......................................... SKIPPED
[INFO] Kerby benchmark ................................... SUCCESS [2:09.077s]
[INFO] ------------------------------------------------------------------------
[INFO] BUILD FAILURE
[INFO] ------------------------------------------------------------------------
[INFO] Total time: 4:48.789s
[INFO] Finished at: Sat Sep 19 06:34:18 UTC 2015
[INFO] Final Memory: 57M/357M
[INFO] ------------------------------------------------------------------------
Waiting for Jenkins to finish collecting data
[ERROR] Failed to execute goal org.apache.maven.plugins:maven-checkstyle-plugin:2.15:check
(validate) on project not-yet-commons-ssl: You have 20 Checkstyle violations. -> [Help
1]
[ERROR] 
[ERROR] To see the full stack trace of the errors, re-run Maven with the -e switch.
[ERROR] Re-run Maven using the -X switch to enable full debug logging.
[ERROR] 
[ERROR] For more information about the errors and possible solutions, please read the following
articles:
[ERROR] [Help 1] http://cwiki.apache.org/confluence/display/MAVEN/MojoFailureException
[ERROR] 
[ERROR] After correcting the problems, you can resume the build with the command
[ERROR]   mvn <goals> -rf :not-yet-commons-ssl
[JENKINS] Archiving <https://analysis.apache.org/jenkins/job/directory-kerby/ws/kerby-backend/ldap-backend/pom.xml>
to org.apache.kerby/ldap-backend/1.0.0-RC2-SNAPSHOT/ldap-backend-1.0.0-RC2-SNAPSHOT.pom
[JENKINS] Archiving <https://analysis.apache.org/jenkins/job/directory-kerby/ws/kerby-backend/ldap-backend/target/ldap-backend-1.0.0-RC2-SNAPSHOT.jar>
to org.apache.kerby/ldap-backend/1.0.0-RC2-SNAPSHOT/ldap-backend-1.0.0-RC2-SNAPSHOT.jar
[JENKINS] Archiving <https://analysis.apache.org/jenkins/job/directory-kerby/ws/kerby-backend/json-backend/pom.xml>
to org.apache.kerby/json-backend/1.0.0-RC2-SNAPSHOT/json-backend-1.0.0-RC2-SNAPSHOT.pom
[JENKINS] Archiving <https://analysis.apache.org/jenkins/job/directory-kerby/ws/kerby-backend/json-backend/target/json-backend-1.0.0-RC2-SNAPSHOT.jar>
to org.apache.kerby/json-backend/1.0.0-RC2-SNAPSHOT/json-backend-1.0.0-RC2-SNAPSHOT.jar
[JENKINS] Archiving <https://analysis.apache.org/jenkins/job/directory-kerby/ws/kerby-kdc-test/pom.xml>
to org.apache.kerby/kerby-kdc-test/1.0.0-RC2-SNAPSHOT/kerby-kdc-test-1.0.0-RC2-SNAPSHOT.pom
[JENKINS] Archiving <https://analysis.apache.org/jenkins/job/directory-kerby/ws/kerby-kerb/kerb-util/pom.xml>
to org.apache.kerby/kerb-util/1.0.0-RC2-SNAPSHOT/kerb-util-1.0.0-RC2-SNAPSHOT.pom
[JENKINS] Archiving <https://analysis.apache.org/jenkins/job/directory-kerby/ws/kerby-kerb/kerb-util/target/kerb-util-1.0.0-RC2-SNAPSHOT.jar>
to org.apache.kerby/kerb-util/1.0.0-RC2-SNAPSHOT/kerb-util-1.0.0-RC2-SNAPSHOT.jar
[JENKINS] Archiving <https://analysis.apache.org/jenkins/job/directory-kerby/ws/kerby-kerb/kerb-crypto/pom.xml>
to org.apache.kerby/kerb-crypto/1.0.0-RC2-SNAPSHOT/kerb-crypto-1.0.0-RC2-SNAPSHOT.pom
[JENKINS] Archiving <https://analysis.apache.org/jenkins/job/directory-kerby/ws/kerby-kerb/kerb-crypto/target/kerb-crypto-1.0.0-RC2-SNAPSHOT.jar>
to org.apache.kerby/kerb-crypto/1.0.0-RC2-SNAPSHOT/kerb-crypto-1.0.0-RC2-SNAPSHOT.jar
[JENKINS] Archiving <https://analysis.apache.org/jenkins/job/directory-kerby/ws/kerby-provider/token-provider/pom.xml>
to org.apache.kerby/token-provider/1.0.0-RC2-SNAPSHOT/token-provider-1.0.0-RC2-SNAPSHOT.pom
[JENKINS] Archiving <https://analysis.apache.org/jenkins/job/directory-kerby/ws/kerby-provider/token-provider/target/token-provider-1.0.0-RC2-SNAPSHOT.jar>
to org.apache.kerby/token-provider/1.0.0-RC2-SNAPSHOT/token-provider-1.0.0-RC2-SNAPSHOT.jar
[JENKINS] Archiving <https://analysis.apache.org/jenkins/job/directory-kerby/ws/kerby-kerb/kerb-client-api-all/pom.xml>
to org.apache.kerby/kerb-client-api-all/1.0.0-RC2-SNAPSHOT/kerb-client-api-all-1.0.0-RC2-SNAPSHOT.pom
[JENKINS] Archiving <https://analysis.apache.org/jenkins/job/directory-kerby/ws/kerby-kerb/kerb-client-api-all/target/kerb-client-api-all-1.0.0-RC2-SNAPSHOT.jar>
to org.apache.kerby/kerb-client-api-all/1.0.0-RC2-SNAPSHOT/kerb-client-api-all-1.0.0-RC2-SNAPSHOT.jar
[JENKINS] Archiving <https://analysis.apache.org/jenkins/job/directory-kerby/ws/kerby-tool/client-tool/pom.xml>
to org.apache.kerby/client-tool/1.0.0-RC2-SNAPSHOT/client-tool-1.0.0-RC2-SNAPSHOT.pom
[JENKINS] Archiving <https://analysis.apache.org/jenkins/job/directory-kerby/ws/kerby-dist/pom.xml>
to org.apache.kerby/kerby-dist/1.0.0-RC2-SNAPSHOT/kerby-dist-1.0.0-RC2-SNAPSHOT.pom
[JENKINS] Archiving <https://analysis.apache.org/jenkins/job/directory-kerby/ws/3rdparty/pom.xml>
to org.apache.kerby/3rdparty/1.0.0-RC2-SNAPSHOT/3rdparty-1.0.0-RC2-SNAPSHOT.pom
[JENKINS] Archiving <https://analysis.apache.org/jenkins/job/directory-kerby/ws/kerby-kerb/kerb-server/pom.xml>
to org.apache.kerby/kerb-server/1.0.0-RC2-SNAPSHOT/kerb-server-1.0.0-RC2-SNAPSHOT.pom
[JENKINS] Archiving <https://analysis.apache.org/jenkins/job/directory-kerby/ws/kerby-kerb/kerb-server/target/kerb-server-1.0.0-RC2-SNAPSHOT.jar>
to org.apache.kerby/kerb-server/1.0.0-RC2-SNAPSHOT/kerb-server-1.0.0-RC2-SNAPSHOT.jar
[JENKINS] Archiving <https://analysis.apache.org/jenkins/job/directory-kerby/ws/kerby-tool/kdc-tool/pom.xml>
to org.apache.kerby/kdc-tool/1.0.0-RC2-SNAPSHOT/kdc-tool-1.0.0-RC2-SNAPSHOT.pom
[JENKINS] Archiving <https://analysis.apache.org/jenkins/job/directory-kerby/ws/kerby-tool/kdc-tool/target/kdc-tool-1.0.0-RC2-SNAPSHOT.jar>
to org.apache.kerby/kdc-tool/1.0.0-RC2-SNAPSHOT/kdc-tool-1.0.0-RC2-SNAPSHOT.jar
[JENKINS] Archiving <https://analysis.apache.org/jenkins/job/directory-kerby/ws/kerby-dist/kdc-dist/pom.xml>
to org.apache.kerby/kdc-dist/1.0.0-RC2-SNAPSHOT/kdc-dist-1.0.0-RC2-SNAPSHOT.pom
[JENKINS] Archiving <https://analysis.apache.org/jenkins/job/directory-kerby/ws/kerby-asn1/pom.xml>
to org.apache.kerby/kerby-asn1/1.0.0-RC2-SNAPSHOT/kerby-asn1-1.0.0-RC2-SNAPSHOT.pom
[JENKINS] Archiving <https://analysis.apache.org/jenkins/job/directory-kerby/ws/kerby-asn1/target/kerby-asn1-1.0.0-RC2-SNAPSHOT.jar>
to org.apache.kerby/kerby-asn1/1.0.0-RC2-SNAPSHOT/kerby-asn1-1.0.0-RC2-SNAPSHOT.jar
[JENKINS] Archiving <https://analysis.apache.org/jenkins/job/directory-kerby/ws/benchmark/pom.xml>
to org.apache.kerby/benchmark/1.0.0-RC2-SNAPSHOT/benchmark-1.0.0-RC2-SNAPSHOT.pom
[JENKINS] Archiving <https://analysis.apache.org/jenkins/job/directory-kerby/ws/benchmark/target/benchmark-1.0.0-RC2-SNAPSHOT.jar>
to org.apache.kerby/benchmark/1.0.0-RC2-SNAPSHOT/benchmark-1.0.0-RC2-SNAPSHOT.jar
[JENKINS] Archiving <https://analysis.apache.org/jenkins/job/directory-kerby/ws/kerby-provider/pom.xml>
to org.apache.kerby/kerby-provider/1.0.0-RC2-SNAPSHOT/kerby-provider-1.0.0-RC2-SNAPSHOT.pom
[JENKINS] Archiving <https://analysis.apache.org/jenkins/job/directory-kerby/ws/kerby-kerb/kerb-admin/pom.xml>
to org.apache.kerby/kerb-admin/1.0.0-RC2-SNAPSHOT/kerb-admin-1.0.0-RC2-SNAPSHOT.pom
[JENKINS] Archiving <https://analysis.apache.org/jenkins/job/directory-kerby/ws/kerby-kerb/kerb-admin/target/kerb-admin-1.0.0-RC2-SNAPSHOT.jar>
to org.apache.kerby/kerb-admin/1.0.0-RC2-SNAPSHOT/kerb-admin-1.0.0-RC2-SNAPSHOT.jar
[JENKINS] Archiving <https://analysis.apache.org/jenkins/job/directory-kerby/ws/kerby-kerb/integration-test/pom.xml>
to org.apache.kerby/integration-test/1.0.0-RC2-SNAPSHOT/integration-test-1.0.0-RC2-SNAPSHOT.pom
[JENKINS] Archiving <https://analysis.apache.org/jenkins/job/directory-kerby/ws/kerby-kerb/integration-test/target/integration-test-1.0.0-RC2-SNAPSHOT.jar>
to org.apache.kerby/integration-test/1.0.0-RC2-SNAPSHOT/integration-test-1.0.0-RC2-SNAPSHOT.jar
[JENKINS] Archiving <https://analysis.apache.org/jenkins/job/directory-kerby/ws/kerby-kerb/kerb-simplekdc/pom.xml>
to org.apache.kerby/kerb-simplekdc/1.0.0-RC2-SNAPSHOT/kerb-simplekdc-1.0.0-RC2-SNAPSHOT.pom
[JENKINS] Archiving <https://analysis.apache.org/jenkins/job/directory-kerby/ws/kerby-kerb/kerb-simplekdc/target/kerb-simplekdc-1.0.0-RC2-SNAPSHOT.jar>
to org.apache.kerby/kerb-simplekdc/1.0.0-RC2-SNAPSHOT/kerb-simplekdc-1.0.0-RC2-SNAPSHOT.jar
[JENKINS] Archiving <https://analysis.apache.org/jenkins/job/directory-kerby/ws/kerby-kerb/kerb-core-test/pom.xml>
to org.apache.kerby/kerb-core-test/1.0.0-RC2-SNAPSHOT/kerb-core-test-1.0.0-RC2-SNAPSHOT.pom
[JENKINS] Archiving <https://analysis.apache.org/jenkins/job/directory-kerby/ws/kerby-kerb/kerb-core-test/target/kerb-core-test-1.0.0-RC2-SNAPSHOT.jar>
to org.apache.kerby/kerb-core-test/1.0.0-RC2-SNAPSHOT/kerb-core-test-1.0.0-RC2-SNAPSHOT.jar
[JENKINS] Archiving <https://analysis.apache.org/jenkins/job/directory-kerby/ws/3rdparty/not-yet-commons-ssl/pom.xml>
to org.apache.kerby/not-yet-commons-ssl/1.0.0-RC2-SNAPSHOT/not-yet-commons-ssl-1.0.0-RC2-SNAPSHOT.pom
[JENKINS] Archiving <https://analysis.apache.org/jenkins/job/directory-kerby/ws/kerby-kerb/kerb-client/pom.xml>
to org.apache.kerby/kerb-client/1.0.0-RC2-SNAPSHOT/kerb-client-1.0.0-RC2-SNAPSHOT.pom
[JENKINS] Archiving <https://analysis.apache.org/jenkins/job/directory-kerby/ws/kerby-kerb/kerb-client/target/kerb-client-1.0.0-RC2-SNAPSHOT.jar>
to org.apache.kerby/kerb-client/1.0.0-RC2-SNAPSHOT/kerb-client-1.0.0-RC2-SNAPSHOT.jar
[JENKINS] Archiving <https://analysis.apache.org/jenkins/job/directory-kerby/ws/kerby-kerb/pom.xml>
to org.apache.kerby/kerby-kerb/1.0.0-RC2-SNAPSHOT/kerby-kerb-1.0.0-RC2-SNAPSHOT.pom
[JENKINS] Archiving <https://analysis.apache.org/jenkins/job/directory-kerby/ws/kerby-backend/mavibot-backend/pom.xml>
to org.apache.kerby/mavibot-backend/1.0.0-RC2-SNAPSHOT/mavibot-backend-1.0.0-RC2-SNAPSHOT.pom
[JENKINS] Archiving <https://analysis.apache.org/jenkins/job/directory-kerby/ws/kerby-backend/mavibot-backend/target/mavibot-backend-1.0.0-RC2-SNAPSHOT.jar>
to org.apache.kerby/mavibot-backend/1.0.0-RC2-SNAPSHOT/mavibot-backend-1.0.0-RC2-SNAPSHOT.jar
[JENKINS] Archiving <https://analysis.apache.org/jenkins/job/directory-kerby/ws/kerby-backend/zookeeper-backend/pom.xml>
to org.apache.kerby/zookeeper-backend/1.0.0-RC2-SNAPSHOT/zookeeper-backend-1.0.0-RC2-SNAPSHOT.pom
[JENKINS] Archiving <https://analysis.apache.org/jenkins/job/directory-kerby/ws/kerby-backend/zookeeper-backend/target/zookeeper-backend-1.0.0-RC2-SNAPSHOT.jar>
to org.apache.kerby/zookeeper-backend/1.0.0-RC2-SNAPSHOT/zookeeper-backend-1.0.0-RC2-SNAPSHOT.jar
[JENKINS] Archiving <https://analysis.apache.org/jenkins/job/directory-kerby/ws/kerby-config/pom.xml>
to org.apache.kerby/kerby-config/1.0.0-RC2-SNAPSHOT/kerby-config-1.0.0-RC2-SNAPSHOT.pom
[JENKINS] Archiving <https://analysis.apache.org/jenkins/job/directory-kerby/ws/kerby-config/target/kerby-config-1.0.0-RC2-SNAPSHOT.jar>
to org.apache.kerby/kerby-config/1.0.0-RC2-SNAPSHOT/kerby-config-1.0.0-RC2-SNAPSHOT.jar
[JENKINS] Archiving <https://analysis.apache.org/jenkins/job/directory-kerby/ws/kerby-util/pom.xml>
to org.apache.kerby/kerby-util/1.0.0-RC2-SNAPSHOT/kerby-util-1.0.0-RC2-SNAPSHOT.pom
[JENKINS] Archiving <https://analysis.apache.org/jenkins/job/directory-kerby/ws/kerby-util/target/kerby-util-1.0.0-RC2-SNAPSHOT.jar>
to org.apache.kerby/kerby-util/1.0.0-RC2-SNAPSHOT/kerby-util-1.0.0-RC2-SNAPSHOT.jar
[JENKINS] Archiving <https://analysis.apache.org/jenkins/job/directory-kerby/ws/kerby-kerb/kerb-common/pom.xml>
to org.apache.kerby/kerb-common/1.0.0-RC2-SNAPSHOT/kerb-common-1.0.0-RC2-SNAPSHOT.pom
[JENKINS] Archiving <https://analysis.apache.org/jenkins/job/directory-kerby/ws/kerby-kerb/kerb-common/target/kerb-common-1.0.0-RC2-SNAPSHOT.jar>
to org.apache.kerby/kerb-common/1.0.0-RC2-SNAPSHOT/kerb-common-1.0.0-RC2-SNAPSHOT.jar
[JENKINS] Archiving <https://analysis.apache.org/jenkins/job/directory-kerby/ws/kerby-kerb/kerb-core/pom.xml>
to org.apache.kerby/kerb-core/1.0.0-RC2-SNAPSHOT/kerb-core-1.0.0-RC2-SNAPSHOT.pom
[JENKINS] Archiving <https://analysis.apache.org/jenkins/job/directory-kerby/ws/kerby-kerb/kerb-core/target/kerb-core-1.0.0-RC2-SNAPSHOT.jar>
to org.apache.kerby/kerb-core/1.0.0-RC2-SNAPSHOT/kerb-core-1.0.0-RC2-SNAPSHOT.jar
[JENKINS] Archiving <https://analysis.apache.org/jenkins/job/directory-kerby/ws/kerby-kdc/pom.xml>
to org.apache.kerby/kerby-kdc/1.0.0-RC2-SNAPSHOT/kerby-kdc-1.0.0-RC2-SNAPSHOT.pom
[JENKINS] Archiving <https://analysis.apache.org/jenkins/job/directory-kerby/ws/kerby-kdc/target/kerby-kdc-1.0.0-RC2-SNAPSHOT.jar>
to org.apache.kerby/kerby-kdc/1.0.0-RC2-SNAPSHOT/kerby-kdc-1.0.0-RC2-SNAPSHOT.jar
[JENKINS] Archiving <https://analysis.apache.org/jenkins/job/directory-kerby/ws/kerby-kerb/kerb-identity/pom.xml>
to org.apache.kerby/kerb-identity/1.0.0-RC2-SNAPSHOT/kerb-identity-1.0.0-RC2-SNAPSHOT.pom
[JENKINS] Archiving <https://analysis.apache.org/jenkins/job/directory-kerby/ws/kerby-kerb/kerb-identity/target/kerb-identity-1.0.0-RC2-SNAPSHOT.jar>
to org.apache.kerby/kerb-identity/1.0.0-RC2-SNAPSHOT/kerb-identity-1.0.0-RC2-SNAPSHOT.jar
[JENKINS] Archiving <https://analysis.apache.org/jenkins/job/directory-kerby/ws/kerby-backend/pom.xml>
to org.apache.kerby/kerby-backend/1.0.0-RC2-SNAPSHOT/kerby-backend-1.0.0-RC2-SNAPSHOT.pom
[JENKINS] Archiving <https://analysis.apache.org/jenkins/job/directory-kerby/ws/kerby-tool/pom.xml>
to org.apache.kerby/kerby-tool/1.0.0-RC2-SNAPSHOT/kerby-tool-1.0.0-RC2-SNAPSHOT.pom
[JENKINS] Archiving <https://analysis.apache.org/jenkins/job/directory-kerby/ws/pom.xml>
to org.apache.kerby/kerby-all/1.0.0-RC2-SNAPSHOT/kerby-all-1.0.0-RC2-SNAPSHOT.pom
[JENKINS] Archiving <https://analysis.apache.org/jenkins/job/directory-kerby/ws/kerby-kerb/kerb-kdc-test/pom.xml>
to org.apache.kerby/kerb-kdc-test/1.0.0-RC2-SNAPSHOT/kerb-kdc-test-1.0.0-RC2-SNAPSHOT.pom
[JENKINS] Archiving <https://analysis.apache.org/jenkins/job/directory-kerby/ws/kerby-kerb/kerb-kdc-test/target/kerb-kdc-test-1.0.0-RC2-SNAPSHOT.jar>
to org.apache.kerby/kerb-kdc-test/1.0.0-RC2-SNAPSHOT/kerb-kdc-test-1.0.0-RC2-SNAPSHOT.jar
[JENKINS] Archiving <https://analysis.apache.org/jenkins/job/directory-kerby/ws/kerby-kerb/kerb-kdc-test/target/kerb-kdc-test-1.0.0-RC2-SNAPSHOT-tests.jar>
to org.apache.kerby/kerb-kdc-test/1.0.0-RC2-SNAPSHOT/kerb-kdc-test-1.0.0-RC2-SNAPSHOT-tests.jar
[JENKINS] Archiving <https://analysis.apache.org/jenkins/job/directory-kerby/ws/kerby-dist/tool-dist/pom.xml>
to org.apache.kerby/tool-dist/1.0.0-RC2-SNAPSHOT/tool-dist-1.0.0-RC2-SNAPSHOT.pom
[JENKINS] Archiving <https://analysis.apache.org/jenkins/job/directory-kerby/ws/kerby-provider/pki-provider/pom.xml>
to org.apache.kerby/pki-provider/1.0.0-RC2-SNAPSHOT/pki-provider-1.0.0-RC2-SNAPSHOT.pom
[JENKINS] Archiving <https://analysis.apache.org/jenkins/job/directory-kerby/ws/kerby-kerb/kerb-identity-test/pom.xml>
to org.apache.kerby/kerb-identity-test/1.0.0-RC2-SNAPSHOT/kerb-identity-test-1.0.0-RC2-SNAPSHOT.pom
[JENKINS] Archiving <https://analysis.apache.org/jenkins/job/directory-kerby/ws/kerby-kerb/kerb-identity-test/target/kerb-identity-test-1.0.0-RC2-SNAPSHOT.jar>
to org.apache.kerby/kerb-identity-test/1.0.0-RC2-SNAPSHOT/kerb-identity-test-1.0.0-RC2-SNAPSHOT.jar
[JENKINS] Archiving <https://analysis.apache.org/jenkins/job/directory-kerby/ws/kerby-kerb/kerb-server-api-all/pom.xml>
to org.apache.kerby/kerb-server-api-all/1.0.0-RC2-SNAPSHOT/kerb-server-api-all-1.0.0-RC2-SNAPSHOT.pom
[JENKINS] Archiving <https://analysis.apache.org/jenkins/job/directory-kerby/ws/kerby-kerb/kerb-server-api-all/target/kerb-server-api-all-1.0.0-RC2-SNAPSHOT.jar>
to org.apache.kerby/kerb-server-api-all/1.0.0-RC2-SNAPSHOT/kerb-server-api-all-1.0.0-RC2-SNAPSHOT.jar
Sending e-mails to: notifications@directory.apache.org
channel stopped
Skipping sonar analysis due to bad build status FAILURE

Mime
View raw message