directory-notifications mailing list archives

Site index · List index
Message view « Date » · « Thread »
Top « Date » · « Thread »
From gmcdon...@apache.org
Subject Build failed in Jenkins: directory-kerby #129
Date Thu, 10 Sep 2015 06:33:34 GMT
See <https://analysis.apache.org/jenkins/job/directory-kerby/129/changes>

Changes:

[jiajia.li] DIRKRB-406 Add the anonymous PKINIT support in kinit tool.

[jiajia.li] Fix the kinit tool issue.

------------------------------------------
[...truncated 1797 lines...]
Iteration  14: 2.243 ms/op
Iteration  15: 2.134 ms/op
Iteration  16: 2.120 ms/op
Iteration  17: 2.537 ms/op
Iteration  18: 2.417 ms/op
Iteration  19: 1.630 ms/op
Iteration  20: 1.868 ms/op


Result "queryTest":
  2.016 ±(99.9%) 0.288 ms/op [Average]
  (min, avg, max) = (1.630, 2.016, 2.837), stdev = 0.332
  CI (99.9%): [1.728, 2.304] (assumes normal distribution)


# JMH 1.10.3 (released 55 days ago)
# VM version: JDK 1.7.0_65, VM 24.65-b04
# VM invoker: /x1/jenkins/jenkins-master/jenkins-home/tools/hudson.model.JDK/jdk1.7.0_65/jre/bin/java
# VM options: <none>
# Warmup: 5 iterations, 1 s each
# Measurement: 20 iterations, 1 s each
# Timeout: 10 min per iteration
# Threads: 1 thread, will synchronize iterations
# Benchmark mode: Average time, time/op
# Benchmark: org.apache.kerby.benchmark.KrbCodecBenchmark.decodeWithApacheDS

# Run progress: 44.44% complete, ETA 00:01:02
# Fork: 1 of 1
# Warmup Iteration   1: log4j:WARN No appenders could be found for logger (org.apache.directory.api.asn1.ber.Asn1Decoder).
log4j:WARN Please initialize the log4j system properly.
log4j:WARN See http://logging.apache.org/log4j/1.2/faq.html#noconfig for more info.
34.824 ms/op
# Warmup Iteration   2: 3.251 ms/op
# Warmup Iteration   3: 3.573 ms/op
# Warmup Iteration   4: 2.583 ms/op
# Warmup Iteration   5: 1.492 ms/op
Iteration   1: 1.429 ms/op
Iteration   2: 1.730 ms/op
Iteration   3: 1.491 ms/op
Iteration   4: 1.289 ms/op
Iteration   5: 1.224 ms/op
Iteration   6: 1.016 ms/op
Iteration   7: 0.991 ms/op
Iteration   8: 0.997 ms/op
Iteration   9: 1.197 ms/op
Iteration  10: 1.085 ms/op
Iteration  11: 1.126 ms/op
Iteration  12: 1.099 ms/op
Iteration  13: 1.067 ms/op
Iteration  14: 1.008 ms/op
Iteration  15: 0.996 ms/op
Iteration  16: 1.018 ms/op
Iteration  17: 1.014 ms/op
Iteration  18: 1.383 ms/op
Iteration  19: 1.122 ms/op
Iteration  20: 0.976 ms/op


Result "decodeWithApacheDS":
  1.163 ±(99.9%) 0.178 ms/op [Average]
  (min, avg, max) = (0.976, 1.163, 1.730), stdev = 0.205
  CI (99.9%): [0.985, 1.341] (assumes normal distribution)


# JMH 1.10.3 (released 55 days ago)
# VM version: JDK 1.7.0_65, VM 24.65-b04
# VM invoker: /x1/jenkins/jenkins-master/jenkins-home/tools/hudson.model.JDK/jdk1.7.0_65/jre/bin/java
# VM options: <none>
# Warmup: 5 iterations, 1 s each
# Measurement: 20 iterations, 1 s each
# Timeout: 10 min per iteration
# Threads: 1 thread, will synchronize iterations
# Benchmark mode: Average time, time/op
# Benchmark: org.apache.kerby.benchmark.KrbCodecBenchmark.decodeWithKerby

# Run progress: 72.22% complete, ETA 00:00:29
# Fork: 1 of 1
# Warmup Iteration   1: 0.191 ms/op
# Warmup Iteration   2: 0.015 ms/op
# Warmup Iteration   3: 0.011 ms/op
# Warmup Iteration   4: 0.013 ms/op
# Warmup Iteration   5: 0.011 ms/op
Iteration   1: 0.009 ms/op
Iteration   2: 0.011 ms/op
Iteration   3: 0.013 ms/op
Iteration   4: 0.010 ms/op
Iteration   5: 0.010 ms/op
Iteration   6: 0.010 ms/op
Iteration   7: 0.009 ms/op
Iteration   8: 0.010 ms/op
Iteration   9: 0.009 ms/op
Iteration  10: 0.009 ms/op
Iteration  11: 0.009 ms/op
Iteration  12: 0.010 ms/op
Iteration  13: 0.010 ms/op
Iteration  14: 0.010 ms/op
Iteration  15: 0.010 ms/op
Iteration  16: 0.010 ms/op
Iteration  17: 0.010 ms/op
Iteration  18: 0.010 ms/op
Iteration  19: 0.009 ms/op
Iteration  20: 0.009 ms/op


Result "decodeWithKerby":
  0.010 ±(99.9%) 0.001 ms/op [Average]
  (min, avg, max) = (0.009, 0.010, 0.013), stdev = 0.001
  CI (99.9%): [0.009, 0.010] (assumes normal distribution)


# Run complete. Total time: 00:01:42

Benchmark                             Mode  Cnt  Score   Error  Units
JsonBackendBenchmark.queryTest        avgt   20  2.016 ± 0.288  ms/op
KrbCodecBenchmark.decodeWithApacheDS  avgt   20  1.163 ± 0.178  ms/op
KrbCodecBenchmark.decodeWithKerby     avgt   20  0.010 ± 0.001  ms/op
[INFO] 
[INFO] --- maven-install-plugin:2.5.2:install (default-install) @ benchmark ---
[INFO] Installing <https://analysis.apache.org/jenkins/job/directory-kerby/ws/benchmark/target/benchmark-1.0.0-RC2-SNAPSHOT.jar>
to /x1/jenkins/mvn-repo/org/apache/kerby/benchmark/1.0.0-RC2-SNAPSHOT/benchmark-1.0.0-RC2-SNAPSHOT.jar
[INFO] Installing <https://analysis.apache.org/jenkins/job/directory-kerby/ws/benchmark/pom.xml>
to /x1/jenkins/mvn-repo/org/apache/kerby/benchmark/1.0.0-RC2-SNAPSHOT/benchmark-1.0.0-RC2-SNAPSHOT.pom
[INFO] ------------------------------------------------------------------------
[INFO] Reactor Summary:
[INFO] 
[INFO] Apache Kerby Project .............................. SUCCESS [10.531s]
[INFO] Kerby ASN1 Project ................................ SUCCESS [15.124s]
[INFO] Kerby Util ........................................ SUCCESS [4.769s]
[INFO] Third Party Projects .............................. SUCCESS [0.855s]
[INFO] not-yet-commons-ssl ............................... FAILURE [4.848s]
[INFO] Kerby Config ...................................... SUCCESS [4.492s]
[INFO] Kerby-kerb Project ................................ SUCCESS [1.224s]
[INFO] Kerby-kerb core ................................... SUCCESS [9.079s]
[INFO] Kerby-kerb Crypto ................................. SUCCESS [8.692s]
[INFO] Kerby-kerb Util ................................... SUCCESS [3.135s]
[INFO] kerby-kerb-coreTest ............................... SUCCESS [3.397s]
[INFO] Kerby-kerb Common ................................. SUCCESS [3.526s]
[INFO] Kerby-kerb Identity ............................... SUCCESS [2.444s]
[INFO] Kerby-kerb Identity Test .......................... SUCCESS [3.962s]
[INFO] Kerby-kerb Client ................................. SUCCESS [6.290s]
[INFO] Kerby-kerb Server ................................. SUCCESS [5.159s]
[INFO] Kerby-kerb Admin .................................. SUCCESS [3.917s]
[INFO] Kerb Simple Kdc ................................... SUCCESS [3.171s]
[INFO] Kerb Kdc Test ..................................... SUCCESS [3.108s]
[INFO] Kerby providers ................................... SUCCESS [1.964s]
[INFO] Token provider .................................... SUCCESS [3.688s]
[INFO] Kerb Integration Test ............................. SUCCESS [5.221s]
[INFO] Kerby-kerb client api all ......................... SUCCESS [2.670s]
[INFO] Kerby-kerb server all ............................. SUCCESS [2.898s]
[INFO] Kerby KDC Server .................................. SUCCESS [3.135s]
[INFO] Pki provider ...................................... SKIPPED
[INFO] Kdc Tool Project .................................. SUCCESS [1.423s]
[INFO] Client Tool ....................................... SKIPPED
[INFO] KDC Tool .......................................... SUCCESS [2.701s]
[INFO] Kerby Backend ..................................... SUCCESS [1.519s]
[INFO] Json identity backend ............................. SUCCESS [3.602s]
[INFO] Zookeeper identity backend ........................ SUCCESS [3.377s]
[INFO] Ldap identity backend ............................. SUCCESS [14.393s]
[INFO] Kerby Kdc Test .................................... SKIPPED
[INFO] Mavibot based backend ............................. SUCCESS [2.714s]
[INFO] Kerby Distribution ................................ SUCCESS [0.681s]
[INFO] KDC Dist .......................................... SUCCESS [2.324s]
[INFO] Tool Dist ......................................... SKIPPED
[INFO] Kerby benchmark ................................... SUCCESS [2:04.705s]
[INFO] ------------------------------------------------------------------------
[INFO] BUILD FAILURE
[INFO] ------------------------------------------------------------------------
[INFO] Total time: 4:42.535s
[INFO] Finished at: Thu Sep 10 06:33:31 UTC 2015
[INFO] Final Memory: 79M/299M
[INFO] ------------------------------------------------------------------------
Waiting for Jenkins to finish collecting data
[ERROR] Failed to execute goal org.apache.maven.plugins:maven-checkstyle-plugin:2.15:check
(validate) on project not-yet-commons-ssl: You have 20 Checkstyle violations. -> [Help
1]
[ERROR] 
[ERROR] To see the full stack trace of the errors, re-run Maven with the -e switch.
[ERROR] Re-run Maven using the -X switch to enable full debug logging.
[ERROR] 
[ERROR] For more information about the errors and possible solutions, please read the following
articles:
[ERROR] [Help 1] http://cwiki.apache.org/confluence/display/MAVEN/MojoFailureException
[ERROR] 
[ERROR] After correcting the problems, you can resume the build with the command
[ERROR]   mvn <goals> -rf :not-yet-commons-ssl
[JENKINS] Archiving <https://analysis.apache.org/jenkins/job/directory-kerby/ws/kerby-backend/ldap-backend/pom.xml>
to org.apache.kerby/ldap-backend/1.0.0-RC2-SNAPSHOT/ldap-backend-1.0.0-RC2-SNAPSHOT.pom
[JENKINS] Archiving <https://analysis.apache.org/jenkins/job/directory-kerby/ws/kerby-backend/ldap-backend/target/ldap-backend-1.0.0-RC2-SNAPSHOT.jar>
to org.apache.kerby/ldap-backend/1.0.0-RC2-SNAPSHOT/ldap-backend-1.0.0-RC2-SNAPSHOT.jar
[JENKINS] Archiving <https://analysis.apache.org/jenkins/job/directory-kerby/ws/kerby-backend/json-backend/pom.xml>
to org.apache.kerby/json-backend/1.0.0-RC2-SNAPSHOT/json-backend-1.0.0-RC2-SNAPSHOT.pom
[JENKINS] Archiving <https://analysis.apache.org/jenkins/job/directory-kerby/ws/kerby-backend/json-backend/target/json-backend-1.0.0-RC2-SNAPSHOT.jar>
to org.apache.kerby/json-backend/1.0.0-RC2-SNAPSHOT/json-backend-1.0.0-RC2-SNAPSHOT.jar
[JENKINS] Archiving <https://analysis.apache.org/jenkins/job/directory-kerby/ws/kerby-kdc-test/pom.xml>
to org.apache.kerby/kerby-kdc-test/1.0.0-RC2-SNAPSHOT/kerby-kdc-test-1.0.0-RC2-SNAPSHOT.pom
[JENKINS] Archiving <https://analysis.apache.org/jenkins/job/directory-kerby/ws/kerby-kerb/kerb-util/pom.xml>
to org.apache.kerby/kerb-util/1.0.0-RC2-SNAPSHOT/kerb-util-1.0.0-RC2-SNAPSHOT.pom
[JENKINS] Archiving <https://analysis.apache.org/jenkins/job/directory-kerby/ws/kerby-kerb/kerb-util/target/kerb-util-1.0.0-RC2-SNAPSHOT.jar>
to org.apache.kerby/kerb-util/1.0.0-RC2-SNAPSHOT/kerb-util-1.0.0-RC2-SNAPSHOT.jar
[JENKINS] Archiving <https://analysis.apache.org/jenkins/job/directory-kerby/ws/kerby-kerb/kerb-crypto/pom.xml>
to org.apache.kerby/kerb-crypto/1.0.0-RC2-SNAPSHOT/kerb-crypto-1.0.0-RC2-SNAPSHOT.pom
[JENKINS] Archiving <https://analysis.apache.org/jenkins/job/directory-kerby/ws/kerby-kerb/kerb-crypto/target/kerb-crypto-1.0.0-RC2-SNAPSHOT.jar>
to org.apache.kerby/kerb-crypto/1.0.0-RC2-SNAPSHOT/kerb-crypto-1.0.0-RC2-SNAPSHOT.jar
[JENKINS] Archiving <https://analysis.apache.org/jenkins/job/directory-kerby/ws/kerby-provider/token-provider/pom.xml>
to org.apache.kerby/token-provider/1.0.0-RC2-SNAPSHOT/token-provider-1.0.0-RC2-SNAPSHOT.pom
[JENKINS] Archiving <https://analysis.apache.org/jenkins/job/directory-kerby/ws/kerby-provider/token-provider/target/token-provider-1.0.0-RC2-SNAPSHOT.jar>
to org.apache.kerby/token-provider/1.0.0-RC2-SNAPSHOT/token-provider-1.0.0-RC2-SNAPSHOT.jar
[JENKINS] Archiving <https://analysis.apache.org/jenkins/job/directory-kerby/ws/kerby-kerb/kerb-client-api-all/pom.xml>
to org.apache.kerby/kerb-client-api-all/1.0.0-RC2-SNAPSHOT/kerb-client-api-all-1.0.0-RC2-SNAPSHOT.pom
[JENKINS] Archiving <https://analysis.apache.org/jenkins/job/directory-kerby/ws/kerby-kerb/kerb-client-api-all/target/kerb-client-api-all-1.0.0-RC2-SNAPSHOT.jar>
to org.apache.kerby/kerb-client-api-all/1.0.0-RC2-SNAPSHOT/kerb-client-api-all-1.0.0-RC2-SNAPSHOT.jar
[JENKINS] Archiving <https://analysis.apache.org/jenkins/job/directory-kerby/ws/kerby-tool/client-tool/pom.xml>
to org.apache.kerby/client-tool/1.0.0-RC2-SNAPSHOT/client-tool-1.0.0-RC2-SNAPSHOT.pom
[JENKINS] Archiving <https://analysis.apache.org/jenkins/job/directory-kerby/ws/kerby-dist/pom.xml>
to org.apache.kerby/kerby-dist/1.0.0-RC2-SNAPSHOT/kerby-dist-1.0.0-RC2-SNAPSHOT.pom
[JENKINS] Archiving <https://analysis.apache.org/jenkins/job/directory-kerby/ws/3rdparty/pom.xml>
to org.apache.kerby/3rdparty/1.0.0-RC2-SNAPSHOT/3rdparty-1.0.0-RC2-SNAPSHOT.pom
[JENKINS] Archiving <https://analysis.apache.org/jenkins/job/directory-kerby/ws/kerby-kerb/kerb-server/pom.xml>
to org.apache.kerby/kerb-server/1.0.0-RC2-SNAPSHOT/kerb-server-1.0.0-RC2-SNAPSHOT.pom
[JENKINS] Archiving <https://analysis.apache.org/jenkins/job/directory-kerby/ws/kerby-kerb/kerb-server/target/kerb-server-1.0.0-RC2-SNAPSHOT.jar>
to org.apache.kerby/kerb-server/1.0.0-RC2-SNAPSHOT/kerb-server-1.0.0-RC2-SNAPSHOT.jar
[JENKINS] Archiving <https://analysis.apache.org/jenkins/job/directory-kerby/ws/kerby-tool/kdc-tool/pom.xml>
to org.apache.kerby/kdc-tool/1.0.0-RC2-SNAPSHOT/kdc-tool-1.0.0-RC2-SNAPSHOT.pom
[JENKINS] Archiving <https://analysis.apache.org/jenkins/job/directory-kerby/ws/kerby-tool/kdc-tool/target/kdc-tool-1.0.0-RC2-SNAPSHOT.jar>
to org.apache.kerby/kdc-tool/1.0.0-RC2-SNAPSHOT/kdc-tool-1.0.0-RC2-SNAPSHOT.jar
[JENKINS] Archiving <https://analysis.apache.org/jenkins/job/directory-kerby/ws/kerby-dist/kdc-dist/pom.xml>
to org.apache.kerby/kdc-dist/1.0.0-RC2-SNAPSHOT/kdc-dist-1.0.0-RC2-SNAPSHOT.pom
[JENKINS] Archiving <https://analysis.apache.org/jenkins/job/directory-kerby/ws/kerby-asn1/pom.xml>
to org.apache.kerby/kerby-asn1/1.0.0-RC2-SNAPSHOT/kerby-asn1-1.0.0-RC2-SNAPSHOT.pom
[JENKINS] Archiving <https://analysis.apache.org/jenkins/job/directory-kerby/ws/kerby-asn1/target/kerby-asn1-1.0.0-RC2-SNAPSHOT.jar>
to org.apache.kerby/kerby-asn1/1.0.0-RC2-SNAPSHOT/kerby-asn1-1.0.0-RC2-SNAPSHOT.jar
[JENKINS] Archiving <https://analysis.apache.org/jenkins/job/directory-kerby/ws/benchmark/pom.xml>
to org.apache.kerby/benchmark/1.0.0-RC2-SNAPSHOT/benchmark-1.0.0-RC2-SNAPSHOT.pom
[JENKINS] Archiving <https://analysis.apache.org/jenkins/job/directory-kerby/ws/benchmark/target/benchmark-1.0.0-RC2-SNAPSHOT.jar>
to org.apache.kerby/benchmark/1.0.0-RC2-SNAPSHOT/benchmark-1.0.0-RC2-SNAPSHOT.jar
[JENKINS] Archiving <https://analysis.apache.org/jenkins/job/directory-kerby/ws/kerby-provider/pom.xml>
to org.apache.kerby/kerby-provider/1.0.0-RC2-SNAPSHOT/kerby-provider-1.0.0-RC2-SNAPSHOT.pom
[JENKINS] Archiving <https://analysis.apache.org/jenkins/job/directory-kerby/ws/kerby-kerb/kerb-admin/pom.xml>
to org.apache.kerby/kerb-admin/1.0.0-RC2-SNAPSHOT/kerb-admin-1.0.0-RC2-SNAPSHOT.pom
[JENKINS] Archiving <https://analysis.apache.org/jenkins/job/directory-kerby/ws/kerby-kerb/kerb-admin/target/kerb-admin-1.0.0-RC2-SNAPSHOT.jar>
to org.apache.kerby/kerb-admin/1.0.0-RC2-SNAPSHOT/kerb-admin-1.0.0-RC2-SNAPSHOT.jar
[JENKINS] Archiving <https://analysis.apache.org/jenkins/job/directory-kerby/ws/kerby-kerb/integration-test/pom.xml>
to org.apache.kerby/integration-test/1.0.0-RC2-SNAPSHOT/integration-test-1.0.0-RC2-SNAPSHOT.pom
[JENKINS] Archiving <https://analysis.apache.org/jenkins/job/directory-kerby/ws/kerby-kerb/integration-test/target/integration-test-1.0.0-RC2-SNAPSHOT.jar>
to org.apache.kerby/integration-test/1.0.0-RC2-SNAPSHOT/integration-test-1.0.0-RC2-SNAPSHOT.jar
[JENKINS] Archiving <https://analysis.apache.org/jenkins/job/directory-kerby/ws/kerby-kerb/kerb-simplekdc/pom.xml>
to org.apache.kerby/kerb-simplekdc/1.0.0-RC2-SNAPSHOT/kerb-simplekdc-1.0.0-RC2-SNAPSHOT.pom
[JENKINS] Archiving <https://analysis.apache.org/jenkins/job/directory-kerby/ws/kerby-kerb/kerb-simplekdc/target/kerb-simplekdc-1.0.0-RC2-SNAPSHOT.jar>
to org.apache.kerby/kerb-simplekdc/1.0.0-RC2-SNAPSHOT/kerb-simplekdc-1.0.0-RC2-SNAPSHOT.jar
[JENKINS] Archiving <https://analysis.apache.org/jenkins/job/directory-kerby/ws/kerby-kerb/kerb-core-test/pom.xml>
to org.apache.kerby/kerb-core-test/1.0.0-RC2-SNAPSHOT/kerb-core-test-1.0.0-RC2-SNAPSHOT.pom
[JENKINS] Archiving <https://analysis.apache.org/jenkins/job/directory-kerby/ws/kerby-kerb/kerb-core-test/target/kerb-core-test-1.0.0-RC2-SNAPSHOT.jar>
to org.apache.kerby/kerb-core-test/1.0.0-RC2-SNAPSHOT/kerb-core-test-1.0.0-RC2-SNAPSHOT.jar
[JENKINS] Archiving <https://analysis.apache.org/jenkins/job/directory-kerby/ws/3rdparty/not-yet-commons-ssl/pom.xml>
to org.apache.kerby/not-yet-commons-ssl/1.0.0-RC2-SNAPSHOT/not-yet-commons-ssl-1.0.0-RC2-SNAPSHOT.pom
[JENKINS] Archiving <https://analysis.apache.org/jenkins/job/directory-kerby/ws/kerby-kerb/kerb-client/pom.xml>
to org.apache.kerby/kerb-client/1.0.0-RC2-SNAPSHOT/kerb-client-1.0.0-RC2-SNAPSHOT.pom
[JENKINS] Archiving <https://analysis.apache.org/jenkins/job/directory-kerby/ws/kerby-kerb/kerb-client/target/kerb-client-1.0.0-RC2-SNAPSHOT.jar>
to org.apache.kerby/kerb-client/1.0.0-RC2-SNAPSHOT/kerb-client-1.0.0-RC2-SNAPSHOT.jar
[JENKINS] Archiving <https://analysis.apache.org/jenkins/job/directory-kerby/ws/kerby-kerb/pom.xml>
to org.apache.kerby/kerby-kerb/1.0.0-RC2-SNAPSHOT/kerby-kerb-1.0.0-RC2-SNAPSHOT.pom
[JENKINS] Archiving <https://analysis.apache.org/jenkins/job/directory-kerby/ws/kerby-backend/mavibot-backend/pom.xml>
to org.apache.kerby/mavibot-backend/1.0.0-RC2-SNAPSHOT/mavibot-backend-1.0.0-RC2-SNAPSHOT.pom
[JENKINS] Archiving <https://analysis.apache.org/jenkins/job/directory-kerby/ws/kerby-backend/mavibot-backend/target/mavibot-backend-1.0.0-RC2-SNAPSHOT.jar>
to org.apache.kerby/mavibot-backend/1.0.0-RC2-SNAPSHOT/mavibot-backend-1.0.0-RC2-SNAPSHOT.jar
[JENKINS] Archiving <https://analysis.apache.org/jenkins/job/directory-kerby/ws/kerby-backend/zookeeper-backend/pom.xml>
to org.apache.kerby/zookeeper-backend/1.0.0-RC2-SNAPSHOT/zookeeper-backend-1.0.0-RC2-SNAPSHOT.pom
[JENKINS] Archiving <https://analysis.apache.org/jenkins/job/directory-kerby/ws/kerby-backend/zookeeper-backend/target/zookeeper-backend-1.0.0-RC2-SNAPSHOT.jar>
to org.apache.kerby/zookeeper-backend/1.0.0-RC2-SNAPSHOT/zookeeper-backend-1.0.0-RC2-SNAPSHOT.jar
[JENKINS] Archiving <https://analysis.apache.org/jenkins/job/directory-kerby/ws/kerby-config/pom.xml>
to org.apache.kerby/kerby-config/1.0.0-RC2-SNAPSHOT/kerby-config-1.0.0-RC2-SNAPSHOT.pom
[JENKINS] Archiving <https://analysis.apache.org/jenkins/job/directory-kerby/ws/kerby-config/target/kerby-config-1.0.0-RC2-SNAPSHOT.jar>
to org.apache.kerby/kerby-config/1.0.0-RC2-SNAPSHOT/kerby-config-1.0.0-RC2-SNAPSHOT.jar
[JENKINS] Archiving <https://analysis.apache.org/jenkins/job/directory-kerby/ws/kerby-util/pom.xml>
to org.apache.kerby/kerby-util/1.0.0-RC2-SNAPSHOT/kerby-util-1.0.0-RC2-SNAPSHOT.pom
[JENKINS] Archiving <https://analysis.apache.org/jenkins/job/directory-kerby/ws/kerby-util/target/kerby-util-1.0.0-RC2-SNAPSHOT.jar>
to org.apache.kerby/kerby-util/1.0.0-RC2-SNAPSHOT/kerby-util-1.0.0-RC2-SNAPSHOT.jar
[JENKINS] Archiving <https://analysis.apache.org/jenkins/job/directory-kerby/ws/kerby-kerb/kerb-common/pom.xml>
to org.apache.kerby/kerb-common/1.0.0-RC2-SNAPSHOT/kerb-common-1.0.0-RC2-SNAPSHOT.pom
[JENKINS] Archiving <https://analysis.apache.org/jenkins/job/directory-kerby/ws/kerby-kerb/kerb-common/target/kerb-common-1.0.0-RC2-SNAPSHOT.jar>
to org.apache.kerby/kerb-common/1.0.0-RC2-SNAPSHOT/kerb-common-1.0.0-RC2-SNAPSHOT.jar
[JENKINS] Archiving <https://analysis.apache.org/jenkins/job/directory-kerby/ws/kerby-kerb/kerb-core/pom.xml>
to org.apache.kerby/kerb-core/1.0.0-RC2-SNAPSHOT/kerb-core-1.0.0-RC2-SNAPSHOT.pom
[JENKINS] Archiving <https://analysis.apache.org/jenkins/job/directory-kerby/ws/kerby-kerb/kerb-core/target/kerb-core-1.0.0-RC2-SNAPSHOT.jar>
to org.apache.kerby/kerb-core/1.0.0-RC2-SNAPSHOT/kerb-core-1.0.0-RC2-SNAPSHOT.jar
[JENKINS] Archiving <https://analysis.apache.org/jenkins/job/directory-kerby/ws/kerby-kdc/pom.xml>
to org.apache.kerby/kerby-kdc/1.0.0-RC2-SNAPSHOT/kerby-kdc-1.0.0-RC2-SNAPSHOT.pom
[JENKINS] Archiving <https://analysis.apache.org/jenkins/job/directory-kerby/ws/kerby-kdc/target/kerby-kdc-1.0.0-RC2-SNAPSHOT.jar>
to org.apache.kerby/kerby-kdc/1.0.0-RC2-SNAPSHOT/kerby-kdc-1.0.0-RC2-SNAPSHOT.jar
[JENKINS] Archiving <https://analysis.apache.org/jenkins/job/directory-kerby/ws/kerby-kerb/kerb-identity/pom.xml>
to org.apache.kerby/kerb-identity/1.0.0-RC2-SNAPSHOT/kerb-identity-1.0.0-RC2-SNAPSHOT.pom
[JENKINS] Archiving <https://analysis.apache.org/jenkins/job/directory-kerby/ws/kerby-kerb/kerb-identity/target/kerb-identity-1.0.0-RC2-SNAPSHOT.jar>
to org.apache.kerby/kerb-identity/1.0.0-RC2-SNAPSHOT/kerb-identity-1.0.0-RC2-SNAPSHOT.jar
[JENKINS] Archiving <https://analysis.apache.org/jenkins/job/directory-kerby/ws/kerby-backend/pom.xml>
to org.apache.kerby/kerby-backend/1.0.0-RC2-SNAPSHOT/kerby-backend-1.0.0-RC2-SNAPSHOT.pom
[JENKINS] Archiving <https://analysis.apache.org/jenkins/job/directory-kerby/ws/kerby-tool/pom.xml>
to org.apache.kerby/kerby-tool/1.0.0-RC2-SNAPSHOT/kerby-tool-1.0.0-RC2-SNAPSHOT.pom
[JENKINS] Archiving <https://analysis.apache.org/jenkins/job/directory-kerby/ws/pom.xml>
to org.apache.kerby/kerby-all/1.0.0-RC2-SNAPSHOT/kerby-all-1.0.0-RC2-SNAPSHOT.pom
[JENKINS] Archiving <https://analysis.apache.org/jenkins/job/directory-kerby/ws/kerby-kerb/kerb-kdc-test/pom.xml>
to org.apache.kerby/kerb-kdc-test/1.0.0-RC2-SNAPSHOT/kerb-kdc-test-1.0.0-RC2-SNAPSHOT.pom
[JENKINS] Archiving <https://analysis.apache.org/jenkins/job/directory-kerby/ws/kerby-kerb/kerb-kdc-test/target/kerb-kdc-test-1.0.0-RC2-SNAPSHOT.jar>
to org.apache.kerby/kerb-kdc-test/1.0.0-RC2-SNAPSHOT/kerb-kdc-test-1.0.0-RC2-SNAPSHOT.jar
[JENKINS] Archiving <https://analysis.apache.org/jenkins/job/directory-kerby/ws/kerby-kerb/kerb-kdc-test/target/kerb-kdc-test-1.0.0-RC2-SNAPSHOT-tests.jar>
to org.apache.kerby/kerb-kdc-test/1.0.0-RC2-SNAPSHOT/kerb-kdc-test-1.0.0-RC2-SNAPSHOT-tests.jar
[JENKINS] Archiving <https://analysis.apache.org/jenkins/job/directory-kerby/ws/kerby-dist/tool-dist/pom.xml>
to org.apache.kerby/tool-dist/1.0.0-RC2-SNAPSHOT/tool-dist-1.0.0-RC2-SNAPSHOT.pom
[JENKINS] Archiving <https://analysis.apache.org/jenkins/job/directory-kerby/ws/kerby-provider/pki-provider/pom.xml>
to org.apache.kerby/pki-provider/1.0.0-RC2-SNAPSHOT/pki-provider-1.0.0-RC2-SNAPSHOT.pom
[JENKINS] Archiving <https://analysis.apache.org/jenkins/job/directory-kerby/ws/kerby-kerb/kerb-identity-test/pom.xml>
to org.apache.kerby/kerb-identity-test/1.0.0-RC2-SNAPSHOT/kerb-identity-test-1.0.0-RC2-SNAPSHOT.pom
[JENKINS] Archiving <https://analysis.apache.org/jenkins/job/directory-kerby/ws/kerby-kerb/kerb-identity-test/target/kerb-identity-test-1.0.0-RC2-SNAPSHOT.jar>
to org.apache.kerby/kerb-identity-test/1.0.0-RC2-SNAPSHOT/kerb-identity-test-1.0.0-RC2-SNAPSHOT.jar
[JENKINS] Archiving <https://analysis.apache.org/jenkins/job/directory-kerby/ws/kerby-kerb/kerb-server-api-all/pom.xml>
to org.apache.kerby/kerb-server-api-all/1.0.0-RC2-SNAPSHOT/kerb-server-api-all-1.0.0-RC2-SNAPSHOT.pom
[JENKINS] Archiving <https://analysis.apache.org/jenkins/job/directory-kerby/ws/kerby-kerb/kerb-server-api-all/target/kerb-server-api-all-1.0.0-RC2-SNAPSHOT.jar>
to org.apache.kerby/kerb-server-api-all/1.0.0-RC2-SNAPSHOT/kerb-server-api-all-1.0.0-RC2-SNAPSHOT.jar
Sending e-mails to: notifications@directory.apache.org
channel stopped
Skipping sonar analysis due to bad build status FAILURE

Mime
View raw message