directory-notifications mailing list archives

Site index · List index
Message view « Date » · « Thread »
Top « Date » · « Thread »
From Apache Jenkins Server <jenk...@builds.apache.org>
Subject Build failed in Jenkins: dir-kerby #69
Date Mon, 28 Sep 2015 17:44:22 GMT
See <https://builds.apache.org/job/dir-kerby/69/changes>

Changes:

[kai.zheng] DIRKRB-422. Enhance json backend to support transaction for reasonable efficiency,
allowing flush only when commit

------------------------------------------
[...truncated 1915 lines...]
[INFO] --- maven-resources-plugin:2.7:resources (default-resources) @ client-tool ---
[INFO] Using 'UTF-8' encoding to copy filtered resources.
[INFO] skip non existing resourceDirectory <https://builds.apache.org/job/dir-kerby/ws/kerby-tool/client-tool/src/main/resources>
[INFO] Copying 3 resources
[INFO] 
[INFO] --- maven-compiler-plugin:3.1:compile (default-compile) @ client-tool ---
[INFO] Changes detected - recompiling the module!
[INFO] Compiling 7 source files to <https://builds.apache.org/job/dir-kerby/ws/kerby-tool/client-tool/target/classes>
[INFO] 
[INFO] --- maven-resources-plugin:2.7:testResources (default-testResources) @ client-tool
---
[INFO] Using 'UTF-8' encoding to copy filtered resources.
[INFO] skip non existing resourceDirectory <https://builds.apache.org/job/dir-kerby/ws/kerby-tool/client-tool/src/test/resources>
[INFO] Copying 3 resources
[INFO] 
[INFO] --- maven-compiler-plugin:3.1:testCompile (default-testCompile) @ client-tool ---
[INFO] No sources to compile
[INFO] 
[INFO] --- maven-surefire-plugin:2.18.1:test (default-test) @ client-tool ---
[JENKINS] Recording test results[INFO] 
[INFO] --- maven-surefire-plugin:2.18.1:test (default) @ client-tool ---
[INFO] Skipping execution of surefire because it has already been run for this configuration

[JENKINS] Recording test results
[INFO] 
[INFO] --- maven-jar-plugin:2.5:jar (default-jar) @ client-tool ---
[INFO] Building jar: <https://builds.apache.org/job/dir-kerby/ws/kerby-tool/client-tool/target/client-tool-1.0.0-RC2-SNAPSHOT.jar>
[INFO] 
[INFO] --- maven-site-plugin:3.4:attach-descriptor (attach-descriptor) @ client-tool ---
[INFO] 
[INFO] --- maven-pmd-plugin:3.4:pmd (pmd) @ client-tool ---
[INFO] 
[INFO] --- maven-pmd-plugin:3.4:check (validate) @ client-tool ---
[INFO] 
[INFO] 
[INFO] --- maven-checkstyle-plugin:2.15:check (validate) @ client-tool ---
[WARNING] Failed to getClass for org.apache.maven.plugin.source.SourceJarMojo
[INFO] 
[INFO] --- maven-source-plugin:2.4:jar (attach-sources) @ client-tool ---
[INFO] Building jar: <https://builds.apache.org/job/dir-kerby/ws/kerby-tool/client-tool/target/client-tool-1.0.0-RC2-SNAPSHOT-sources.jar>
[INFO] 
[INFO] --- maven-install-plugin:2.5.2:install (default-install) @ client-tool ---
[INFO] Installing <https://builds.apache.org/job/dir-kerby/ws/kerby-tool/client-tool/target/client-tool-1.0.0-RC2-SNAPSHOT.jar>
to /home/jenkins/jenkins-slave/maven-repositories/1/org/apache/kerby/client-tool/1.0.0-RC2-SNAPSHOT/client-tool-1.0.0-RC2-SNAPSHOT.jar
[INFO] Installing <https://builds.apache.org/job/dir-kerby/ws/kerby-tool/client-tool/pom.xml>
to /home/jenkins/jenkins-slave/maven-repositories/1/org/apache/kerby/client-tool/1.0.0-RC2-SNAPSHOT/client-tool-1.0.0-RC2-SNAPSHOT.pom
[INFO] Installing <https://builds.apache.org/job/dir-kerby/ws/kerby-tool/client-tool/target/client-tool-1.0.0-RC2-SNAPSHOT-sources.jar>
to /home/jenkins/jenkins-slave/maven-repositories/1/org/apache/kerby/client-tool/1.0.0-RC2-SNAPSHOT/client-tool-1.0.0-RC2-SNAPSHOT-sources.jar
[JENKINS] Archiving disabled
[INFO]                                                                         
[INFO] ------------------------------------------------------------------------
[INFO] Building KDC Tool 1.0.0-RC2-SNAPSHOT
[INFO] ------------------------------------------------------------------------
[INFO] 
[INFO] --- maven-clean-plugin:2.5:clean (default-clean) @ kdc-tool ---
[INFO] Deleting <https://builds.apache.org/job/dir-kerby/ws/kerby-tool/kdc-tool/target>
[INFO] 
[INFO] --- maven-pmd-plugin:3.4:pmd (pmd) @ kdc-tool ---
[INFO] 
[INFO] --- maven-pmd-plugin:3.4:check (validate) @ kdc-tool ---
[INFO] 
[INFO] 
[INFO] --- maven-checkstyle-plugin:2.15:check (validate) @ kdc-tool ---
[INFO] 
[INFO] --- maven-remote-resources-plugin:1.5:process (default) @ kdc-tool ---
[INFO] 
[INFO] --- maven-resources-plugin:2.7:resources (default-resources) @ kdc-tool ---
[INFO] Using 'UTF-8' encoding to copy filtered resources.
[INFO] Copying 2 resources
[INFO] Copying 3 resources
[INFO] 
[INFO] --- maven-compiler-plugin:3.1:compile (default-compile) @ kdc-tool ---
[INFO] Changes detected - recompiling the module!
[INFO] Compiling 15 source files to <https://builds.apache.org/job/dir-kerby/ws/kerby-tool/kdc-tool/target/classes>
[INFO] 
[INFO] --- maven-resources-plugin:2.7:testResources (default-testResources) @ kdc-tool ---
[INFO] Using 'UTF-8' encoding to copy filtered resources.
[INFO] skip non existing resourceDirectory <https://builds.apache.org/job/dir-kerby/ws/kerby-tool/kdc-tool/src/test/resources>
[INFO] Copying 3 resources
[INFO] 
[INFO] --- maven-compiler-plugin:3.1:testCompile (default-testCompile) @ kdc-tool ---
[INFO] No sources to compile
[INFO] 
[INFO] --- maven-surefire-plugin:2.18.1:test (default-test) @ kdc-tool ---
[JENKINS] Recording test results[INFO] 
[INFO] --- maven-surefire-plugin:2.18.1:test (default) @ kdc-tool ---
[INFO] Skipping execution of surefire because it has already been run for this configuration

[JENKINS] Recording test results
[INFO] 
[INFO] --- maven-jar-plugin:2.5:jar (default-jar) @ kdc-tool ---
[INFO] Building jar: <https://builds.apache.org/job/dir-kerby/ws/kerby-tool/kdc-tool/target/kdc-tool-1.0.0-RC2-SNAPSHOT.jar>
[INFO] 
[INFO] --- maven-site-plugin:3.4:attach-descriptor (attach-descriptor) @ kdc-tool ---
[INFO] 
[INFO] --- maven-pmd-plugin:3.4:pmd (pmd) @ kdc-tool ---
[INFO] 
[INFO] --- maven-pmd-plugin:3.4:check (validate) @ kdc-tool ---
[INFO] 
[INFO] 
[INFO] --- maven-checkstyle-plugin:2.15:check (validate) @ kdc-tool ---
[WARNING] Failed to getClass for org.apache.maven.plugin.source.SourceJarMojo
[INFO] 
[INFO] --- maven-source-plugin:2.4:jar (attach-sources) @ kdc-tool ---
[INFO] Building jar: <https://builds.apache.org/job/dir-kerby/ws/kerby-tool/kdc-tool/target/kdc-tool-1.0.0-RC2-SNAPSHOT-sources.jar>
[INFO] 
[INFO] --- maven-install-plugin:2.5.2:install (default-install) @ kdc-tool ---
[INFO] Installing <https://builds.apache.org/job/dir-kerby/ws/kerby-tool/kdc-tool/target/kdc-tool-1.0.0-RC2-SNAPSHOT.jar>
to /home/jenkins/jenkins-slave/maven-repositories/1/org/apache/kerby/kdc-tool/1.0.0-RC2-SNAPSHOT/kdc-tool-1.0.0-RC2-SNAPSHOT.jar
[INFO] Installing <https://builds.apache.org/job/dir-kerby/ws/kerby-tool/kdc-tool/pom.xml>
to /home/jenkins/jenkins-slave/maven-repositories/1/org/apache/kerby/kdc-tool/1.0.0-RC2-SNAPSHOT/kdc-tool-1.0.0-RC2-SNAPSHOT.pom
[INFO] Installing <https://builds.apache.org/job/dir-kerby/ws/kerby-tool/kdc-tool/target/kdc-tool-1.0.0-RC2-SNAPSHOT-sources.jar>
to /home/jenkins/jenkins-slave/maven-repositories/1/org/apache/kerby/kdc-tool/1.0.0-RC2-SNAPSHOT/kdc-tool-1.0.0-RC2-SNAPSHOT-sources.jar
[JENKINS] Archiving disabled
[INFO]                                                                         
[INFO] ------------------------------------------------------------------------
[INFO] Building Kerby Backend 1.0.0-RC2-SNAPSHOT
[INFO] ------------------------------------------------------------------------
[INFO] 
[INFO] --- maven-clean-plugin:2.5:clean (default-clean) @ kerby-backend ---
[INFO] Deleting <https://builds.apache.org/job/dir-kerby/ws/kerby-backend/target>
[INFO] 
[INFO] --- maven-pmd-plugin:3.4:pmd (pmd) @ kerby-backend ---
[INFO] 
[INFO] --- maven-pmd-plugin:3.4:check (validate) @ kerby-backend ---
[INFO] 
[INFO] --- maven-checkstyle-plugin:2.15:check (validate) @ kerby-backend ---
[INFO] 
[INFO] --- maven-remote-resources-plugin:1.5:process (default) @ kerby-backend ---
[INFO] 
[INFO] --- maven-site-plugin:3.4:attach-descriptor (attach-descriptor) @ kerby-backend ---
[INFO] 
[INFO] --- maven-pmd-plugin:3.4:pmd (pmd) @ kerby-backend ---
[INFO] 
[INFO] --- maven-pmd-plugin:3.4:check (validate) @ kerby-backend ---
[INFO] 
[INFO] --- maven-checkstyle-plugin:2.15:check (validate) @ kerby-backend ---
[WARNING] Failed to getClass for org.apache.maven.plugin.source.SourceJarMojo
[INFO] 
[INFO] --- maven-source-plugin:2.4:jar (attach-sources) @ kerby-backend ---
[INFO] 
[INFO] --- maven-install-plugin:2.5.2:install (default-install) @ kerby-backend ---
[INFO] Installing <https://builds.apache.org/job/dir-kerby/ws/kerby-backend/pom.xml>
to /home/jenkins/jenkins-slave/maven-repositories/1/org/apache/kerby/kerby-backend/1.0.0-RC2-SNAPSHOT/kerby-backend-1.0.0-RC2-SNAPSHOT.pom
[JENKINS] Archiving disabled
[INFO]                                                                         
[INFO] ------------------------------------------------------------------------
[INFO] Building Json identity backend 1.0.0-RC2-SNAPSHOT
[INFO] ------------------------------------------------------------------------
[INFO] 
[INFO] --- maven-clean-plugin:2.5:clean (default-clean) @ json-backend ---
[INFO] Deleting <https://builds.apache.org/job/dir-kerby/ws/kerby-backend/json-backend/target>
[INFO] 
[INFO] --- maven-pmd-plugin:3.4:pmd (pmd) @ json-backend ---
[INFO] 
[INFO] --- maven-pmd-plugin:3.4:check (validate) @ json-backend ---
[INFO] 
[INFO] 
[INFO] --- maven-checkstyle-plugin:2.15:check (validate) @ json-backend ---
[INFO] There are 2 errors reported by Checkstyle 6.1.1 with <https://builds.apache.org/job/dir-kerby/ws/kerby-backend/json-backend/../../docs/kerby-checkstyle.xml>
ruleset.
[ERROR] src/main/java/org/apache/kerby/kerberos/kdc/identitybackend/JsonIdentityBackend.java[301:34]
(whitespace) OperatorWrap: '&&' should be on a new line.
[ERROR] src/main/java/org/apache/kerby/kerberos/kdc/identitybackend/JsonIdentityBackend.java[310:34]
(whitespace) OperatorWrap: '&&' should be on a new line.
[JENKINS] Archiving disabled
[INFO] ------------------------------------------------------------------------
[INFO] Reactor Summary:
[INFO] 
[INFO] Apache Kerby Project .............................. SUCCESS [6.786s]
[INFO] Kerby Config ...................................... SUCCESS [15.409s]
[INFO] Kerby Util ........................................ SUCCESS [3.446s]
[INFO] Kerby ASN1 Project ................................ SUCCESS [7.162s]
[INFO] Kerby-kerb Project ................................ SUCCESS [1.416s]
[INFO] Kerby-kerb core ................................... SUCCESS [4.274s]
[INFO] Kerby-kerb Crypto ................................. SUCCESS [10.806s]
[INFO] Kerby-kerb Util ................................... SUCCESS [6.548s]
[INFO] kerby-kerb-coreTest ............................... SUCCESS [4.010s]
[INFO] Kerby-kerb Common ................................. SUCCESS [3.223s]
[INFO] Kerby-kerb Identity ............................... SUCCESS [2.634s]
[INFO] Kerby-kerb Identity Test .......................... SUCCESS [2.357s]
[INFO] Kerby-kerb Client ................................. SUCCESS [4.382s]
[INFO] Kerby-kerb Server ................................. SUCCESS [4.344s]
[INFO] Kerby-kerb Admin .................................. SUCCESS [2.768s]
[INFO] Kerb Simple Kdc ................................... SUCCESS [2.464s]
[INFO] Kerb Kdc Test ..................................... SUCCESS [15.903s]
[INFO] Kerby providers ................................... SUCCESS [1.389s]
[INFO] Token provider .................................... SUCCESS [5.906s]
[INFO] Kerb Integration Test ............................. SUCCESS [6.627s]
[INFO] Kerby-kerb client api all ......................... SUCCESS [2.029s]
[INFO] Kerby-kerb server all ............................. SUCCESS [2.049s]
[INFO] Kerby KDC Server .................................. SUCCESS [2.854s]
[INFO] Kdc Tool Project .................................. SUCCESS [1.296s]
[INFO] Client Tool ....................................... SUCCESS [2.628s]
[INFO] KDC Tool .......................................... SUCCESS [3.295s]
[INFO] Kerby Backend ..................................... SUCCESS [1.535s]
[INFO] Json identity backend ............................. FAILURE [1.202s]
[INFO] Zookeeper identity backend ........................ SKIPPED
[INFO] Ldap identity backend ............................. SKIPPED
[INFO] Kerby Kdc Test .................................... SKIPPED
[INFO] Mavibot based backend ............................. SKIPPED
[INFO] Kerby Distribution ................................ SKIPPED
[INFO] KDC Dist .......................................... SKIPPED
[INFO] Tool Dist ......................................... SKIPPED
[INFO] Kerby benchmark ................................... SKIPPED
[INFO] ------------------------------------------------------------------------
[INFO] BUILD FAILURE
[INFO] ------------------------------------------------------------------------
[INFO] Total time: 2:21.766s
[INFO] Finished at: Mon Sep 28 17:44:40 UTC 2015
[INFO] Final Memory: 46M/282M
[INFO] ------------------------------------------------------------------------
[JENKINS] Archiving disabled
[JENKINS] Archiving disabled
[JENKINS] Archiving disabled
[JENKINS] Archiving disabled
[JENKINS] Archiving disabled
[JENKINS] Archiving disabled
[JENKINS] Archiving disabled
[JENKINS] Archiving disabled
[JENKINS] Archiving disabled
[JENKINS] Archiving disabled
[JENKINS] Archiving disabled
[JENKINS] Archiving disabled
[JENKINS] Archiving disabled
[JENKINS] Archiving disabled
[JENKINS] Archiving disabled
[JENKINS] Archiving disabled
[JENKINS] Archiving disabled
[JENKINS] Archiving disabled
[JENKINS] Archiving disabled
[JENKINS] Archiving disabled
[JENKINS] Archiving disabled
[JENKINS] Archiving disabled
[JENKINS] Archiving disabled
[JENKINS] Archiving disabled
[JENKINS] Archiving disabled
[JENKINS] Archiving disabled
[JENKINS] Archiving disabled
[JENKINS] Archiving disabled
[JENKINS] Archiving disabled
[JENKINS] Archiving disabled
[JENKINS] Archiving disabled
[JENKINS] Archiving disabled
[JENKINS] Archiving disabled
[JENKINS] Archiving disabled
[JENKINS] Archiving disabled
[JENKINS] Archiving disabled
Waiting for Jenkins to finish collecting data[ERROR] Failed to execute goal org.apache.maven.plugins:maven-checkstyle-plugin:2.15:check
(validate) on project json-backend: You have 2 Checkstyle violations. -> [Help 1]
[ERROR] 
[ERROR] To see the full stack trace of the errors, re-run Maven with the -e switch.
[ERROR] Re-run Maven using the -X switch to enable full debug logging.
[ERROR] 
[ERROR] For more information about the errors and possible solutions, please read the following
articles:
[ERROR] [Help 1] http://cwiki.apache.org/confluence/display/MAVEN/MojoFailureException
[ERROR] 
[ERROR] After correcting the problems, you can resume the build with the command
[ERROR]   mvn <goals> -rf :json-backend

channel stopped

Mime
View raw message