directory-notifications mailing list archives

Site index · List index
Message view « Date » · « Thread »
Top « Date » · « Thread »
From gmcdon...@apache.org
Subject Build failed in Jenkins: directory-kerby » not-yet-commons-ssl #146
Date Fri, 25 Sep 2015 06:22:38 GMT
See <https://analysis.apache.org/jenkins/job/directory-kerby/org.apache.kerby$not-yet-commons-ssl/146/>

------------------------------------------
[INFO]                                                                         
[INFO] ------------------------------------------------------------------------
[INFO] Building not-yet-commons-ssl 1.0.0-RC2-SNAPSHOT
[INFO] ------------------------------------------------------------------------
[INFO] 
[INFO] --- maven-clean-plugin:2.5:clean (default-clean) @ not-yet-commons-ssl ---
[INFO] 
[INFO] --- maven-pmd-plugin:3.4:pmd (pmd) @ not-yet-commons-ssl ---
[INFO] 
[INFO] --- maven-pmd-plugin:3.4:check (validate) @ not-yet-commons-ssl ---
[INFO] 
[INFO] --- maven-checkstyle-plugin:2.15:check (validate) @ not-yet-commons-ssl ---
[INFO] There are 20 errors reported by Checkstyle 6.1.1 with <https://analysis.apache.org/jenkins/job/directory-kerby/org.apache.kerby$not-yet-commons-ssl/ws/../../docs/kerby-checkstyle.xml>
ruleset.
[ERROR] src/main/java/org/apache/commons/ssl/KeyMaterial.java[206:56] (blocks) EmptyBlock:
Must have at least one statement.
[ERROR] src/main/java/org/apache/commons/ssl/Ping.java[100:5] (sizes) MethodLength: Method
length is 224 lines (max allowed is 200).
[ERROR] src/main/java/org/apache/commons/ssl/PKCS8Key.java[464:5] (sizes) MethodLength: Method
length is 292 lines (max allowed is 200).
[ERROR] src/main/java/org/apache/commons/ssl/KeyStoreBuilder.java[334:48] (blocks) EmptyBlock:
Must have at least one statement.
[ERROR] src/main/java/org/apache/commons/ssl/KeyStoreBuilder.java[372:31] (blocks) EmptyBlock:
Must have at least one statement.
[ERROR] src/main/java/org/apache/commons/ssl/KeyStoreBuilder.java[416:47] (blocks) EmptyBlock:
Must have at least one statement.
[ERROR] src/main/java/org/apache/commons/ssl/KeyStoreBuilder.java[432:47] (blocks) EmptyBlock:
Must have at least one statement.
[ERROR] src/main/java/org/apache/commons/ssl/KeyStoreBuilder.java[484:60] (blocks) EmptyBlock:
Must have at least one statement.
[ERROR] src/main/java/org/apache/commons/ssl/KeyStoreBuilder.java[595:35] (blocks) EmptyBlock:
Must have at least one statement.
[ERROR] src/main/java/org/apache/commons/ssl/Certificates.java[314:28] (blocks) EmptyBlock:
Must have at least one statement.
[ERROR] src/main/java/org/apache/commons/ssl/Certificates.java[433:62] (blocks) EmptyBlock:
Must have at least one statement.
[ERROR] src/main/java/org/apache/commons/ssl/Certificates.java[455:43] (blocks) EmptyBlock:
Must have at least one statement.
[ERROR] src/main/java/org/apache/commons/ssl/Certificates.java[476:43] (blocks) EmptyBlock:
Must have at least one statement.
[ERROR] src/main/java/org/apache/commons/ssl/Certificates.java[479:45] (blocks) EmptyBlock:
Must have at least one statement.
[ERROR] src/main/java/org/apache/commons/ssl/Certificates.java[508:61] (blocks) EmptyBlock:
Must have at least one statement.
[ERROR] src/main/java/org/apache/commons/ssl/Certificates.java[509:54] (blocks) EmptyBlock:
Must have at least one statement.
[ERROR] src/main/java/org/apache/commons/ssl/Certificates.java[516:47] (blocks) EmptyBlock:
Must have at least one statement.
[ERROR] src/main/java/org/apache/commons/ssl/SSLProxyServer.java[167:39] (blocks) EmptyBlock:
Must have at least one statement.
[ERROR] src/main/java/org/apache/commons/ssl/SSLProxyServer.java[178:39] (blocks) EmptyBlock:
Must have at least one statement.
[ERROR] src/main/java/org/apache/commons/ssl/SSLEchoServer.java[133:39] (blocks) EmptyBlock:
Must have at least one statement.

Mime
View raw message