directory-notifications mailing list archives

Site index · List index
Message view « Date » · « Thread »
Top « Date » · « Thread »
From Apache Jenkins Server <jenk...@builds.apache.org>
Subject Build failed in Jenkins: dir-apacheds-ubuntu-deploy #1808
Date Tue, 25 Aug 2015 20:27:15 GMT
See <https://builds.apache.org/job/dir-apacheds-ubuntu-deploy/1808/changes>

Changes:

[seelmann] Bump Mavibot version

------------------------------------------
[...truncated 5840 lines...]
[INFO] <https://builds.apache.org/job/dir-apacheds-ubuntu-deploy/ws/trunk/jdbm-partition/src/main/java/org/apache/directory/server/core/partition/impl/btree/jdbm/JdbmIndex.java>:
Recompile with -Xlint:unchecked for details.
[INFO] 
[INFO] --- maven-resources-plugin:2.7:testResources (default-testResources) @ apacheds-jdbm-partition
---
[INFO] Using 'UTF-8' encoding to copy filtered resources.
[INFO] Copying 1 resource
[INFO] Copying 3 resources
[INFO] 
[INFO] --- maven-compiler-plugin:3.2:testCompile (default-testCompile) @ apacheds-jdbm-partition
---
[INFO] Changes detected - recompiling the module!
[INFO] Compiling 19 source files to <https://builds.apache.org/job/dir-apacheds-ubuntu-deploy/ws/trunk/jdbm-partition/target/test-classes>
[INFO] <https://builds.apache.org/job/dir-apacheds-ubuntu-deploy/ws/trunk/jdbm-partition/src/test/java/org/apache/directory/server/core/partition/impl/btree/jdbm/JdbmBrowserBugTest.java>:
Some input files use or override a deprecated API.
[INFO] <https://builds.apache.org/job/dir-apacheds-ubuntu-deploy/ws/trunk/jdbm-partition/src/test/java/org/apache/directory/server/core/partition/impl/btree/jdbm/JdbmBrowserBugTest.java>:
Recompile with -Xlint:deprecation for details.
[INFO] <https://builds.apache.org/job/dir-apacheds-ubuntu-deploy/ws/trunk/jdbm-partition/src/test/java/org/apache/directory/server/core/partition/impl/btree/jdbm/KeyTupleBTreeCursorTest.java>:
<https://builds.apache.org/job/dir-apacheds-ubuntu-deploy/ws/trunk/jdbm-partition/src/test/java/org/apache/directory/server/core/partition/impl/btree/jdbm/KeyTupleBTreeCursorTest.java>
uses unchecked or unsafe operations.
[INFO] <https://builds.apache.org/job/dir-apacheds-ubuntu-deploy/ws/trunk/jdbm-partition/src/test/java/org/apache/directory/server/core/partition/impl/btree/jdbm/KeyTupleBTreeCursorTest.java>:
Recompile with -Xlint:unchecked for details.
[INFO] 
[INFO] --- maven-surefire-plugin:2.18.1:test (default-test) @ apacheds-jdbm-partition ---
[INFO] Surefire report directory: <https://builds.apache.org/job/dir-apacheds-ubuntu-deploy/ws/trunk/jdbm-partition/target/surefire-reports>

-------------------------------------------------------
 T E S T S
-------------------------------------------------------
Running org.apache.directory.server.core.partition.impl.btree.jdbm.DupsCursorTest
Tests run: 15, Failures: 0, Errors: 0, Skipped: 0, Time elapsed: 2.354 sec - in org.apache.directory.server.core.partition.impl.btree.jdbm.DupsCursorTest
Running org.apache.directory.server.core.partition.impl.btree.jdbm.JdbmTableWithDuplicatesTest
Tests run: 15, Failures: 0, Errors: 0, Skipped: 0, Time elapsed: 0.91 sec - in org.apache.directory.server.core.partition.impl.btree.jdbm.JdbmTableWithDuplicatesTest
Running org.apache.directory.server.core.partition.impl.btree.jdbm.KeyCursorTest
Tests run: 5, Failures: 0, Errors: 0, Skipped: 0, Time elapsed: 0.06 sec - in org.apache.directory.server.core.partition.impl.btree.jdbm.KeyCursorTest
Running org.apache.directory.server.core.partition.impl.btree.jdbm.ServerEntrySerializerTest
Tests run: 9, Failures: 0, Errors: 0, Skipped: 0, Time elapsed: 0.454 sec - in org.apache.directory.server.core.partition.impl.btree.jdbm.ServerEntrySerializerTest
Running org.apache.directory.server.core.partition.impl.btree.jdbm.JdbmIndexTest
Tests run: 16, Failures: 0, Errors: 0, Skipped: 0, Time elapsed: 0.707 sec - in org.apache.directory.server.core.partition.impl.btree.jdbm.JdbmIndexTest
Running org.apache.directory.server.core.partition.impl.btree.jdbm.KeyTupleBTreeCursorTest
Tests run: 2, Failures: 0, Errors: 0, Skipped: 0, Time elapsed: 0.371 sec - in org.apache.directory.server.core.partition.impl.btree.jdbm.KeyTupleBTreeCursorTest
Running org.apache.directory.server.core.partition.impl.btree.jdbm.JdbmBrowserBugTest
Tests run: 1, Failures: 0, Errors: 0, Skipped: 0, Time elapsed: 0.014 sec - in org.apache.directory.server.core.partition.impl.btree.jdbm.JdbmBrowserBugTest
Running org.apache.directory.server.core.partition.impl.btree.jdbm.JdbmMasterTableTest
Tests run: 1, Failures: 0, Errors: 0, Skipped: 0, Time elapsed: 0.506 sec - in org.apache.directory.server.core.partition.impl.btree.jdbm.JdbmMasterTableTest
Running org.apache.directory.server.core.partition.impl.btree.jdbm.JdbmStoreTest
Tests run: 15, Failures: 0, Errors: 0, Skipped: 0, Time elapsed: 3.131 sec - in org.apache.directory.server.core.partition.impl.btree.jdbm.JdbmStoreTest
Running org.apache.directory.server.core.partition.impl.btree.jdbm.StringSerializerTest
Tests run: 2, Failures: 0, Errors: 0, Skipped: 0, Time elapsed: 0.009 sec - in org.apache.directory.server.core.partition.impl.btree.jdbm.StringSerializerTest
Running org.apache.directory.server.core.partition.impl.btree.jdbm.NoDupsCursorTest
Tests run: 5, Failures: 0, Errors: 0, Skipped: 0, Time elapsed: 0.426 sec - in org.apache.directory.server.core.partition.impl.btree.jdbm.NoDupsCursorTest
Running org.apache.directory.server.core.partition.impl.btree.jdbm.KeyTupleArrayCursorTest
Tests run: 2, Failures: 0, Errors: 0, Skipped: 0, Time elapsed: 0.007 sec - in org.apache.directory.server.core.partition.impl.btree.jdbm.KeyTupleArrayCursorTest
Running org.apache.directory.server.core.partition.impl.btree.jdbm.JdbmTableNoDuplicatesTest
Tests run: 8, Failures: 0, Errors: 0, Skipped: 0, Time elapsed: 0.339 sec - in org.apache.directory.server.core.partition.impl.btree.jdbm.JdbmTableNoDuplicatesTest
Running org.apache.directory.server.core.partition.impl.btree.jdbm.DupsContainerCursorTest
Tests run: 5, Failures: 0, Errors: 0, Skipped: 0, Time elapsed: 0.335 sec - in org.apache.directory.server.core.partition.impl.btree.jdbm.DupsContainerCursorTest
Running org.apache.directory.server.core.partition.impl.btree.jdbm.KeyBTreeCursorTest
Tests run: 5, Failures: 0, Errors: 0, Skipped: 0, Time elapsed: 0.058 sec - in org.apache.directory.server.core.partition.impl.btree.jdbm.KeyBTreeCursorTest
Running org.apache.directory.server.core.partition.impl.btree.jdbm.JdbmRdnIndexTest
Tests run: 8, Failures: 0, Errors: 0, Skipped: 0, Time elapsed: 0.495 sec - in org.apache.directory.server.core.partition.impl.btree.jdbm.JdbmRdnIndexTest
Running org.apache.directory.server.core.partition.impl.btree.jdbm.BTreeRedirectMarshallerTest
Tests run: 7, Failures: 0, Errors: 0, Skipped: 0, Time elapsed: 0.009 sec - in org.apache.directory.server.core.partition.impl.btree.jdbm.BTreeRedirectMarshallerTest
Running org.apache.directory.server.core.partition.tree.PartitionTreeTest
Tests run: 3, Failures: 0, Errors: 0, Skipped: 0, Time elapsed: 0.415 sec - in org.apache.directory.server.core.partition.tree.PartitionTreeTest

Results :

Tests run: 124, Failures: 0, Errors: 0, Skipped: 0

[JENKINS] Recording test results
[INFO] 
[INFO] --- maven-bundle-plugin:2.5.3:bundle (default-bundle) @ apacheds-jdbm-partition ---
[INFO] 
[INFO] --- maven-site-plugin:3.4:attach-descriptor (attach-descriptor) @ apacheds-jdbm-partition
---
[INFO] 
[INFO] --- tools-maven-plugin:1.4:verify-legal-files (verify-legal-files) @ apacheds-jdbm-partition
---
[INFO] Checking legal files in: apacheds-jdbm-partition-2.0.0-M21-SNAPSHOT.jar
[WARNING] Failed to getClass for org.apache.maven.plugin.source.SourceJarMojo
[INFO] 
[INFO] --- maven-source-plugin:2.4:jar (attach-sources) @ apacheds-jdbm-partition ---
[INFO] Building jar: <https://builds.apache.org/job/dir-apacheds-ubuntu-deploy/ws/trunk/jdbm-partition/target/apacheds-jdbm-partition-2.0.0-M21-SNAPSHOT-sources.jar>
[INFO] 
[INFO] --- maven-install-plugin:2.5.2:install (default-install) @ apacheds-jdbm-partition
---
[INFO] Installing <https://builds.apache.org/job/dir-apacheds-ubuntu-deploy/ws/trunk/jdbm-partition/target/apacheds-jdbm-partition-2.0.0-M21-SNAPSHOT.jar>
to /jenkins/maven-repositories/0/org/apache/directory/server/apacheds-jdbm-partition/2.0.0-M21-SNAPSHOT/apacheds-jdbm-partition-2.0.0-M21-SNAPSHOT.jar
[INFO] Installing <https://builds.apache.org/job/dir-apacheds-ubuntu-deploy/ws/trunk/jdbm-partition/pom.xml>
to /jenkins/maven-repositories/0/org/apache/directory/server/apacheds-jdbm-partition/2.0.0-M21-SNAPSHOT/apacheds-jdbm-partition-2.0.0-M21-SNAPSHOT.pom
[INFO] Installing <https://builds.apache.org/job/dir-apacheds-ubuntu-deploy/ws/trunk/jdbm-partition/target/apacheds-jdbm-partition-2.0.0-M21-SNAPSHOT-sources.jar>
to /jenkins/maven-repositories/0/org/apache/directory/server/apacheds-jdbm-partition/2.0.0-M21-SNAPSHOT/apacheds-jdbm-partition-2.0.0-M21-SNAPSHOT-sources.jar
[INFO] 
[INFO] --- maven-bundle-plugin:2.5.3:install (default-install) @ apacheds-jdbm-partition ---
[INFO] Installing org/apache/directory/server/apacheds-jdbm-partition/2.0.0-M21-SNAPSHOT/apacheds-jdbm-partition-2.0.0-M21-SNAPSHOT.jar
[INFO] Writing OBR metadata
[INFO] 
[INFO] --- maven-deploy-plugin:2.8.2:deploy (default-deploy) @ apacheds-jdbm-partition ---
Downloading: https://repository.apache.org/content/repositories/snapshots/org/apache/directory/server/apacheds-jdbm-partition/2.0.0-M21-SNAPSHOT/maven-metadata.xml
Downloaded: https://repository.apache.org/content/repositories/snapshots/org/apache/directory/server/apacheds-jdbm-partition/2.0.0-M21-SNAPSHOT/maven-metadata.xml
(2 KB at 1.3 KB/sec)
Uploading: https://repository.apache.org/content/repositories/snapshots/org/apache/directory/server/apacheds-jdbm-partition/2.0.0-M21-SNAPSHOT/apacheds-jdbm-partition-2.0.0-M21-20150825.202744-114.jar
Uploaded: https://repository.apache.org/content/repositories/snapshots/org/apache/directory/server/apacheds-jdbm-partition/2.0.0-M21-SNAPSHOT/apacheds-jdbm-partition-2.0.0-M21-20150825.202744-114.jar
(73 KB at 80.3 KB/sec)
Uploading: https://repository.apache.org/content/repositories/snapshots/org/apache/directory/server/apacheds-jdbm-partition/2.0.0-M21-SNAPSHOT/apacheds-jdbm-partition-2.0.0-M21-20150825.202744-114.pom
Uploaded: https://repository.apache.org/content/repositories/snapshots/org/apache/directory/server/apacheds-jdbm-partition/2.0.0-M21-SNAPSHOT/apacheds-jdbm-partition-2.0.0-M21-20150825.202744-114.pom
(5 KB at 6.3 KB/sec)
Downloading: https://repository.apache.org/content/repositories/snapshots/org/apache/directory/server/apacheds-jdbm-partition/maven-metadata.xml
Downloaded: https://repository.apache.org/content/repositories/snapshots/org/apache/directory/server/apacheds-jdbm-partition/maven-metadata.xml
(418 B at 0.8 KB/sec)
Uploading: https://repository.apache.org/content/repositories/snapshots/org/apache/directory/server/apacheds-jdbm-partition/2.0.0-M21-SNAPSHOT/maven-metadata.xml
Uploaded: https://repository.apache.org/content/repositories/snapshots/org/apache/directory/server/apacheds-jdbm-partition/2.0.0-M21-SNAPSHOT/maven-metadata.xml
(2 KB at 1.5 KB/sec)
Uploading: https://repository.apache.org/content/repositories/snapshots/org/apache/directory/server/apacheds-jdbm-partition/maven-metadata.xml
Uploaded: https://repository.apache.org/content/repositories/snapshots/org/apache/directory/server/apacheds-jdbm-partition/maven-metadata.xml
(418 B at 0.6 KB/sec)
Uploading: https://repository.apache.org/content/repositories/snapshots/org/apache/directory/server/apacheds-jdbm-partition/2.0.0-M21-SNAPSHOT/apacheds-jdbm-partition-2.0.0-M21-20150825.202744-114-sources.jar
Uploaded: https://repository.apache.org/content/repositories/snapshots/org/apache/directory/server/apacheds-jdbm-partition/2.0.0-M21-SNAPSHOT/apacheds-jdbm-partition-2.0.0-M21-20150825.202744-114-sources.jar
(61 KB at 61.4 KB/sec)
Uploading: https://repository.apache.org/content/repositories/snapshots/org/apache/directory/server/apacheds-jdbm-partition/2.0.0-M21-SNAPSHOT/maven-metadata.xml
Uploaded: https://repository.apache.org/content/repositories/snapshots/org/apache/directory/server/apacheds-jdbm-partition/2.0.0-M21-SNAPSHOT/maven-metadata.xml
(2 KB at 1.4 KB/sec)
[INFO] 
[INFO] --- maven-bundle-plugin:2.5.3:deploy (default-deploy) @ apacheds-jdbm-partition ---
[INFO] Remote OBR update disabled (enable with -DremoteOBR)
[JENKINS] Archiving disabled
[INFO]                                                                         
[INFO] ------------------------------------------------------------------------
[INFO] Building ApacheDS Mavibot Partition 2.0.0-M21-SNAPSHOT
[INFO] ------------------------------------------------------------------------
Downloading: http://repo.maven.apache.org/maven2/org/apache/directory/mavibot/mavibot/1.0.0-M9/mavibot-1.0.0-M9.pom
[WARNING] The POM for org.apache.directory.mavibot:mavibot:jar:1.0.0-M9 is missing, no dependency
information available
Downloading: http://repo.maven.apache.org/maven2/org/apache/directory/mavibot/mavibot/1.0.0-M9/mavibot-1.0.0-M9.jar
[JENKINS] Archiving disabled
[INFO] ------------------------------------------------------------------------
[INFO] Reactor Summary:
[INFO] 
[INFO] ApacheDS .......................................... SUCCESS [23.002s]
[INFO] ApacheDS I18n ..................................... SUCCESS [8.978s]
[INFO] ApacheDS Core Constants ........................... SUCCESS [6.608s]
[INFO] ApacheDS Core API ................................. SUCCESS [1:21.510s]
[INFO] ApacheDS Core Shared .............................. SUCCESS [11.047s]
[INFO] ApacheDS Interceptors ............................. SUCCESS [4.202s]
[INFO] ApacheDS AdministrativePoint Interceptor .......... SUCCESS [9.191s]
[INFO] ApacheDS Authentication Interceptor ............... SUCCESS [10.649s]
[INFO] ApacheDS Interceptor to increment numeric attributes  SUCCESS [8.806s]
[INFO] ApacheDS Authorization Interceptor ................ SUCCESS [13.164s]
[INFO] ApacheDS ChangeLog Interceptor .................... SUCCESS [10.701s]
[INFO] ApacheDS Collective Attribute Interceptor ......... SUCCESS [8.071s]
[INFO] ApacheDS Event Interceptor ........................ SUCCESS [8.748s]
[INFO] ApacheDS Exception Interceptor .................... SUCCESS [8.914s]
[INFO] ApacheDS Journal Interceptor ...................... SUCCESS [8.531s]
[INFO] ApacheDS Normalization Interceptor ................ SUCCESS [10.651s]
[INFO] ApacheDS Operational Attribute Interceptor ........ SUCCESS [10.065s]
[INFO] ApacheDS Referral Interceptor ..................... SUCCESS [8.288s]
[INFO] ApacheDS Schema Interceptor ....................... SUCCESS [11.323s]
[INFO] ApacheDS Subtree Interceptor ...................... SUCCESS [11.856s]
[INFO] ApacheDS Triggers Interceptor ..................... SUCCESS [9.805s]
[INFO] ApacheDS Core ..................................... SUCCESS [11.799s]
[INFO] ApacheDS Core AVL ................................. SUCCESS [14.471s]
[INFO] ApacheDS Generalized (X) DBM Partition ............ SUCCESS [21.878s]
[INFO] ApacheDS LDIF Partition ........................... SUCCESS [12.849s]
[INFO] ApacheDS JDBM Partition ........................... SUCCESS [21.760s]
[INFO] ApacheDS Mavibot Partition ........................ FAILURE [0.324s]
[INFO] ApacheDS Core Annotations ......................... SKIPPED
[INFO] ApacheDS Core JNDI ................................ SKIPPED
[INFO] ApacheDS Protocol Kerberos Codec .................. SKIPPED
[INFO] ApacheDS Interceptors for Kerberos ................ SKIPPED
[INFO] ApacheDS Protocol Dhcp ............................ SKIPPED
[INFO] ApacheDS Protocol Shared .......................... SKIPPED
[INFO] ApacheDS Protocol Dns ............................. SKIPPED
[INFO] ApacheDS Protocol Kerberos ........................ SKIPPED
[INFO] ApacheDS Protocol Ldap ............................ SKIPPED
[INFO] ApacheDS Protocol Ntp ............................. SKIPPED
[INFO] Apacheds Server Annotations ....................... SKIPPED
[INFO] ApacheDS Server Config ............................ SKIPPED
[INFO] ApacheDS Server JNDI .............................. SKIPPED
[INFO] ApacheDS Test Framework ........................... SKIPPED
[INFO] ApacheDS All ...................................... SKIPPED
[INFO] ApacheDS Logger Interceptor ....................... SKIPPED
[INFO] ApacheDS Password Hashing Interceptor ............. SKIPPED
[INFO] ApacheDS Core Integration ......................... SKIPPED
[INFO] ApacheDS Protocol Kerberos Test ................... SKIPPED
[INFO] ApacheDS Server Integration ....................... SKIPPED
[INFO] ApacheDS DirectoryService-WebApp bridge ........... SKIPPED
[INFO] ApacheDS Jetty HTTP Server Integration ............ SKIPPED
[INFO] ApacheDS Service Builder .......................... SKIPPED
[INFO] Apache Directory LDAP Client API test ............. SKIPPED
[INFO] kerberos-client ................................... SKIPPED
[INFO] ApacheDS Service .................................. SKIPPED
[INFO] ApacheDS Wrapper .................................. SKIPPED
[INFO] ApacheDS Installers Maven Plugin .................. SKIPPED
[INFO] ApacheDS Installers ............................... SKIPPED
[INFO] ApacheDS OSGi Integration Tests ................... SKIPPED
[INFO] ------------------------------------------------------------------------
[INFO] BUILD FAILURE
[INFO] ------------------------------------------------------------------------
[INFO] Total time: 6:37.347s
[INFO] Finished at: Tue Aug 25 20:27:51 UTC 2015
[INFO] Final Memory: 69M/232M
[INFO] ------------------------------------------------------------------------
[JENKINS] Archiving disabled
[JENKINS] Archiving disabled
[JENKINS] Archiving disabled
[JENKINS] Archiving disabled
[JENKINS] Archiving disabled
[JENKINS] Archiving disabled
[JENKINS] Archiving disabled
[JENKINS] Archiving disabled
[JENKINS] Archiving disabled
[JENKINS] Archiving disabled
[JENKINS] Archiving disabled
[JENKINS] Archiving disabled
[JENKINS] Archiving disabled
[JENKINS] Archiving disabled
[JENKINS] Archiving disabled
[JENKINS] Archiving disabled
[JENKINS] Archiving disabled
[JENKINS] Archiving disabled
[JENKINS] Archiving disabled
[JENKINS] Archiving disabled
[JENKINS] Archiving disabled
[JENKINS] Archiving disabled
[JENKINS] Archiving disabled
[JENKINS] Archiving disabled
[JENKINS] Archiving disabled
[JENKINS] Archiving disabled
[JENKINS] Archiving disabled
[JENKINS] Archiving disabled
[JENKINS] Archiving disabled
[JENKINS] Archiving disabled
[JENKINS] Archiving disabled
[JENKINS] Archiving disabled
[JENKINS] Archiving disabled
[JENKINS] Archiving disabled
[JENKINS] Archiving disabled
[JENKINS] Archiving disabled
[JENKINS] Archiving disabled
[JENKINS] Archiving disabled
[JENKINS] Archiving disabled
[JENKINS] Archiving disabled
[JENKINS] Archiving disabled
[JENKINS] Archiving disabled
[JENKINS] Archiving disabled
[JENKINS] Archiving disabled
[JENKINS] Archiving disabled
[JENKINS] Archiving disabled
[JENKINS] Archiving disabled
[JENKINS] Archiving disabled
[JENKINS] Archiving disabled
[JENKINS] Archiving disabled
[JENKINS] Archiving disabled
[JENKINS] Archiving disabled
[JENKINS] Archiving disabled
[JENKINS] Archiving disabled
[JENKINS] Archiving disabled
[JENKINS] Archiving disabled
[JENKINS] Archiving disabled
Waiting for Jenkins to finish collecting data
[ERROR] Failed to execute goal on project apacheds-mavibot-partition: Could not resolve dependencies
for project org.apache.directory.server:apacheds-mavibot-partition:bundle:2.0.0-M21-SNAPSHOT:
Could not find artifact org.apache.directory.mavibot:mavibot:jar:1.0.0-M9 in central (http://repo.maven.apache.org/maven2)
-> [Help 1]
[ERROR] 
[ERROR] To see the full stack trace of the errors, re-run Maven with the -e switch.
[ERROR] Re-run Maven using the -X switch to enable full debug logging.
[ERROR] 
[ERROR] For more information about the errors and possible solutions, please read the following
articles:
[ERROR] [Help 1] http://cwiki.apache.org/confluence/display/MAVEN/DependencyResolutionException
[ERROR] 
[ERROR] After correcting the problems, you can resume the build with the command
[ERROR]   mvn <goals> -rf :apacheds-mavibot-partition
channel stopped

Mime
View raw message