directory-notifications mailing list archives

Site index · List index
Message view « Date » · « Thread »
Top « Date » · « Thread »
From gmcdon...@apache.org
Subject Build failed in Jenkins: directory-kerby #95
Date Sun, 09 Aug 2015 06:23:49 GMT
See <https://analysis.apache.org/jenkins/job/directory-kerby/95/changes>

Changes:

[drankye] Refined kdc init tool

[drankye] Debug option and usage fixup for the tools

------------------------------------------
[...truncated 1505 lines...]
Iteration   7: 1.498 ms/op
Iteration   8: 1.507 ms/op
Iteration   9: 1.508 ms/op
Iteration  10: 1.506 ms/op
Iteration  11: 1.498 ms/op
Iteration  12: 1.512 ms/op
Iteration  13: 1.502 ms/op
Iteration  14: 1.495 ms/op
Iteration  15: 1.492 ms/op
Iteration  16: 1.476 ms/op
Iteration  17: 1.480 ms/op
Iteration  18: 1.482 ms/op
Iteration  19: 1.487 ms/op
Iteration  20: 1.498 ms/op


Result "queryTest":
  1.511 ±(99.9%) 0.050 ms/op [Average]
  (min, avg, max) = (1.476, 1.511, 1.753), stdev = 0.058
  CI (99.9%): [1.461, 1.561] (assumes normal distribution)


# JMH 1.10.3 (released 23 days ago)
# VM version: JDK 1.7.0_65, VM 24.65-b04
# VM invoker: /x1/jenkins/jenkins-master/jenkins-home/tools/hudson.model.JDK/jdk1.7.0_65/jre/bin/java
# VM options: <none>
# Warmup: 5 iterations, 1 s each
# Measurement: 20 iterations, 1 s each
# Timeout: 10 min per iteration
# Threads: 1 thread, will synchronize iterations
# Benchmark mode: Average time, time/op
# Benchmark: org.apache.kerby.benchmark.KrbCodecBenchmark.decodeWithApacheDS

# Run progress: 44.44% complete, ETA 00:00:58
# Fork: 1 of 1
# Warmup Iteration   1: log4j:WARN No appenders could be found for logger (org.apache.directory.api.asn1.ber.Asn1Decoder).
log4j:WARN Please initialize the log4j system properly.
log4j:WARN See http://logging.apache.org/log4j/1.2/faq.html#noconfig for more info.
3.958 ms/op
# Warmup Iteration   2: 1.674 ms/op
# Warmup Iteration   3: 1.520 ms/op
# Warmup Iteration   4: 1.255 ms/op
# Warmup Iteration   5: 1.151 ms/op
Iteration   1: 0.971 ms/op
Iteration   2: 0.958 ms/op
Iteration   3: 0.928 ms/op
Iteration   4: 0.932 ms/op
Iteration   5: 0.918 ms/op
Iteration   6: 0.952 ms/op
Iteration   7: 0.917 ms/op
Iteration   8: 0.885 ms/op
Iteration   9: 0.902 ms/op
Iteration  10: 0.876 ms/op
Iteration  11: 0.885 ms/op
Iteration  12: 0.872 ms/op
Iteration  13: 0.866 ms/op
Iteration  14: 0.885 ms/op
Iteration  15: 0.856 ms/op
Iteration  16: 0.861 ms/op
Iteration  17: 0.850 ms/op
Iteration  18: 0.864 ms/op
Iteration  19: 0.872 ms/op
Iteration  20: 0.884 ms/op


Result "decodeWithApacheDS":
  0.897 ±(99.9%) 0.031 ms/op [Average]
  (min, avg, max) = (0.850, 0.897, 0.971), stdev = 0.036
  CI (99.9%): [0.865, 0.928] (assumes normal distribution)


# JMH 1.10.3 (released 23 days ago)
# VM version: JDK 1.7.0_65, VM 24.65-b04
# VM invoker: /x1/jenkins/jenkins-master/jenkins-home/tools/hudson.model.JDK/jdk1.7.0_65/jre/bin/java
# VM options: <none>
# Warmup: 5 iterations, 1 s each
# Measurement: 20 iterations, 1 s each
# Timeout: 10 min per iteration
# Threads: 1 thread, will synchronize iterations
# Benchmark mode: Average time, time/op
# Benchmark: org.apache.kerby.benchmark.KrbCodecBenchmark.decodeWithKerby

# Run progress: 72.22% complete, ETA 00:00:27
# Fork: 1 of 1
# Warmup Iteration   1: 0.096 ms/op
# Warmup Iteration   2: 0.012 ms/op
# Warmup Iteration   3: 0.011 ms/op
# Warmup Iteration   4: 0.012 ms/op
# Warmup Iteration   5: 0.009 ms/op
Iteration   1: 0.009 ms/op
Iteration   2: 0.009 ms/op
Iteration   3: 0.009 ms/op
Iteration   4: 0.009 ms/op
Iteration   5: 0.009 ms/op
Iteration   6: 0.009 ms/op
Iteration   7: 0.009 ms/op
Iteration   8: 0.009 ms/op
Iteration   9: 0.009 ms/op
Iteration  10: 0.009 ms/op
Iteration  11: 0.009 ms/op
Iteration  12: 0.009 ms/op
Iteration  13: 0.009 ms/op
Iteration  14: 0.009 ms/op
Iteration  15: 0.009 ms/op
Iteration  16: 0.009 ms/op
Iteration  17: 0.009 ms/op
Iteration  18: 0.009 ms/op
Iteration  19: 0.009 ms/op
Iteration  20: 0.009 ms/op


Result "decodeWithKerby":
  0.009 ±(99.9%) 0.001 ms/op [Average]
  (min, avg, max) = (0.009, 0.009, 0.009), stdev = 0.001
  CI (99.9%): [0.009, 0.009] (assumes normal distribution)


# Run complete. Total time: 00:01:37

Benchmark                             Mode  Cnt  Score    Error  Units
JsonBackendBenchmark.queryTest        avgt   20  1.511 ±  0.050  ms/op
KrbCodecBenchmark.decodeWithApacheDS  avgt   20  0.897 ±  0.031  ms/op
KrbCodecBenchmark.decodeWithKerby     avgt   20  0.009 ±  0.001  ms/op
[INFO] 
[INFO] --- maven-install-plugin:2.5.2:install (default-install) @ benchmark ---
[INFO] Installing <https://analysis.apache.org/jenkins/job/directory-kerby/ws/benchmark/target/benchmark-1.0-SNAPSHOT.jar>
to /x1/jenkins/mvn-repo/org/apache/kerby/benchmark/1.0-SNAPSHOT/benchmark-1.0-SNAPSHOT.jar
[INFO] Installing <https://analysis.apache.org/jenkins/job/directory-kerby/ws/benchmark/pom.xml>
to /x1/jenkins/mvn-repo/org/apache/kerby/benchmark/1.0-SNAPSHOT/benchmark-1.0-SNAPSHOT.pom
[INFO] ------------------------------------------------------------------------
[INFO] Reactor Summary:
[INFO] 
[INFO] Apache Kerby Project .............................. SUCCESS [7.247s]
[INFO] Kerby Config ...................................... SUCCESS [7.114s]
[INFO] Kerby Util ........................................ SUCCESS [2.480s]
[INFO] Kerby ASN1 Project ................................ SUCCESS [4.718s]
[INFO] Kerby-kerb Project ................................ SUCCESS [0.824s]
[INFO] Kerby-kerb core ................................... SUCCESS [6.869s]
[INFO] Kerby-kerb Crypto ................................. SUCCESS [4.577s]
[INFO] Kerby-kerb Util ................................... SUCCESS [1.533s]
[INFO] kerby-kerb-coreTest ............................... SUCCESS [1.209s]
[INFO] Kerby-kerb Common ................................. SUCCESS [2.029s]
[INFO] Kerby-kerb Identity ............................... SUCCESS [1.392s]
[INFO] Kerby-kerb Identity Test .......................... SUCCESS [1.629s]
[INFO] Kerby-kerb Client ................................. SUCCESS [2.418s]
[INFO] Kerby-kerb Server ................................. SUCCESS [2.343s]
[INFO] Kerby-kerb Admin .................................. SUCCESS [1.431s]
[INFO] Kerb Simple Kdc ................................... SUCCESS [1.387s]
[INFO] Kerb Kdc Test ..................................... SUCCESS [1.298s]
[INFO] Kerby providers ................................... SUCCESS [0.843s]
[INFO] Token provider .................................... SUCCESS [1.808s]
[INFO] Kerb Integration Test ............................. SUCCESS [1.841s]
[INFO] Kerby-kerb client api all ......................... SUCCESS [1.360s]
[INFO] Kerby-kerb server all ............................. SUCCESS [0.963s]
[INFO] Kerby KDC Server .................................. FAILURE [0.955s]
[INFO] Kdc Tool Project .................................. SUCCESS [0.578s]
[INFO] Client Tool ....................................... FAILURE [2.420s]
[INFO] KDC Tool .......................................... FAILURE [0.880s]
[INFO] Kerby Backend ..................................... SUCCESS [0.583s]
[INFO] Json identity backend ............................. SUCCESS [1.313s]
[INFO] Zookeeper identity backend ........................ SUCCESS [2.380s]
[INFO] Ldap identity backend ............................. SUCCESS [7.087s]
[INFO] Kerby Kdc Test .................................... SKIPPED
[INFO] Kerby Distribution ................................ SUCCESS [0.640s]
[INFO] KDC Dist .......................................... SKIPPED
[INFO] Tool Dist ......................................... SKIPPED
[INFO] Kerby benchmark ................................... SUCCESS [1:52.168s]
[INFO] ------------------------------------------------------------------------
[INFO] BUILD FAILURE
[INFO] ------------------------------------------------------------------------
[INFO] Total time: 3:10.866s
[INFO] Finished at: Sun Aug 09 06:23:46 UTC 2015
[INFO] Final Memory: 90M/291M
[INFO] ------------------------------------------------------------------------
Waiting for Jenkins to finish collecting data[ERROR] Failed to execute goal org.apache.maven.plugins:maven-checkstyle-plugin:2.15:check
(validate) on project kerby-kdc: You have 1 Checkstyle violation. -> [Help 1]
[ERROR] Failed to execute goal org.apache.maven.plugins:maven-checkstyle-plugin:2.15:check
(validate) on project client-tool: You have 2 Checkstyle violations. -> [Help 1]
[ERROR] Failed to execute goal org.apache.maven.plugins:maven-checkstyle-plugin:2.15:check
(validate) on project kdc-tool: You have 5 Checkstyle violations. -> [Help 1]
[ERROR] 
[ERROR] To see the full stack trace of the errors, re-run Maven with the -e switch.
[ERROR] Re-run Maven using the -X switch to enable full debug logging.
[ERROR] 
[ERROR] For more information about the errors and possible solutions, please read the following
articles:
[ERROR] [Help 1] http://cwiki.apache.org/confluence/display/MAVEN/MojoFailureException
[ERROR] 
[ERROR] After correcting the problems, you can resume the build with the command
[ERROR]   mvn <goals> -rf :kerby-kdc

[JENKINS] Archiving <https://analysis.apache.org/jenkins/job/directory-kerby/ws/kerby-backend/ldap-backend/pom.xml>
to org.apache.kerby/ldap-backend/1.0-SNAPSHOT/ldap-backend-1.0-SNAPSHOT.pom
[JENKINS] Archiving <https://analysis.apache.org/jenkins/job/directory-kerby/ws/kerby-backend/ldap-backend/target/ldap-backend-1.0-SNAPSHOT.jar>
to org.apache.kerby/ldap-backend/1.0-SNAPSHOT/ldap-backend-1.0-SNAPSHOT.jar
[JENKINS] Archiving <https://analysis.apache.org/jenkins/job/directory-kerby/ws/kerby-backend/json-backend/pom.xml>
to org.apache.kerby/json-backend/1.0-SNAPSHOT/json-backend-1.0-SNAPSHOT.pom
[JENKINS] Archiving <https://analysis.apache.org/jenkins/job/directory-kerby/ws/kerby-backend/json-backend/target/json-backend-1.0-SNAPSHOT.jar>
to org.apache.kerby/json-backend/1.0-SNAPSHOT/json-backend-1.0-SNAPSHOT.jar
[JENKINS] Archiving <https://analysis.apache.org/jenkins/job/directory-kerby/ws/kerby-kdc-test/pom.xml>
to org.apache.kerby/kerby-kdc-test/1.0-SNAPSHOT/kerby-kdc-test-1.0-SNAPSHOT.pom
[JENKINS] Archiving <https://analysis.apache.org/jenkins/job/directory-kerby/ws/kerby-kerb/kerb-util/pom.xml>
to org.apache.kerby/kerb-util/1.0-SNAPSHOT/kerb-util-1.0-SNAPSHOT.pom
[JENKINS] Archiving <https://analysis.apache.org/jenkins/job/directory-kerby/ws/kerby-kerb/kerb-util/target/kerb-util-1.0-SNAPSHOT.jar>
to org.apache.kerby/kerb-util/1.0-SNAPSHOT/kerb-util-1.0-SNAPSHOT.jar
[JENKINS] Archiving <https://analysis.apache.org/jenkins/job/directory-kerby/ws/kerby-kerb/kerb-crypto/pom.xml>
to org.apache.kerby/kerb-crypto/1.0-SNAPSHOT/kerb-crypto-1.0-SNAPSHOT.pom
[JENKINS] Archiving <https://analysis.apache.org/jenkins/job/directory-kerby/ws/kerby-kerb/kerb-crypto/target/kerb-crypto-1.0-SNAPSHOT.jar>
to org.apache.kerby/kerb-crypto/1.0-SNAPSHOT/kerb-crypto-1.0-SNAPSHOT.jar
[JENKINS] Archiving <https://analysis.apache.org/jenkins/job/directory-kerby/ws/kerby-provider/token-provider/pom.xml>
to org.apache.kerby/token-provider/1.0-SNAPSHOT/token-provider-1.0-SNAPSHOT.pom
[JENKINS] Archiving <https://analysis.apache.org/jenkins/job/directory-kerby/ws/kerby-provider/token-provider/target/token-provider-1.0-SNAPSHOT.jar>
to org.apache.kerby/token-provider/1.0-SNAPSHOT/token-provider-1.0-SNAPSHOT.jar
[JENKINS] Archiving <https://analysis.apache.org/jenkins/job/directory-kerby/ws/kerby-kerb/kerb-client-api-all/pom.xml>
to org.apache.kerby/kerb-client-api-all/1.0-SNAPSHOT/kerb-client-api-all-1.0-SNAPSHOT.pom
[JENKINS] Archiving <https://analysis.apache.org/jenkins/job/directory-kerby/ws/kerby-kerb/kerb-client-api-all/target/kerb-client-api-all-1.0-SNAPSHOT.jar>
to org.apache.kerby/kerb-client-api-all/1.0-SNAPSHOT/kerb-client-api-all-1.0-SNAPSHOT.jar
[JENKINS] Archiving <https://analysis.apache.org/jenkins/job/directory-kerby/ws/kerby-tool/client-tool/pom.xml>
to org.apache.kerby/client-tool/1.0-SNAPSHOT/client-tool-1.0-SNAPSHOT.pom
[JENKINS] Archiving <https://analysis.apache.org/jenkins/job/directory-kerby/ws/kerby-dist/pom.xml>
to org.apache.kerby/kerby-dist/1.0-SNAPSHOT/kerby-dist-1.0-SNAPSHOT.pom
[JENKINS] Archiving <https://analysis.apache.org/jenkins/job/directory-kerby/ws/kerby-kerb/kerb-server/pom.xml>
to org.apache.kerby/kerb-server/1.0-SNAPSHOT/kerb-server-1.0-SNAPSHOT.pom
[JENKINS] Archiving <https://analysis.apache.org/jenkins/job/directory-kerby/ws/kerby-kerb/kerb-server/target/kerb-server-1.0-SNAPSHOT.jar>
to org.apache.kerby/kerb-server/1.0-SNAPSHOT/kerb-server-1.0-SNAPSHOT.jar
[JENKINS] Archiving <https://analysis.apache.org/jenkins/job/directory-kerby/ws/kerby-tool/kdc-tool/pom.xml>
to org.apache.kerby/kdc-tool/1.0-SNAPSHOT/kdc-tool-1.0-SNAPSHOT.pom
[JENKINS] Archiving <https://analysis.apache.org/jenkins/job/directory-kerby/ws/kerby-dist/kdc-dist/pom.xml>
to org.apache.kerby/kdc-dist/1.0-SNAPSHOT/kdc-dist-1.0-SNAPSHOT.pom
[JENKINS] Archiving <https://analysis.apache.org/jenkins/job/directory-kerby/ws/kerby-asn1/pom.xml>
to org.apache.kerby/kerby-asn1/1.0-SNAPSHOT/kerby-asn1-1.0-SNAPSHOT.pom
[JENKINS] Archiving <https://analysis.apache.org/jenkins/job/directory-kerby/ws/kerby-asn1/target/kerby-asn1-1.0-SNAPSHOT.jar>
to org.apache.kerby/kerby-asn1/1.0-SNAPSHOT/kerby-asn1-1.0-SNAPSHOT.jar
[JENKINS] Archiving <https://analysis.apache.org/jenkins/job/directory-kerby/ws/benchmark/pom.xml>
to org.apache.kerby/benchmark/1.0-SNAPSHOT/benchmark-1.0-SNAPSHOT.pom
[JENKINS] Archiving <https://analysis.apache.org/jenkins/job/directory-kerby/ws/benchmark/target/benchmark-1.0-SNAPSHOT.jar>
to org.apache.kerby/benchmark/1.0-SNAPSHOT/benchmark-1.0-SNAPSHOT.jar
[JENKINS] Archiving <https://analysis.apache.org/jenkins/job/directory-kerby/ws/kerby-provider/pom.xml>
to org.apache.kerby/kerby-provider/1.0-SNAPSHOT/kerby-provider-1.0-SNAPSHOT.pom
[JENKINS] Archiving <https://analysis.apache.org/jenkins/job/directory-kerby/ws/kerby-kerb/kerb-admin/pom.xml>
to org.apache.kerby/kerb-admin/1.0-SNAPSHOT/kerb-admin-1.0-SNAPSHOT.pom
[JENKINS] Archiving <https://analysis.apache.org/jenkins/job/directory-kerby/ws/kerby-kerb/kerb-admin/target/kerb-admin-1.0-SNAPSHOT.jar>
to org.apache.kerby/kerb-admin/1.0-SNAPSHOT/kerb-admin-1.0-SNAPSHOT.jar
[JENKINS] Archiving <https://analysis.apache.org/jenkins/job/directory-kerby/ws/kerby-kerb/integration-test/pom.xml>
to org.apache.kerby/integration-test/1.0-SNAPSHOT/integration-test-1.0-SNAPSHOT.pom
[JENKINS] Archiving <https://analysis.apache.org/jenkins/job/directory-kerby/ws/kerby-kerb/integration-test/target/integration-test-1.0-SNAPSHOT.jar>
to org.apache.kerby/integration-test/1.0-SNAPSHOT/integration-test-1.0-SNAPSHOT.jar
[JENKINS] Archiving <https://analysis.apache.org/jenkins/job/directory-kerby/ws/kerby-kerb/kerb-simplekdc/pom.xml>
to org.apache.kerby/kerb-simplekdc/1.0-SNAPSHOT/kerb-simplekdc-1.0-SNAPSHOT.pom
[JENKINS] Archiving <https://analysis.apache.org/jenkins/job/directory-kerby/ws/kerby-kerb/kerb-simplekdc/target/kerb-simplekdc-1.0-SNAPSHOT.jar>
to org.apache.kerby/kerb-simplekdc/1.0-SNAPSHOT/kerb-simplekdc-1.0-SNAPSHOT.jar
[JENKINS] Archiving <https://analysis.apache.org/jenkins/job/directory-kerby/ws/kerby-kerb/kerb-core-test/pom.xml>
to org.apache.kerby/kerb-core-test/1.0-SNAPSHOT/kerb-core-test-1.0-SNAPSHOT.pom
[JENKINS] Archiving <https://analysis.apache.org/jenkins/job/directory-kerby/ws/kerby-kerb/kerb-core-test/target/kerb-core-test-1.0-SNAPSHOT.jar>
to org.apache.kerby/kerb-core-test/1.0-SNAPSHOT/kerb-core-test-1.0-SNAPSHOT.jar
[JENKINS] Archiving <https://analysis.apache.org/jenkins/job/directory-kerby/ws/kerby-kerb/kerb-client/pom.xml>
to org.apache.kerby/kerb-client/1.0-SNAPSHOT/kerb-client-1.0-SNAPSHOT.pom
[JENKINS] Archiving <https://analysis.apache.org/jenkins/job/directory-kerby/ws/kerby-kerb/kerb-client/target/kerb-client-1.0-SNAPSHOT.jar>
to org.apache.kerby/kerb-client/1.0-SNAPSHOT/kerb-client-1.0-SNAPSHOT.jar
[JENKINS] Archiving <https://analysis.apache.org/jenkins/job/directory-kerby/ws/kerby-kerb/pom.xml>
to org.apache.kerby/kerby-kerb/1.0-SNAPSHOT/kerby-kerb-1.0-SNAPSHOT.pom
[JENKINS] Archiving <https://analysis.apache.org/jenkins/job/directory-kerby/ws/kerby-backend/zookeeper-backend/pom.xml>
to org.apache.kerby/zookeeper-backend/1.0-SNAPSHOT/zookeeper-backend-1.0-SNAPSHOT.pom
[JENKINS] Archiving <https://analysis.apache.org/jenkins/job/directory-kerby/ws/kerby-backend/zookeeper-backend/target/zookeeper-backend-1.0-SNAPSHOT.jar>
to org.apache.kerby/zookeeper-backend/1.0-SNAPSHOT/zookeeper-backend-1.0-SNAPSHOT.jar
[JENKINS] Archiving <https://analysis.apache.org/jenkins/job/directory-kerby/ws/kerby-config/pom.xml>
to org.apache.kerby/kerby-config/1.0-SNAPSHOT/kerby-config-1.0-SNAPSHOT.pom
[JENKINS] Archiving <https://analysis.apache.org/jenkins/job/directory-kerby/ws/kerby-config/target/kerby-config-1.0-SNAPSHOT.jar>
to org.apache.kerby/kerby-config/1.0-SNAPSHOT/kerby-config-1.0-SNAPSHOT.jar
[JENKINS] Archiving <https://analysis.apache.org/jenkins/job/directory-kerby/ws/kerby-util/pom.xml>
to org.apache.kerby/kerby-util/1.0-SNAPSHOT/kerby-util-1.0-SNAPSHOT.pom
[JENKINS] Archiving <https://analysis.apache.org/jenkins/job/directory-kerby/ws/kerby-util/target/kerby-util-1.0-SNAPSHOT.jar>
to org.apache.kerby/kerby-util/1.0-SNAPSHOT/kerby-util-1.0-SNAPSHOT.jar
[JENKINS] Archiving <https://analysis.apache.org/jenkins/job/directory-kerby/ws/kerby-kerb/kerb-common/pom.xml>
to org.apache.kerby/kerb-common/1.0-SNAPSHOT/kerb-common-1.0-SNAPSHOT.pom
[JENKINS] Archiving <https://analysis.apache.org/jenkins/job/directory-kerby/ws/kerby-kerb/kerb-common/target/kerb-common-1.0-SNAPSHOT.jar>
to org.apache.kerby/kerb-common/1.0-SNAPSHOT/kerb-common-1.0-SNAPSHOT.jar
[JENKINS] Archiving <https://analysis.apache.org/jenkins/job/directory-kerby/ws/kerby-kerb/kerb-core/pom.xml>
to org.apache.kerby/kerb-core/1.0-SNAPSHOT/kerb-core-1.0-SNAPSHOT.pom
[JENKINS] Archiving <https://analysis.apache.org/jenkins/job/directory-kerby/ws/kerby-kerb/kerb-core/target/kerb-core-1.0-SNAPSHOT.jar>
to org.apache.kerby/kerb-core/1.0-SNAPSHOT/kerb-core-1.0-SNAPSHOT.jar
[JENKINS] Archiving <https://analysis.apache.org/jenkins/job/directory-kerby/ws/kerby-kdc/pom.xml>
to org.apache.kerby/kerby-kdc/1.0-SNAPSHOT/kerby-kdc-1.0-SNAPSHOT.pom
[JENKINS] Archiving <https://analysis.apache.org/jenkins/job/directory-kerby/ws/kerby-kerb/kerb-identity/pom.xml>
to org.apache.kerby/kerb-identity/1.0-SNAPSHOT/kerb-identity-1.0-SNAPSHOT.pom
[JENKINS] Archiving <https://analysis.apache.org/jenkins/job/directory-kerby/ws/kerby-kerb/kerb-identity/target/kerb-identity-1.0-SNAPSHOT.jar>
to org.apache.kerby/kerb-identity/1.0-SNAPSHOT/kerb-identity-1.0-SNAPSHOT.jar
[JENKINS] Archiving <https://analysis.apache.org/jenkins/job/directory-kerby/ws/kerby-backend/pom.xml>
to org.apache.kerby/kerby-backend/1.0-SNAPSHOT/kerby-backend-1.0-SNAPSHOT.pom
[JENKINS] Archiving <https://analysis.apache.org/jenkins/job/directory-kerby/ws/kerby-tool/pom.xml>
to org.apache.kerby/kerby-tool/1.0-SNAPSHOT/kerby-tool-1.0-SNAPSHOT.pom
[JENKINS] Archiving <https://analysis.apache.org/jenkins/job/directory-kerby/ws/pom.xml>
to org.apache.kerby/kerby-all/1.0-SNAPSHOT/kerby-all-1.0-SNAPSHOT.pom
[JENKINS] Archiving <https://analysis.apache.org/jenkins/job/directory-kerby/ws/kerby-kerb/kerb-kdc-test/pom.xml>
to org.apache.kerby/kerb-kdc-test/1.0-SNAPSHOT/kerb-kdc-test-1.0-SNAPSHOT.pom
[JENKINS] Archiving <https://analysis.apache.org/jenkins/job/directory-kerby/ws/kerby-kerb/kerb-kdc-test/target/kerb-kdc-test-1.0-SNAPSHOT.jar>
to org.apache.kerby/kerb-kdc-test/1.0-SNAPSHOT/kerb-kdc-test-1.0-SNAPSHOT.jar
[JENKINS] Archiving <https://analysis.apache.org/jenkins/job/directory-kerby/ws/kerby-kerb/kerb-kdc-test/target/kerb-kdc-test-1.0-SNAPSHOT-tests.jar>
to org.apache.kerby/kerb-kdc-test/1.0-SNAPSHOT/kerb-kdc-test-1.0-SNAPSHOT-tests.jar
[JENKINS] Archiving <https://analysis.apache.org/jenkins/job/directory-kerby/ws/kerby-dist/tool-dist/pom.xml>
to org.apache.kerby/tool-dist/1.0-SNAPSHOT/tool-dist-1.0-SNAPSHOT.pom
[JENKINS] Archiving <https://analysis.apache.org/jenkins/job/directory-kerby/ws/kerby-kerb/kerb-identity-test/pom.xml>
to org.apache.kerby/kerb-identity-test/1.0-SNAPSHOT/kerb-identity-test-1.0-SNAPSHOT.pom
[JENKINS] Archiving <https://analysis.apache.org/jenkins/job/directory-kerby/ws/kerby-kerb/kerb-identity-test/target/kerb-identity-test-1.0-SNAPSHOT.jar>
to org.apache.kerby/kerb-identity-test/1.0-SNAPSHOT/kerb-identity-test-1.0-SNAPSHOT.jar
[JENKINS] Archiving <https://analysis.apache.org/jenkins/job/directory-kerby/ws/kerby-kerb/kerb-server-api-all/pom.xml>
to org.apache.kerby/kerb-server-api-all/1.0-SNAPSHOT/kerb-server-api-all-1.0-SNAPSHOT.pom
[JENKINS] Archiving <https://analysis.apache.org/jenkins/job/directory-kerby/ws/kerby-kerb/kerb-server-api-all/target/kerb-server-api-all-1.0-SNAPSHOT.jar>
to org.apache.kerby/kerb-server-api-all/1.0-SNAPSHOT/kerb-server-api-all-1.0-SNAPSHOT.jar
Sending e-mails to: notifications@directory.apache.org
Sending e-mails to: notifications@directory.apache.org
Sending e-mails to: notifications@directory.apache.org
channel stopped
Skipping sonar analysis due to bad build status FAILURE

Mime
View raw message