directory-notifications mailing list archives

Site index · List index
Message view « Date » · « Thread »
Top « Date » · « Thread »
From Apache Jenkins Server <jenk...@builds.apache.org>
Subject Build failed in Jenkins: dir-apacheds-ubuntu-deploy #1795
Date Fri, 14 Aug 2015 05:27:14 GMT
See <https://builds.apache.org/job/dir-apacheds-ubuntu-deploy/1795/>

------------------------------------------
[...truncated 4404 lines...]
Downloaded: http://repository.apache.org/snapshots/org/apache/directory/api/api-dsml-engine/1.0.0-M32-SNAPSHOT/api-dsml-engine-1.0.0-M32-20150814.030447-43.jar
(16 KB at 101.5 KB/sec)
Downloaded: http://repository.apache.org/snapshots/org/apache/directory/api/api-dsml-parser/1.0.0-M32-SNAPSHOT/api-dsml-parser-1.0.0-M32-20150814.030355-43.jar
(210 KB at 902.8 KB/sec)
[INFO] 
[INFO] --- maven-clean-plugin:2.6.1:clean (default-clean) @ apacheds-server-integ ---
[INFO] Deleting <https://builds.apache.org/job/dir-apacheds-ubuntu-deploy/ws/trunk/server-integ/target>
[INFO] 
[INFO] --- maven-remote-resources-plugin:1.5:process (default) @ apacheds-server-integ ---
[INFO] 
[INFO] --- maven-resources-plugin:2.7:resources (default-resources) @ apacheds-server-integ
---
[INFO] Using 'UTF-8' encoding to copy filtered resources.
[INFO] Copying 0 resource
[INFO] Copying 3 resources
[INFO] 
[INFO] --- maven-compiler-plugin:3.2:compile (default-compile) @ apacheds-server-integ ---
[INFO] Changes detected - recompiling the module!
[INFO] Compiling 1 source file to <https://builds.apache.org/job/dir-apacheds-ubuntu-deploy/ws/trunk/server-integ/target/classes>
[INFO] 
[INFO] --- maven-dependency-plugin:2.9:copy (copy) @ apacheds-server-integ ---
[INFO] Configured Artifact: org.apache.directory.api:api-ldap-extras-codec:?:jar
[INFO] Copying api-ldap-extras-codec-1.0.0-M32-SNAPSHOT.jar to <https://builds.apache.org/job/dir-apacheds-ubuntu-deploy/ws/trunk/server-integ/target/pluginDirectory/api-ldap-extras-codec-1.0.0-M32-20150814.030331-43.jar>
[INFO] 
[INFO] --- maven-resources-plugin:2.7:testResources (default-testResources) @ apacheds-server-integ
---
[INFO] Using 'UTF-8' encoding to copy filtered resources.
[INFO] Copying 8 resources
[INFO] Copying 3 resources
[INFO] 
[INFO] --- maven-compiler-plugin:3.2:testCompile (default-testCompile) @ apacheds-server-integ
---
[INFO] Changes detected - recompiling the module!
[INFO] Compiling 78 source files to <https://builds.apache.org/job/dir-apacheds-ubuntu-deploy/ws/trunk/server-integ/target/test-classes>
[INFO] <https://builds.apache.org/job/dir-apacheds-ubuntu-deploy/ws/trunk/server-integ/src/test/java/org/apache/directory/server/operations/bind/SaslBindIT.java>:
<https://builds.apache.org/job/dir-apacheds-ubuntu-deploy/ws/trunk/server-integ/src/test/java/org/apache/directory/server/operations/bind/SaslBindIT.java>
uses unchecked or unsafe operations.
[INFO] <https://builds.apache.org/job/dir-apacheds-ubuntu-deploy/ws/trunk/server-integ/src/test/java/org/apache/directory/server/operations/bind/SaslBindIT.java>:
Recompile with -Xlint:unchecked for details.
[INFO] 
[INFO] --- maven-surefire-plugin:2.18.1:test (default-test) @ apacheds-server-integ ---
[INFO] Surefire report directory: <https://builds.apache.org/job/dir-apacheds-ubuntu-deploy/ws/trunk/server-integ/target/surefire-reports>

-------------------------------------------------------
 T E S T S
-------------------------------------------------------
Running org.apache.directory.IndexIT
Tests run: 2, Failures: 0, Errors: 0, Skipped: 1, Time elapsed: 1.317 sec - in org.apache.directory.IndexIT
Running org.apache.directory.dsml.engine.Dsmlv2EngineIT
Tests run: 2, Failures: 0, Errors: 0, Skipped: 0, Time elapsed: 11.554 sec - in org.apache.directory.dsml.engine.Dsmlv2EngineIT
Running org.apache.directory.server.ssl.StartTlsUpdateCertificateIT
Tests run: 1, Failures: 0, Errors: 0, Skipped: 0, Time elapsed: 11.857 sec - in org.apache.directory.server.ssl.StartTlsUpdateCertificateIT
Running org.apache.directory.server.ssl.StartTlsConfidentialityIT
Tests run: 1, Failures: 0, Errors: 0, Skipped: 0, Time elapsed: 14.604 sec - in org.apache.directory.server.ssl.StartTlsConfidentialityIT
Running org.apache.directory.server.ssl.LdapsIT
Tests run: 1, Failures: 0, Errors: 0, Skipped: 0, Time elapsed: 14.351 sec - in org.apache.directory.server.ssl.LdapsIT
Running org.apache.directory.server.ssl.StartTlsIT
Tests run: 1, Failures: 0, Errors: 0, Skipped: 0, Time elapsed: 9.368 sec - in org.apache.directory.server.ssl.StartTlsIT
Running org.apache.directory.server.ssl.LdapsUpdateCertificateIT
Tests run: 1, Failures: 0, Errors: 0, Skipped: 0, Time elapsed: 10.05 sec - in org.apache.directory.server.ssl.LdapsUpdateCertificateIT
Running org.apache.directory.server.admin.AdministrativePointModifyIT
Tests run: 1, Failures: 0, Errors: 0, Skipped: 0, Time elapsed: 24.012 sec - in org.apache.directory.server.admin.AdministrativePointModifyIT
Running org.apache.directory.server.admin.AdministrativePointPersistentIT
Tests run: 1, Failures: 0, Errors: 0, Skipped: 0, Time elapsed: 15.892 sec - in org.apache.directory.server.admin.AdministrativePointPersistentIT
Running org.apache.directory.server.admin.AdministrativePointAddIT
Tests run: 2, Failures: 0, Errors: 0, Skipped: 0, Time elapsed: 34.568 sec - in org.apache.directory.server.admin.AdministrativePointAddIT
Running org.apache.directory.server.admin.AdministrativePointModifyDelIT
Tests run: 3, Failures: 0, Errors: 0, Skipped: 1, Time elapsed: 23.91 sec - in org.apache.directory.server.admin.AdministrativePointModifyDelIT
Running org.apache.directory.server.schema.SchemaIT
Tests run: 3, Failures: 0, Errors: 0, Skipped: 0, Time elapsed: 39.124 sec - in org.apache.directory.server.schema.SchemaIT
Running org.apache.directory.server.schema.MavibotSchemaIT
Tests run: 3, Failures: 0, Errors: 0, Skipped: 0, Time elapsed: 37.241 sec - in org.apache.directory.server.schema.MavibotSchemaIT
Running org.apache.directory.server.kerberos.PasswordPolicyServiceIT
Tests run: 1, Failures: 0, Errors: 0, Skipped: 1, Time elapsed: 0 sec - in org.apache.directory.server.kerberos.PasswordPolicyServiceIT
Running org.apache.directory.server.kerberos.KeyDerivationServiceIT
Tests run: 4, Failures: 0, Errors: 0, Skipped: 0, Time elapsed: 31.809 sec - in org.apache.directory.server.kerberos.KeyDerivationServiceIT
Running org.apache.directory.server.replication.StaleEventLogDetectionIT
Tests run: 1, Failures: 0, Errors: 0, Skipped: 0, Time elapsed: 34.856 sec - in org.apache.directory.server.replication.StaleEventLogDetectionIT
Running org.apache.directory.server.replication.ClientServerReplicationIT
Tests run: 5, Failures: 0, Errors: 0, Skipped: 1, Time elapsed: 82.417 sec - in org.apache.directory.server.replication.ClientServerReplicationIT
Running org.apache.directory.server.replication.ClientInitialRefreshIT
Tests run: 4, Failures: 0, Errors: 0, Skipped: 0, Time elapsed: 46.064 sec - in org.apache.directory.server.replication.ClientInitialRefreshIT
Running org.apache.directory.server.ppolicy.PasswordPolicyIT
Tests run: 24, Failures: 0, Errors: 0, Skipped: 2, Time elapsed: 105.134 sec - in org.apache.directory.server.ppolicy.PasswordPolicyIT
Running org.apache.directory.server.operations.modifydn.MoveIT
Tests run: 4, Failures: 0, Errors: 0, Skipped: 0, Time elapsed: 11.927 sec - in org.apache.directory.server.operations.modifydn.MoveIT
Running org.apache.directory.server.operations.modifydn.ModifyDnReferralIT
Tests run: 7, Failures: 0, Errors: 0, Skipped: 0, Time elapsed: 11.451 sec - in org.apache.directory.server.operations.modifydn.ModifyDnReferralIT
Running org.apache.directory.server.operations.modifydn.ModifyRdnIT
Tests run: 19, Failures: 0, Errors: 0, Skipped: 2, Time elapsed: 36.155 sec - in org.apache.directory.server.operations.modifydn.ModifyRdnIT
Running org.apache.directory.server.operations.ldapsdk.IllegalModificationIT
Tests run: 2, Failures: 0, Errors: 0, Skipped: 0, Time elapsed: 9.73 sec - in org.apache.directory.server.operations.ldapsdk.IllegalModificationIT
Running org.apache.directory.server.operations.ldapsdk.ModifyDnReferralIT
Tests run: 7, Failures: 0, Errors: 0, Skipped: 0, Time elapsed: 11.789 sec - in org.apache.directory.server.operations.ldapsdk.ModifyDnReferralIT
Running org.apache.directory.server.operations.ldapsdk.ModifyReferralIT
Tests run: 4, Failures: 0, Errors: 0, Skipped: 0, Time elapsed: 10.963 sec - in org.apache.directory.server.operations.ldapsdk.ModifyReferralIT
Running org.apache.directory.server.operations.ldapsdk.BindIT
Tests run: 5, Failures: 0, Errors: 0, Skipped: 0, Time elapsed: 10.142 sec - in org.apache.directory.server.operations.ldapsdk.BindIT
Running org.apache.directory.server.operations.ldapsdk.CompareIT
Tests run: 7, Failures: 0, Errors: 0, Skipped: 0, Time elapsed: 10.328 sec - in org.apache.directory.server.operations.ldapsdk.CompareIT
Running org.apache.directory.server.operations.ldapsdk.DeleteIT
Tests run: 8, Failures: 0, Errors: 0, Skipped: 0, Time elapsed: 14.035 sec - in org.apache.directory.server.operations.ldapsdk.DeleteIT
Running org.apache.directory.server.operations.ldapsdk.AddIT
Tests run: 30, Failures: 0, Errors: 0, Skipped: 0, Time elapsed: 83.441 sec - in org.apache.directory.server.operations.ldapsdk.AddIT
Running org.apache.directory.server.operations.add.AddAliasIT
Tests run: 3, Failures: 0, Errors: 0, Skipped: 0, Time elapsed: 21.055 sec - in org.apache.directory.server.operations.add.AddAliasIT
Running org.apache.directory.server.operations.add.AddingEntriesWithSpecialCharactersInRDNIT
Tests run: 9, Failures: 0, Errors: 0, Skipped: 0, Time elapsed: 32.258 sec - in org.apache.directory.server.operations.add.AddingEntriesWithSpecialCharactersInRDNIT
Running org.apache.directory.server.operations.add.AddIT
Tests run: 33, Failures: 0, Errors: 0, Skipped: 0, Time elapsed: 84.178 sec - in org.apache.directory.server.operations.add.AddIT
Running org.apache.directory.server.operations.search.SearchIT
Killed

Results :

Tests run: 199, Failures: 0, Errors: 0, Skipped: 8

[JENKINS] Recording test results
[JENKINS] Archiving disabled
[INFO] ------------------------------------------------------------------------
[INFO] Reactor Summary:
[INFO] 
[INFO] ApacheDS .......................................... SUCCESS [5.900s]
[INFO] ApacheDS I18n ..................................... SUCCESS [9.048s]
[INFO] ApacheDS Core Constants ........................... SUCCESS [5.949s]
[INFO] ApacheDS Core API ................................. SUCCESS [31.362s]
[INFO] ApacheDS Core Shared .............................. SUCCESS [10.177s]
[INFO] ApacheDS Interceptors ............................. SUCCESS [1.940s]
[INFO] ApacheDS AdministrativePoint Interceptor .......... SUCCESS [7.612s]
[INFO] ApacheDS Authentication Interceptor ............... SUCCESS [8.873s]
[INFO] ApacheDS Interceptor to increment numeric attributes  SUCCESS [7.258s]
[INFO] ApacheDS Authorization Interceptor ................ SUCCESS [10.218s]
[INFO] ApacheDS ChangeLog Interceptor .................... SUCCESS [8.012s]
[INFO] ApacheDS Collective Attribute Interceptor ......... SUCCESS [8.433s]
[INFO] ApacheDS Event Interceptor ........................ SUCCESS [6.307s]
[INFO] ApacheDS Exception Interceptor .................... SUCCESS [6.366s]
[INFO] ApacheDS Journal Interceptor ...................... SUCCESS [6.127s]
[INFO] ApacheDS Normalization Interceptor ................ SUCCESS [8.495s]
[INFO] ApacheDS Operational Attribute Interceptor ........ SUCCESS [7.306s]
[INFO] ApacheDS Referral Interceptor ..................... SUCCESS [6.977s]
[INFO] ApacheDS Schema Interceptor ....................... SUCCESS [9.571s]
[INFO] ApacheDS Subtree Interceptor ...................... SUCCESS [9.692s]
[INFO] ApacheDS Triggers Interceptor ..................... SUCCESS [9.318s]
[INFO] ApacheDS Core ..................................... SUCCESS [8.885s]
[INFO] ApacheDS Core AVL ................................. SUCCESS [11.716s]
[INFO] ApacheDS Generalized (X) DBM Partition ............ SUCCESS [16.332s]
[INFO] ApacheDS LDIF Partition ........................... SUCCESS [17.473s]
[INFO] ApacheDS JDBM Partition ........................... SUCCESS [1:14.511s]
[INFO] ApacheDS Mavibot Partition ........................ SUCCESS [20.213s]
[INFO] ApacheDS Core Annotations ......................... SUCCESS [1:21.310s]
[INFO] ApacheDS Core JNDI ................................ SUCCESS [7.445s]
[INFO] ApacheDS Protocol Kerberos Codec .................. SUCCESS [17.299s]
[INFO] ApacheDS Interceptors for Kerberos ................ SUCCESS [8.427s]
[INFO] ApacheDS Protocol Dhcp ............................ SUCCESS [7.849s]
[INFO] ApacheDS Protocol Shared .......................... SUCCESS [14.513s]
[INFO] ApacheDS Protocol Dns ............................. SUCCESS [10.838s]
[INFO] ApacheDS Protocol Kerberos ........................ SUCCESS [13.894s]
[INFO] ApacheDS Protocol Ldap ............................ SUCCESS [1:54.637s]
[INFO] ApacheDS Protocol Ntp ............................. SUCCESS [9.531s]
[INFO] Apacheds Server Annotations ....................... SUCCESS [1:20.887s]
[INFO] ApacheDS Server Config ............................ SUCCESS [15.681s]
[INFO] ApacheDS Server JNDI .............................. SUCCESS [10.240s]
[INFO] ApacheDS Test Framework ........................... SUCCESS [2:53.695s]
[INFO] ApacheDS All ...................................... SUCCESS [14.098s]
[INFO] ApacheDS Logger Interceptor ....................... SUCCESS [7.254s]
[INFO] ApacheDS Password Hashing Interceptor ............. SUCCESS [7.790s]
[INFO] ApacheDS Core Integration ......................... SUCCESS [51:26.463s]
[INFO] ApacheDS Protocol Kerberos Test ................... SUCCESS [1:38.512s]
[INFO] ApacheDS Server Integration ....................... FAILURE [16:50.380s]
[INFO] ApacheDS DirectoryService-WebApp bridge ........... SKIPPED
[INFO] ApacheDS Jetty HTTP Server Integration ............ SKIPPED
[INFO] ApacheDS Service Builder .......................... SKIPPED
[INFO] Apache Directory LDAP Client API test ............. SKIPPED
[INFO] kerberos-client ................................... SKIPPED
[INFO] ApacheDS Service .................................. SKIPPED
[INFO] ApacheDS Wrapper .................................. SKIPPED
[INFO] ApacheDS Installers Maven Plugin .................. SKIPPED
[INFO] ApacheDS Installers ............................... SKIPPED
[INFO] ApacheDS OSGi Integration Tests ................... SKIPPED
[INFO] ------------------------------------------------------------------------
[INFO] BUILD FAILURE
[INFO] ------------------------------------------------------------------------
[INFO] Total time: 1:25:51.075s
[INFO] Finished at: Fri Aug 14 05:27:54 UTC 2015
[INFO] Final Memory: 58M/409M
[INFO] ------------------------------------------------------------------------
[JENKINS] Archiving disabled
[JENKINS] Archiving disabled
[JENKINS] Archiving disabled
[JENKINS] Archiving disabled
[JENKINS] Archiving disabled
[JENKINS] Archiving disabled
[JENKINS] Archiving disabled
[JENKINS] Archiving disabled
[JENKINS] Archiving disabled
[JENKINS] Archiving disabled
[JENKINS] Archiving disabled
[JENKINS] Archiving disabled
[JENKINS] Archiving disabled
[JENKINS] Archiving disabled
[JENKINS] Archiving disabled
[JENKINS] Archiving disabled
[JENKINS] Archiving disabled
[JENKINS] Archiving disabled
[JENKINS] Archiving disabled
[JENKINS] Archiving disabled
[JENKINS] Archiving disabled
[JENKINS] Archiving disabled
[JENKINS] Archiving disabled
[JENKINS] Archiving disabled
[JENKINS] Archiving disabled
[JENKINS] Archiving disabled
[JENKINS] Archiving disabled
[JENKINS] Archiving disabled
[JENKINS] Archiving disabled
[JENKINS] Archiving disabled
[JENKINS] Archiving disabled
[JENKINS] Archiving disabled
[JENKINS] Archiving disabled
[JENKINS] Archiving disabled
[JENKINS] Archiving disabled
[JENKINS] Archiving disabled
[JENKINS] Archiving disabled
[JENKINS] Archiving disabled
[JENKINS] Archiving disabled
[JENKINS] Archiving disabled
[JENKINS] Archiving disabled
[JENKINS] Archiving disabled
[JENKINS] Archiving disabled
[JENKINS] Archiving disabled
[JENKINS] Archiving disabled
[JENKINS] Archiving disabled
[JENKINS] Archiving disabled
[JENKINS] Archiving disabled
[JENKINS] Archiving disabled
[JENKINS] Archiving disabled
[JENKINS] Archiving disabled
[JENKINS] Archiving disabled
[JENKINS] Archiving disabled
[JENKINS] Archiving disabled
[JENKINS] Archiving disabled
[JENKINS] Archiving disabled
[JENKINS] Archiving disabled
Waiting for Jenkins to finish collecting data
[ERROR] Failed to execute goal org.apache.maven.plugins:maven-surefire-plugin:2.18.1:test
(default-test) on project apacheds-server-integ: Execution default-test of goal org.apache.maven.plugins:maven-surefire-plugin:2.18.1:test
failed: The forked VM terminated without properly saying goodbye. VM crash or System.exit
called?
[ERROR] Command was /bin/sh -c cd <https://builds.apache.org/job/dir-apacheds-ubuntu-deploy/ws/trunk/server-integ>
&& /home/jenkins/tools/java/jdk1.7.0_25-32/jre/bin/java -Xmx1024m -jar <https://builds.apache.org/job/dir-apacheds-ubuntu-deploy/ws/trunk/server-integ/target/surefire/surefirebooter8967480595467721822.jar>
<https://builds.apache.org/job/dir-apacheds-ubuntu-deploy/ws/trunk/server-integ/target/surefire/surefire5112331460666467750tmp>
<https://builds.apache.org/job/dir-apacheds-ubuntu-deploy/ws/trunk/server-integ/target/surefire/surefire_275232236327242732462tmp>
[ERROR] -> [Help 1]
[ERROR] 
[ERROR] To see the full stack trace of the errors, re-run Maven with the -e switch.
[ERROR] Re-run Maven using the -X switch to enable full debug logging.
[ERROR] 
[ERROR] For more information about the errors and possible solutions, please read the following
articles:
[ERROR] [Help 1] http://cwiki.apache.org/confluence/display/MAVEN/PluginExecutionException
[ERROR] 
[ERROR] After correcting the problems, you can resume the build with the command
[ERROR]   mvn <goals> -rf :apacheds-server-integ
channel stopped

Mime
View raw message