directory-notifications mailing list archives

Site index · List index
Message view « Date » · « Thread »
Top « Date » · « Thread »
From Apache Jenkins Server <jenk...@builds.apache.org>
Subject Build failed in Jenkins: dir-studio #254
Date Fri, 14 Aug 2015 04:05:13 GMT
See <https://builds.apache.org/job/dir-studio/254/>

------------------------------------------
[...truncated 28212 lines...]
[INFO] 
[INFO] --- maven-site-plugin:3.4:attach-descriptor (attach-descriptor) @ org.apache.directory.studio.schemaeditor.help
---
[INFO] 
[INFO] --- tools-maven-plugin:1.4:verify-legal-files (verify-legal-files) @ org.apache.directory.studio.schemaeditor.help
---
[INFO]                                                                         
[INFO] ------------------------------------------------------------------------
[INFO] Building Apache Directory Studio Test Plugins 2.0.0.qualifier
[INFO] ------------------------------------------------------------------------
[INFO] 
[INFO] --- maven-clean-plugin:2.6.1:clean (default-clean) @ org.apache.directory.studio.tests-parent
---
[INFO] 
[INFO] --- maven-remote-resources-plugin:1.5:process (default) @ org.apache.directory.studio.tests-parent
---
[INFO] 
[INFO] --- maven-site-plugin:3.4:attach-descriptor (attach-descriptor) @ org.apache.directory.studio.tests-parent
---
[INFO] 
[INFO] --- tools-maven-plugin:1.4:verify-legal-files (verify-legal-files) @ org.apache.directory.studio.tests-parent
---
[INFO]                                                                         
[INFO] ------------------------------------------------------------------------
[INFO] Building Apache Directory Studio Core Integration Tests 2.0.0.qualifier
[INFO] ------------------------------------------------------------------------
[INFO] 
[INFO] --- maven-clean-plugin:2.6.1:clean (default-clean) @ org.apache.directory.studio.test.integration.core
---
[INFO] 
[INFO] --- maven-remote-resources-plugin:1.5:process (default) @ org.apache.directory.studio.test.integration.core
---
[INFO] 
[INFO] --- maven-bundle-plugin:2.5.3:manifest (generate-manifest) @ org.apache.directory.studio.test.integration.core
---
[INFO] 
[INFO] --- maven-site-plugin:3.4:attach-descriptor (attach-descriptor) @ org.apache.directory.studio.test.integration.core
---
[INFO] 
[INFO] --- tools-maven-plugin:1.4:verify-legal-files (verify-legal-files) @ org.apache.directory.studio.test.integration.core
---
[INFO]                                                                         
[INFO] ------------------------------------------------------------------------
[INFO] Building Apache Directory Studio UI Integration Tests 2.0.0.qualifier
[INFO] ------------------------------------------------------------------------
[INFO] 
[INFO] --- maven-clean-plugin:2.6.1:clean (default-clean) @ org.apache.directory.studio.test.integration.ui
---
[INFO] 
[INFO] --- maven-remote-resources-plugin:1.5:process (default) @ org.apache.directory.studio.test.integration.ui
---
[INFO] 
[INFO] --- maven-bundle-plugin:2.5.3:manifest (generate-manifest) @ org.apache.directory.studio.test.integration.ui
---
[INFO] 
[INFO] --- maven-site-plugin:3.4:attach-descriptor (attach-descriptor) @ org.apache.directory.studio.test.integration.ui
---
[INFO] 
[INFO] --- tools-maven-plugin:1.4:verify-legal-files (verify-legal-files) @ org.apache.directory.studio.test.integration.ui
---
[INFO] ------------------------------------------------------------------------
[INFO] Reactor Summary:
[INFO] 
[INFO] Apache Directory Studio Setup Parent .............. SUCCESS [8.101s]
[INFO] Apache Directory Studio Target Platform for Eclipse  SUCCESS [21.004s]
[INFO] Apache Directory Studio Plugins Parent ............ SUCCESS [0.024s]
[INFO] Apache Directory Studio Common Core ............... SUCCESS [0.789s]
[INFO] Apache Directory Studio LDIF Parser ............... SUCCESS [0.223s]
[INFO] Apache Directory Studio Common UI ................. SUCCESS [0.143s]
[INFO] Apache Directory Studio Connection Core ........... SUCCESS [0.148s]
[INFO] Apache Directory Studio Connection UI ............. SUCCESS [0.140s]
[INFO] Apache Directory Studio LDAP Browser Core ......... SUCCESS [0.675s]
[INFO] Apache Directory Studio LDAP Browser Common ....... SUCCESS [0.137s]
[INFO] Apache Directory Studio LDIF Editor ............... SUCCESS [0.156s]
[INFO] Apache Directory Studio LDAP Browser UI ........... SUCCESS [0.145s]
[INFO] Apache Directory Studio LDAP Servers .............. SUCCESS [0.109s]
[INFO] Apache Directory Studio ApacheDS Configuration .... SUCCESS [0.106s]
[INFO] Apache Directory Studio Schema Editor ............. SUCCESS [0.144s]
[INFO] Apache Directory Studio Value Editors ............. SUCCESS [0.111s]
[INFO] Apache Directory Studio ACI Item Editor ........... SUCCESS [0.099s]
[INFO] Apache Directory Studio ApacheDS LDAP Server Adapter  SUCCESS [0.090s]
[INFO] Apache Directory Studio OpenLDAP Common UI ........ SUCCESS [0.102s]
[INFO] Apache Directory Studio OpenLDAP Configuration Editor  SUCCESS [0.117s]
[INFO] Apache Directory Studio SyncRepl .................. SUCCESS [0.086s]
[INFO] Apache Directory Studio OpenLDAP ACL Configuration Editor  SUCCESS [2.154s]
[INFO] Apache Directory Studio RCP ....................... SUCCESS [0.087s]
[INFO] Apache Directory Studio Combined Editor ........... SUCCESS [0.090s]
[INFO] Apache Directory Studio Template Editor ........... SUCCESS [0.107s]
[INFO] Apache Directory Studio SLF4J to Eclipse Log Binding  SUCCESS [0.078s]
[INFO] Apache Directory Studio Help Plugins Parent ....... SUCCESS [0.017s]
[INFO] Apache Directory Studio Apache DS Help ............ SUCCESS [0.078s]
[INFO] Apache Directory Studio LDAP Browser Help ......... SUCCESS [0.098s]
[INFO] Apache Directory Studio LDIF Editor Help .......... SUCCESS [0.085s]
[INFO] Apache Directory Studio RCP Help .................. SUCCESS [0.108s]
[INFO] Apache Directory Studio Schema Editor Help ........ SUCCESS [0.077s]
[INFO] Apache Directory Studio Test Plugins .............. SUCCESS [0.016s]
[INFO] Apache Directory Studio Core Integration Tests .... SUCCESS [0.082s]
[INFO] Apache Directory Studio UI Integration Tests ...... SUCCESS [0.105s]
[INFO] ------------------------------------------------------------------------
[INFO] BUILD SUCCESS
[INFO] ------------------------------------------------------------------------
[INFO] Total time: 45.275s
[INFO] Finished at: Fri Aug 14 04:03:11 UTC 2015
[INFO] Final Memory: 35M/383M
[INFO] ------------------------------------------------------------------------
Parsing POMs
Modules changed, recalculating dependency graph
Copied maven3-agent.jar
Copied maven3-interceptor.jar
Copied maven3-interceptor-commons.jar
[trunk] $ /home/jenkins/tools/java/latest1.7/bin/java -Xmx1024m -XX:MaxPermSize=512m -cp /jenkins/maven3-agent.jar:/home/jenkins/tools/maven/apache-maven-3.0.4/boot/plexus-classworlds-2.4.jar
org.jvnet.hudson.maven3.agent.Maven3Main /home/jenkins/tools/maven/apache-maven-3.0.4 /jenkins/slave.jar
/jenkins/maven3-interceptor.jar /jenkins/maven3-interceptor-commons.jar 39148
<===[JENKINS REMOTING CAPACITY]===>   channel started
Executing Maven:  -B -f <https://builds.apache.org/job/dir-studio/ws/trunk/pom.xml>
-Dmaven.repo.local=<https://builds.apache.org/job/dir-studio/ws/.repository> -U -V clean
install
Apache Maven 3.0.4 (r1232337; 2012-01-17 08:44:56+0000)
Maven home: /home/jenkins/tools/maven/apache-maven-3.0.4
Java version: 1.7.0_25, vendor: Oracle Corporation
Java home: /home/jenkins/tools/java/jdk1.7.0_25-32/jre
Default locale: en_US, platform encoding: UTF-8
OS name: "linux", version: "3.13.0-30-generic", arch: "i386", family: "unix"
[INFO] Scanning for projects...
Downloading: http://repo.maven.apache.org/maven2/org/eclipse/tycho/tycho-compiler-plugin/0.22.0/tycho-compiler-plugin-0.22.0.pom
Downloaded: http://repo.maven.apache.org/maven2/org/eclipse/tycho/tycho-compiler-plugin/0.22.0/tycho-compiler-plugin-0.22.0.pom
(3 KB at 19.8 KB/sec)
Downloading: http://repo.maven.apache.org/maven2/org/eclipse/tycho/tycho-compiler-plugin/0.22.0/tycho-compiler-plugin-0.22.0.jar
Downloaded: http://repo.maven.apache.org/maven2/org/eclipse/tycho/tycho-compiler-plugin/0.22.0/tycho-compiler-plugin-0.22.0.jar
(32 KB at 1840.1 KB/sec)
Downloading: http://repo.maven.apache.org/maven2/org/apache/maven/plugins/maven-surefire-plugin/2.18.1/maven-surefire-plugin-2.18.1.pom
Downloaded: http://repo.maven.apache.org/maven2/org/apache/maven/plugins/maven-surefire-plugin/2.18.1/maven-surefire-plugin-2.18.1.pom
(6 KB at 552.7 KB/sec)
Downloading: http://repo.maven.apache.org/maven2/org/apache/maven/surefire/surefire/2.18.1/surefire-2.18.1.pom
Downloaded: http://repo.maven.apache.org/maven2/org/apache/maven/surefire/surefire/2.18.1/surefire-2.18.1.pom
(17 KB at 963.9 KB/sec)
Downloading: http://repo.maven.apache.org/maven2/org/apache/maven/plugins/maven-surefire-plugin/2.18.1/maven-surefire-plugin-2.18.1.jar
Downloaded: http://repo.maven.apache.org/maven2/org/apache/maven/plugins/maven-surefire-plugin/2.18.1/maven-surefire-plugin-2.18.1.jar
(37 KB at 2259.2 KB/sec)
Downloading: http://repo.maven.apache.org/maven2/org/apache/maven/plugins/maven-compiler-plugin/3.2/maven-compiler-plugin-3.2.pom
Downloaded: http://repo.maven.apache.org/maven2/org/apache/maven/plugins/maven-compiler-plugin/3.2/maven-compiler-plugin-3.2.pom
(12 KB at 950.4 KB/sec)
Downloading: http://repo.maven.apache.org/maven2/org/apache/maven/plugins/maven-compiler-plugin/3.2/maven-compiler-plugin-3.2.jar
Downloaded: http://repo.maven.apache.org/maven2/org/apache/maven/plugins/maven-compiler-plugin/3.2/maven-compiler-plugin-3.2.jar
(45 KB at 2955.7 KB/sec)
Downloading: http://repo.maven.apache.org/maven2/org/eclipse/tycho/target-platform-configuration/0.22.0/target-platform-configuration-0.22.0.pom
Downloaded: http://repo.maven.apache.org/maven2/org/eclipse/tycho/target-platform-configuration/0.22.0/target-platform-configuration-0.22.0.pom
(2 KB at 187.1 KB/sec)
Downloading: http://repo.maven.apache.org/maven2/org/eclipse/tycho/target-platform-configuration/0.22.0/target-platform-configuration-0.22.0.jar
Downloaded: http://repo.maven.apache.org/maven2/org/eclipse/tycho/target-platform-configuration/0.22.0/target-platform-configuration-0.22.0.jar
(8 KB at 782.8 KB/sec)
Downloading: http://repo.maven.apache.org/maven2/org/apache/maven/plugins/maven-deploy-plugin/2.8.2/maven-deploy-plugin-2.8.2.pom
Downloaded: http://repo.maven.apache.org/maven2/org/apache/maven/plugins/maven-deploy-plugin/2.8.2/maven-deploy-plugin-2.8.2.pom
(7 KB at 633.8 KB/sec)
Downloading: http://repo.maven.apache.org/maven2/org/apache/maven/plugins/maven-deploy-plugin/2.8.2/maven-deploy-plugin-2.8.2.jar
Downloaded: http://repo.maven.apache.org/maven2/org/apache/maven/plugins/maven-deploy-plugin/2.8.2/maven-deploy-plugin-2.8.2.jar
(34 KB at 2563.9 KB/sec)
Downloading: http://repo.maven.apache.org/maven2/org/apache/maven/plugins/maven-javadoc-plugin/2.10.1/maven-javadoc-plugin-2.10.1.pom
Downloaded: http://repo.maven.apache.org/maven2/org/apache/maven/plugins/maven-javadoc-plugin/2.10.1/maven-javadoc-plugin-2.10.1.pom
(17 KB at 1295.7 KB/sec)
Downloading: http://repo.maven.apache.org/maven2/org/apache/maven/plugins/maven-javadoc-plugin/2.10.1/maven-javadoc-plugin-2.10.1.jar
Downloaded: http://repo.maven.apache.org/maven2/org/apache/maven/plugins/maven-javadoc-plugin/2.10.1/maven-javadoc-plugin-2.10.1.jar
(401 KB at 6562.1 KB/sec)
Downloading: http://repo.maven.apache.org/maven2/org/eclipse/tycho/tycho-surefire-plugin/0.22.0/tycho-surefire-plugin-0.22.0.pom
Downloaded: http://repo.maven.apache.org/maven2/org/eclipse/tycho/tycho-surefire-plugin/0.22.0/tycho-surefire-plugin-0.22.0.pom
(4 KB at 339.1 KB/sec)
Downloading: http://repo.maven.apache.org/maven2/org/eclipse/tycho/tycho-surefire/0.22.0/tycho-surefire-0.22.0.pom
Downloaded: http://repo.maven.apache.org/maven2/org/eclipse/tycho/tycho-surefire/0.22.0/tycho-surefire-0.22.0.pom
(4 KB at 287.1 KB/sec)
Downloading: http://repo.maven.apache.org/maven2/org/eclipse/tycho/tycho-surefire-plugin/0.22.0/tycho-surefire-plugin-0.22.0.jar
Downloaded: http://repo.maven.apache.org/maven2/org/eclipse/tycho/tycho-surefire-plugin/0.22.0/tycho-surefire-plugin-0.22.0.jar
(51 KB at 2988.6 KB/sec)
Downloading: http://repo.maven.apache.org/maven2/org/eclipse/tycho/org.eclipse.tycho.surefire.osgibooter/0.22.0/org.eclipse.tycho.surefire.osgibooter-0.22.0.pom
Downloaded: http://repo.maven.apache.org/maven2/org/eclipse/tycho/org.eclipse.tycho.surefire.osgibooter/0.22.0/org.eclipse.tycho.surefire.osgibooter-0.22.0.pom
(3 KB at 258.3 KB/sec)
Downloading: http://repo.maven.apache.org/maven2/org/eclipse/tycho/org.eclipse.tycho.surefire.junit/0.22.0/org.eclipse.tycho.surefire.junit-0.22.0.pom
Downloaded: http://repo.maven.apache.org/maven2/org/eclipse/tycho/org.eclipse.tycho.surefire.junit/0.22.0/org.eclipse.tycho.surefire.junit-0.22.0.pom
(2 KB at 174.9 KB/sec)
Downloading: http://repo.maven.apache.org/maven2/org/eclipse/tycho/org.eclipse.tycho.surefire.junit4/0.22.0/org.eclipse.tycho.surefire.junit4-0.22.0.pom
Downloaded: http://repo.maven.apache.org/maven2/org/eclipse/tycho/org.eclipse.tycho.surefire.junit4/0.22.0/org.eclipse.tycho.surefire.junit4-0.22.0.pom
(2 KB at 174.9 KB/sec)
Downloading: http://repo.maven.apache.org/maven2/org/eclipse/tycho/org.eclipse.tycho.surefire.junit47/0.22.0/org.eclipse.tycho.surefire.junit47-0.22.0.pom
Downloaded: http://repo.maven.apache.org/maven2/org/eclipse/tycho/org.eclipse.tycho.surefire.junit47/0.22.0/org.eclipse.tycho.surefire.junit47-0.22.0.pom
(2 KB at 194.7 KB/sec)
Downloading: http://repo.maven.apache.org/maven2/org/apache/maven/surefire/surefire-api/2.17/surefire-api-2.17.pom
Downloaded: http://repo.maven.apache.org/maven2/org/apache/maven/surefire/surefire-api/2.17/surefire-api-2.17.pom
(3 KB at 279.7 KB/sec)
Downloading: http://repo.maven.apache.org/maven2/org/apache/maven/surefire/surefire/2.17/surefire-2.17.pom
Downloaded: http://repo.maven.apache.org/maven2/org/apache/maven/surefire/surefire/2.17/surefire-2.17.pom
(17 KB at 1877.9 KB/sec)
Downloading: http://repo.maven.apache.org/maven2/org/apache/maven/surefire/maven-surefire-common/2.17/maven-surefire-common-2.17.pom
Downloaded: http://repo.maven.apache.org/maven2/org/apache/maven/surefire/maven-surefire-common/2.17/maven-surefire-common-2.17.pom
(6 KB at 595.4 KB/sec)
Downloading: http://repo.maven.apache.org/maven2/org/apache/maven/plugin-tools/maven-plugin-annotations/3.3/maven-plugin-annotations-3.3.pom
Downloaded: http://repo.maven.apache.org/maven2/org/apache/maven/plugin-tools/maven-plugin-annotations/3.3/maven-plugin-annotations-3.3.pom
(2 KB at 53.0 KB/sec)
Downloading: http://repo.maven.apache.org/maven2/org/apache/maven/plugin-tools/maven-plugin-tools/3.3/maven-plugin-tools-3.3.pom
Downloaded: http://repo.maven.apache.org/maven2/org/apache/maven/plugin-tools/maven-plugin-tools/3.3/maven-plugin-tools-3.3.pom
(13 KB at 1372.4 KB/sec)
Downloading: http://repo.maven.apache.org/maven2/org/apache/maven/surefire/surefire-booter/2.17/surefire-booter-2.17.pom
Downloaded: http://repo.maven.apache.org/maven2/org/apache/maven/surefire/surefire-booter/2.17/surefire-booter-2.17.pom
(3 KB at 307.2 KB/sec)
Downloading: http://repo.maven.apache.org/maven2/org/apache/maven/maven-artifact/2.0.9/maven-artifact-2.0.9.pom
Downloaded: http://repo.maven.apache.org/maven2/org/apache/maven/maven-artifact/2.0.9/maven-artifact-2.0.9.pom
(2 KB at 197.6 KB/sec)
Downloading: http://repo.maven.apache.org/maven2/org/apache/maven/maven/2.0.9/maven-2.0.9.pom
Downloaded: http://repo.maven.apache.org/maven2/org/apache/maven/maven/2.0.9/maven-2.0.9.pom
(19 KB at 2051.5 KB/sec)
Downloading: http://repo.maven.apache.org/maven2/org/apache/maven/maven-parent/8/maven-parent-8.pom
Downloaded: http://repo.maven.apache.org/maven2/org/apache/maven/maven-parent/8/maven-parent-8.pom
(24 KB at 2618.6 KB/sec)
Downloading: http://repo.maven.apache.org/maven2/org/apache/maven/maven-plugin-descriptor/2.0.9/maven-plugin-descriptor-2.0.9.pom
Downloaded: http://repo.maven.apache.org/maven2/org/apache/maven/maven-plugin-descriptor/2.0.9/maven-plugin-descriptor-2.0.9.pom
(3 KB at 253.3 KB/sec)
Downloading: http://repo.maven.apache.org/maven2/org/apache/maven/maven-project/2.0.9/maven-project-2.0.9.pom
Downloaded: http://repo.maven.apache.org/maven2/org/apache/maven/maven-project/2.0.9/maven-project-2.0.9.pom
(3 KB at 330.8 KB/sec)
Downloading: http://repo.maven.apache.org/maven2/org/apache/maven/maven-profile/2.0.9/maven-profile-2.0.9.pom
Downloaded: http://repo.maven.apache.org/maven2/org/apache/maven/maven-profile/2.0.9/maven-profile-2.0.9.pom
(3 KB at 222.4 KB/sec)
Downloading: http://repo.maven.apache.org/maven2/org/apache/maven/maven-artifact-manager/2.0.9/maven-artifact-manager-2.0.9.pom
Downloaded: http://repo.maven.apache.org/maven2/org/apache/maven/maven-artifact-manager/2.0.9/maven-artifact-manager-2.0.9.pom
(3 KB at 293.0 KB/sec)
Downloading: http://repo.maven.apache.org/maven2/org/apache/maven/maven-repository-metadata/2.0.9/maven-repository-metadata-2.0.9.pom
Downloaded: http://repo.maven.apache.org/maven2/org/apache/maven/maven-repository-metadata/2.0.9/maven-repository-metadata-2.0.9.pom
(2 KB at 232.1 KB/sec)
Downloading: http://repo.maven.apache.org/maven2/org/apache/maven/maven-plugin-registry/2.0.9/maven-plugin-registry-2.0.9.pom
Downloaded: http://repo.maven.apache.org/maven2/org/apache/maven/maven-plugin-registry/2.0.9/maven-plugin-registry-2.0.9.pom
(2 KB at 240.6 KB/sec)
Downloading: http://repo.maven.apache.org/maven2/org/apache/maven/maven-toolchain/2.0.9/maven-toolchain-2.0.9.pom
Downloaded: http://repo.maven.apache.org/maven2/org/apache/maven/maven-toolchain/2.0.9/maven-toolchain-2.0.9.pom
(4 KB at 377.2 KB/sec)
Downloading: http://repo.maven.apache.org/maven2/org/apache/commons/commons-lang3/3.1/commons-lang3-3.1.pom
Downloaded: http://repo.maven.apache.org/maven2/org/apache/commons/commons-lang3/3.1/commons-lang3-3.1.pom
(17 KB at 1813.3 KB/sec)
Downloading: http://repo.maven.apache.org/maven2/org/eclipse/tycho/org.eclipse.tycho.surefire.osgibooter/0.22.0/org.eclipse.tycho.surefire.osgibooter-0.22.0.jar
Downloading: http://repo.maven.apache.org/maven2/org/eclipse/tycho/org.eclipse.tycho.surefire.junit/0.22.0/org.eclipse.tycho.surefire.junit-0.22.0.jar
Downloading: http://repo.maven.apache.org/maven2/org/eclipse/tycho/org.eclipse.tycho.surefire.junit47/0.22.0/org.eclipse.tycho.surefire.junit47-0.22.0.jar
Downloading: http://repo.maven.apache.org/maven2/org/eclipse/tycho/org.eclipse.tycho.surefire.junit4/0.22.0/org.eclipse.tycho.surefire.junit4-0.22.0.jar
Downloading: http://repo.maven.apache.org/maven2/org/apache/maven/surefire/surefire-api/2.17/surefire-api-2.17.jar
Downloaded: http://repo.maven.apache.org/maven2/org/eclipse/tycho/org.eclipse.tycho.surefire.junit4/0.22.0/org.eclipse.tycho.surefire.junit4-0.22.0.jar
(57 KB at 2085.3 KB/sec)
Downloading: http://repo.maven.apache.org/maven2/org/apache/maven/surefire/maven-surefire-common/2.17/maven-surefire-common-2.17.jar
Downloaded: http://repo.maven.apache.org/maven2/org/apache/maven/surefire/surefire-api/2.17/surefire-api-2.17.jar
(144 KB at 5328.1 KB/sec)
Downloading: http://repo.maven.apache.org/maven2/org/apache/maven/surefire/surefire-booter/2.17/surefire-booter-2.17.jar
Downloaded: http://repo.maven.apache.org/maven2/org/eclipse/tycho/org.eclipse.tycho.surefire.junit/0.22.0/org.eclipse.tycho.surefire.junit-0.22.0.jar
(24 KB at 790.1 KB/sec)
Downloading: http://repo.maven.apache.org/maven2/org/apache/commons/commons-lang3/3.1/commons-lang3-3.1.jar
Downloaded: http://repo.maven.apache.org/maven2/org/eclipse/tycho/org.eclipse.tycho.surefire.junit47/0.22.0/org.eclipse.tycho.surefire.junit47-0.22.0.jar
(157 KB at 4004.6 KB/sec)
Downloaded: http://repo.maven.apache.org/maven2/org/eclipse/tycho/org.eclipse.tycho.surefire.osgibooter/0.22.0/org.eclipse.tycho.surefire.osgibooter-0.22.0.jar
(408 KB at 9696.9 KB/sec)
Downloaded: http://repo.maven.apache.org/maven2/org/apache/maven/surefire/surefire-booter/2.17/surefire-booter-2.17.jar
(39 KB at 2973.2 KB/sec)
Downloaded: http://repo.maven.apache.org/maven2/org/apache/maven/surefire/maven-surefire-common/2.17/maven-surefire-common-2.17.jar
(260 KB at 13640.5 KB/sec)
Downloaded: http://repo.maven.apache.org/maven2/org/apache/commons/commons-lang3/3.1/commons-lang3-3.1.jar
(309 KB at 18141.4 KB/sec)
Downloading: http://repo.maven.apache.org/maven2/org/eclipse/tycho/tycho-p2-repository-plugin/0.22.0/tycho-p2-repository-plugin-0.22.0.pom
Downloaded: http://repo.maven.apache.org/maven2/org/eclipse/tycho/tycho-p2-repository-plugin/0.22.0/tycho-p2-repository-plugin-0.22.0.pom
(2 KB at 140.4 KB/sec)
Downloading: http://repo.maven.apache.org/maven2/org/eclipse/tycho/tycho-p2-repository-plugin/0.22.0/tycho-p2-repository-plugin-0.22.0.jar
Downloaded: http://repo.maven.apache.org/maven2/org/eclipse/tycho/tycho-p2-repository-plugin/0.22.0/tycho-p2-repository-plugin-0.22.0.jar
(14 KB at 1192.2 KB/sec)
Downloading: http://repo.maven.apache.org/maven2/org/apache/maven/plugins/maven-source-plugin/2.4/maven-source-plugin-2.4.pom
Downloaded: http://repo.maven.apache.org/maven2/org/apache/maven/plugins/maven-source-plugin/2.4/maven-source-plugin-2.4.pom
(7 KB at 648.8 KB/sec)
Downloading: http://repo.maven.apache.org/maven2/org/apache/maven/plugins/maven-source-plugin/2.4/maven-source-plugin-2.4.jar
Downloaded: http://repo.maven.apache.org/maven2/org/apache/maven/plugins/maven-source-plugin/2.4/maven-source-plugin-2.4.jar
(31 KB at 3068.8 KB/sec)
Downloading: http://repo.maven.apache.org/maven2/org/eclipse/tycho/tycho-p2-publisher-plugin/0.22.0/tycho-p2-publisher-plugin-0.22.0.pom
Downloaded: http://repo.maven.apache.org/maven2/org/eclipse/tycho/tycho-p2-publisher-plugin/0.22.0/tycho-p2-publisher-plugin-0.22.0.pom
(2 KB at 198.2 KB/sec)
Downloading: http://repo.maven.apache.org/maven2/org/eclipse/tycho/tycho-p2-publisher-plugin/0.22.0/tycho-p2-publisher-plugin-0.22.0.jar
Downloaded: http://repo.maven.apache.org/maven2/org/eclipse/tycho/tycho-p2-publisher-plugin/0.22.0/tycho-p2-publisher-plugin-0.22.0.jar
(22 KB at 1992.1 KB/sec)
Downloading: http://repo.maven.apache.org/maven2/org/eclipse/tycho/tycho-p2-director-plugin/0.22.0/tycho-p2-director-plugin-0.22.0.pom
Downloaded: http://repo.maven.apache.org/maven2/org/eclipse/tycho/tycho-p2-director-plugin/0.22.0/tycho-p2-director-plugin-0.22.0.pom
(4 KB at 310.4 KB/sec)
Downloading: http://repo.maven.apache.org/maven2/org/eclipse/tycho/tycho-p2-director-plugin/0.22.0/tycho-p2-director-plugin-0.22.0.jar
Downloaded: http://repo.maven.apache.org/maven2/org/eclipse/tycho/tycho-p2-director-plugin/0.22.0/tycho-p2-director-plugin-0.22.0.jar
(44 KB at 3374.5 KB/sec)
Downloading: http://repo.maven.apache.org/maven2/org/eclipse/tycho/tycho-standalone-p2-director/0.22.0/tycho-standalone-p2-director-0.22.0.pom
Downloaded: http://repo.maven.apache.org/maven2/org/eclipse/tycho/tycho-standalone-p2-director/0.22.0/tycho-standalone-p2-director-0.22.0.pom
(2 KB at 173.4 KB/sec)
Downloading: http://repo.maven.apache.org/maven2/org/apache/commons/commons-compress/1.7/commons-compress-1.7.pom
Downloaded: http://repo.maven.apache.org/maven2/org/apache/commons/commons-compress/1.7/commons-compress-1.7.pom
(12 KB at 1385.4 KB/sec)
Downloading: http://repo.maven.apache.org/maven2/org/tukaani/xz/1.4/xz-1.4.pom
Downloaded: http://repo.maven.apache.org/maven2/org/tukaani/xz/1.4/xz-1.4.pom (2 KB at 185.9
KB/sec)
Downloading: http://repo.maven.apache.org/maven2/org/eclipse/tycho/tycho-standalone-p2-director/0.22.0/tycho-standalone-p2-director-0.22.0.zip
Downloading: http://repo.maven.apache.org/maven2/org/apache/commons/commons-compress/1.7/commons-compress-1.7.jar
Downloading: http://repo.maven.apache.org/maven2/org/tukaani/xz/1.4/xz-1.4.jar
Downloading: http://repo.maven.apache.org/maven2/org/apache/commons/commons-compress/1.7/commons-compress-1.7-sources.jar
Downloaded: http://repo.maven.apache.org/maven2/org/tukaani/xz/1.4/xz-1.4.jar (97 KB at 4614.7
KB/sec)
Downloaded: http://repo.maven.apache.org/maven2/org/apache/commons/commons-compress/1.7/commons-compress-1.7.jar
(348 KB at 13898.2 KB/sec)
Downloaded: http://repo.maven.apache.org/maven2/org/apache/commons/commons-compress/1.7/commons-compress-1.7-sources.jar
(359 KB at 11201.0 KB/sec)
Downloaded: http://repo.maven.apache.org/maven2/org/eclipse/tycho/tycho-standalone-p2-director/0.22.0/tycho-standalone-p2-director-0.22.0.zip
(6755 KB at 24924.9 KB/sec)
[INFO] Computing target platform for MavenProject: org.apache.directory.studio:org.apache.directory.studio.aciitemeditor:2.0.0-SNAPSHOT
@ <https://builds.apache.org/job/dir-studio/ws/trunk/plugins/aciitemeditor/pom.xml>
[INFO] Adding repository file://<https://builds.apache.org/job/dir-studio/ws/trunk/eclipse-trgt-platform/target/repository>
[INFO] Fetching p2.index from http://download.eclipse.org/eclipse/updates/4.4/ (0B at 0B/s)
[INFO] Adding repository http://download.eclipse.org/eclipse/updates/4.4
[INFO] Fetching compositeContent.jar from http://download.eclipse.org/eclipse/updates/4.4/
(0B of 482B at 0B/s)
[INFO] Fetching content.jar from http://download.eclipse.org/eclipse/updates/4.4/categoriesLuna/
(0B of 1.43kB at 0B/s)
[INFO] Fetching content.jar from http://download.eclipse.org/eclipse/updates/4.4/R-4.4-201406061215/
(0B of 401.39kB at 0B/s)
[INFO] Fetching content.jar from http://download.eclipse.org/eclipse/updates/4.4/R-4.4.1-201409250400/
(0B of 411.13kB at 0B/s)
[INFO] Fetching content.jar from http://download.eclipse.org/eclipse/updates/4.4/bug445122/
(0B of 9.14kB at 0B/s)
[INFO] Fetching content.jar from http://download.eclipse.org/eclipse/updates/4.4/R-4.4.2-201502041700/
(0B of 425.05kB at 0B/s)
[INFO] Fetching p2.index from http://download.eclipse.org/tools/orbit/downloads/drops/R20140525021250/repository/
(0B at 0B/s)
[INFO] Adding repository http://download.eclipse.org/tools/orbit/downloads/drops/R20140525021250/repository
[INFO] Fetching content.jar from http://download.eclipse.org/tools/orbit/downloads/drops/R20140525021250/repository/
(0B of 186.92kB at 0B/s)
[INFO] Adding repository http://download.eclipse.org/technology/swtbot/releases/2.3.0
[INFO] Fetching content.jar from http://download.eclipse.org/technology/swtbot/releases/2.3.0/
(0B of 15.88kB at 0B/s)
[INFO] Adding repository http://download.eclipse.org/technology/babel/update-site/R0.12.1/luna
[ERROR] Failed to resolve target definition <https://builds.apache.org/job/dir-studio/ws/trunk/eclipse-trgt-platform/org.apache.directory.studio.eclipse-trgt-platform.target>:
Failed to load p2 metadata repository from location http://download.eclipse.org/technology/babel/update-site/R0.12.1/luna:
No repository found at http://download.eclipse.org/technology/babel/update-site/R0.12.1/luna.
-> [Help 1]
[ERROR] 
[ERROR] To see the full stack trace of the errors, re-run Maven with the -e switch.
[ERROR] Re-run Maven using the -X switch to enable full debug logging.
[ERROR] 
[ERROR] For more information about the errors and possible solutions, please read the following
articles:
[ERROR] [Help 1] http://cwiki.apache.org/confluence/display/MAVEN/MavenExecutionException
channel stopped
Archiving artifacts

Mime
View raw message