directory-notifications mailing list archives

Site index · List index
Message view « Date » · « Thread »
Top « Date » · « Thread »
From Apache Jenkins Server <jenk...@builds.apache.org>
Subject Build failed in Jenkins: dir-kerby #42
Date Sun, 09 Aug 2015 04:02:42 GMT
See <https://builds.apache.org/job/dir-kerby/42/changes>

Changes:

[drankye] Refined kdc init tool

[drankye] Debug option and usage fixup for the tools

------------------------------------------
[...truncated 1312 lines...]
Will send wrap token of size 73
Received data "Hello There! " of length 13
Confidentiality applied: true
Will send MIC token of size 28
Waiting for incoming connection...
Verified received MIC for message.
Tests run: 1, Failures: 0, Errors: 0, Skipped: 0, Time elapsed: 0.8 sec - in org.apache.kerby.kerberos.kerb.integration.test.GssAppTest
Running org.apache.kerby.kerberos.kerb.integration.test.SaslAppTest
SLF4J: Failed to load class "org.slf4j.impl.StaticLoggerBinder".
SLF4J: Defaulting to no-operation (NOP) logger implementation
SLF4J: See http://www.slf4j.org/codes.html#StaticLoggerBinder for further details.
java.net.SocketTimeoutException: Accept timed out
Debug is  true storeKey true useTicketCache false useKeyTab true doNotPrompt true ticketCache
is null isInitiator true KeyTab is <https://builds.apache.org/job/dir-kerby/ws/kerby-kerb/integration-test/target/tmp/test-service.keytab>
refreshKrb5Config is true principal is test-service/localhost@TEST.COM tryFirstPass is false
useFirstPass is false storePass is false clearPass is false
Refreshing Kerberos configuration
java.net.SocketTimeoutException: Accept timed out
java.net.SocketTimeoutException: Accept timed out
java.net.SocketTimeoutException: Accept timed out
principal is test-service/localhost@TEST.COM
Will use keytab
Commit Succeeded 

Waiting for incoming connection...
Debug is  true storeKey false useTicketCache true useKeyTab false doNotPrompt false ticketCache
is <https://builds.apache.org/job/dir-kerby/ws/kerby-kerb/integration-test/target/tmp/test-tkt.cc>
isInitiator true KeyTab is null refreshKrb5Config is true principal is drankye@TEST.COM tryFirstPass
is false useFirstPass is false storePass is false clearPass is false
Refreshing Kerberos configuration
Acquire TGT from Cache
Principal is drankye@TEST.COM
Commit Succeeded 

Got connection from client
Starting negotiating security contextConnected to server
java.net.SocketTimeoutException: Accept timed out
SASL server GSSAPI callback: setting canonicalized client ID: drankye@TEST.COM
Context Established! java.net.SocketTimeoutException: Accept timed out
Context Established! 
Will send wrap token of size 13
Received data "Hello There! " of length 13
Waiting for incoming connection...
Tests run: 1, Failures: 0, Errors: 0, Skipped: 0, Time elapsed: 0.93 sec - in org.apache.kerby.kerberos.kerb.integration.test.SaslAppTest

Results :

Tests run: 2, Failures: 0, Errors: 0, Skipped: 0

[JENKINS] Recording test results
[INFO] 
[INFO] --- maven-jar-plugin:2.5:jar (default-jar) @ integration-test ---
[INFO] Building jar: <https://builds.apache.org/job/dir-kerby/ws/kerby-kerb/integration-test/target/integration-test-1.0-SNAPSHOT.jar>
[INFO] 
[INFO] --- maven-install-plugin:2.5.2:install (default-install) @ integration-test ---
[INFO] Installing <https://builds.apache.org/job/dir-kerby/ws/kerby-kerb/integration-test/target/integration-test-1.0-SNAPSHOT.jar>
to /home/jenkins/jenkins-slave/maven-repositories/0/org/apache/kerby/integration-test/1.0-SNAPSHOT/integration-test-1.0-SNAPSHOT.jar
[INFO] Installing <https://builds.apache.org/job/dir-kerby/ws/kerby-kerb/integration-test/pom.xml>
to /home/jenkins/jenkins-slave/maven-repositories/0/org/apache/kerby/integration-test/1.0-SNAPSHOT/integration-test-1.0-SNAPSHOT.pom
[JENKINS] Archiving disabled
[INFO]                                                                         
[INFO] ------------------------------------------------------------------------
[INFO] Building Kerby-kerb client api all 1.0-SNAPSHOT
[INFO] ------------------------------------------------------------------------
[INFO] 
[INFO] --- maven-clean-plugin:2.6.1:clean (default-clean) @ kerb-client-api-all ---
[INFO] Deleting <https://builds.apache.org/job/dir-kerby/ws/kerby-kerb/kerb-client-api-all/target>
[INFO] 
[INFO] --- maven-pmd-plugin:3.4:pmd (pmd) @ kerb-client-api-all ---
[INFO] 
[INFO] --- maven-pmd-plugin:3.4:check (validate) @ kerb-client-api-all ---
[INFO] 
[INFO] 
[INFO] --- maven-checkstyle-plugin:2.15:check (validate) @ kerb-client-api-all ---
[INFO] 
[INFO] --- maven-resources-plugin:2.7:resources (default-resources) @ kerb-client-api-all
---
[WARNING] Using platform encoding (ISO-8859-1 actually) to copy filtered resources, i.e. build
is platform dependent!
[INFO] skip non existing resourceDirectory <https://builds.apache.org/job/dir-kerby/ws/kerby-kerb/kerb-client-api-all/src/main/resources>
[INFO] 
[INFO] --- maven-compiler-plugin:3.3:compile (default-compile) @ kerb-client-api-all ---
[INFO] No sources to compile
[INFO] 
[INFO] --- maven-compiler-plugin:3.3:compile (default) @ kerb-client-api-all ---
[INFO] No sources to compile
[INFO] 
[INFO] --- maven-resources-plugin:2.7:testResources (default-testResources) @ kerb-client-api-all
---
[WARNING] Using platform encoding (ISO-8859-1 actually) to copy filtered resources, i.e. build
is platform dependent!
[INFO] skip non existing resourceDirectory <https://builds.apache.org/job/dir-kerby/ws/kerby-kerb/kerb-client-api-all/src/test/resources>
[INFO] 
[INFO] --- maven-compiler-plugin:3.3:testCompile (default-testCompile) @ kerb-client-api-all
---
[INFO] No sources to compile
[INFO] 
[INFO] --- maven-surefire-plugin:2.18.1:test (default-test) @ kerb-client-api-all ---
[INFO] No tests to run.
[JENKINS] Recording test results
[INFO] 
[INFO] --- maven-jar-plugin:2.5:jar (default-jar) @ kerb-client-api-all ---
[WARNING] JAR will be empty - no content was marked for inclusion!
[INFO] Building jar: <https://builds.apache.org/job/dir-kerby/ws/kerby-kerb/kerb-client-api-all/target/kerb-client-api-all-1.0-SNAPSHOT.jar>
[INFO] 
[INFO] --- maven-install-plugin:2.5.2:install (default-install) @ kerb-client-api-all ---
[INFO] Installing <https://builds.apache.org/job/dir-kerby/ws/kerby-kerb/kerb-client-api-all/target/kerb-client-api-all-1.0-SNAPSHOT.jar>
to /home/jenkins/jenkins-slave/maven-repositories/0/org/apache/kerby/kerb-client-api-all/1.0-SNAPSHOT/kerb-client-api-all-1.0-SNAPSHOT.jar
[INFO] Installing <https://builds.apache.org/job/dir-kerby/ws/kerby-kerb/kerb-client-api-all/pom.xml>
to /home/jenkins/jenkins-slave/maven-repositories/0/org/apache/kerby/kerb-client-api-all/1.0-SNAPSHOT/kerb-client-api-all-1.0-SNAPSHOT.pom
[JENKINS] Archiving disabled
[INFO]                                                                         
[INFO] ------------------------------------------------------------------------
[INFO] Building Kerby-kerb server all 1.0-SNAPSHOT
[INFO] ------------------------------------------------------------------------
[INFO] 
[INFO] --- maven-clean-plugin:2.6.1:clean (default-clean) @ kerb-server-api-all ---
[INFO] Deleting <https://builds.apache.org/job/dir-kerby/ws/kerby-kerb/kerb-server-api-all/target>
[INFO] 
[INFO] --- maven-pmd-plugin:3.4:pmd (pmd) @ kerb-server-api-all ---
[INFO] 
[INFO] --- maven-pmd-plugin:3.4:check (validate) @ kerb-server-api-all ---
[INFO] 
[INFO] 
[INFO] --- maven-checkstyle-plugin:2.15:check (validate) @ kerb-server-api-all ---
[INFO] 
[INFO] --- maven-resources-plugin:2.7:resources (default-resources) @ kerb-server-api-all
---
[WARNING] Using platform encoding (ISO-8859-1 actually) to copy filtered resources, i.e. build
is platform dependent!
[INFO] skip non existing resourceDirectory <https://builds.apache.org/job/dir-kerby/ws/kerby-kerb/kerb-server-api-all/src/main/resources>
[INFO] 
[INFO] --- maven-compiler-plugin:3.3:compile (default-compile) @ kerb-server-api-all ---
[INFO] No sources to compile
[INFO] 
[INFO] --- maven-compiler-plugin:3.3:compile (default) @ kerb-server-api-all ---
[INFO] No sources to compile
[INFO] 
[INFO] --- maven-resources-plugin:2.7:testResources (default-testResources) @ kerb-server-api-all
---
[WARNING] Using platform encoding (ISO-8859-1 actually) to copy filtered resources, i.e. build
is platform dependent!
[INFO] skip non existing resourceDirectory <https://builds.apache.org/job/dir-kerby/ws/kerby-kerb/kerb-server-api-all/src/test/resources>
[INFO] 
[INFO] --- maven-compiler-plugin:3.3:testCompile (default-testCompile) @ kerb-server-api-all
---
[INFO] No sources to compile
[INFO] 
[INFO] --- maven-surefire-plugin:2.18.1:test (default-test) @ kerb-server-api-all ---
[INFO] No tests to run.
[JENKINS] Recording test results
[INFO] 
[INFO] --- maven-jar-plugin:2.5:jar (default-jar) @ kerb-server-api-all ---
[WARNING] JAR will be empty - no content was marked for inclusion!
[INFO] Building jar: <https://builds.apache.org/job/dir-kerby/ws/kerby-kerb/kerb-server-api-all/target/kerb-server-api-all-1.0-SNAPSHOT.jar>
[INFO] 
[INFO] --- maven-install-plugin:2.5.2:install (default-install) @ kerb-server-api-all ---
[INFO] Installing <https://builds.apache.org/job/dir-kerby/ws/kerby-kerb/kerb-server-api-all/target/kerb-server-api-all-1.0-SNAPSHOT.jar>
to /home/jenkins/jenkins-slave/maven-repositories/0/org/apache/kerby/kerb-server-api-all/1.0-SNAPSHOT/kerb-server-api-all-1.0-SNAPSHOT.jar
[INFO] Installing <https://builds.apache.org/job/dir-kerby/ws/kerby-kerb/kerb-server-api-all/pom.xml>
to /home/jenkins/jenkins-slave/maven-repositories/0/org/apache/kerby/kerb-server-api-all/1.0-SNAPSHOT/kerb-server-api-all-1.0-SNAPSHOT.pom
[JENKINS] Archiving disabled
[INFO]                                                                         
[INFO] ------------------------------------------------------------------------
[INFO] Building Kerby KDC Server 1.0-SNAPSHOT
[INFO] ------------------------------------------------------------------------
[INFO] 
[INFO] --- maven-clean-plugin:2.6.1:clean (default-clean) @ kerby-kdc ---
[INFO] Deleting <https://builds.apache.org/job/dir-kerby/ws/kerby-kdc/target>
[INFO] 
[INFO] --- maven-pmd-plugin:3.4:pmd (pmd) @ kerby-kdc ---
[INFO] 
[INFO] --- maven-pmd-plugin:3.4:check (validate) @ kerby-kdc ---
[INFO] 
[INFO] 
[INFO] --- maven-checkstyle-plugin:2.15:check (validate) @ kerby-kdc ---
[INFO] There is 1 error reported by Checkstyle 6.1.1 with <https://builds.apache.org/job/dir-kerby/ws/kerby-kdc/../docs/kerby-checkstyle.xml>
ruleset.
[ERROR] src/main/java/org/apache/kerby/kerberos/kdc/KerbyKdcServer.java[52:61] (whitespace)
OperatorWrap: '?' should be on a new line.
[JENKINS] Archiving disabled
[INFO] ------------------------------------------------------------------------
[INFO] Reactor Summary:
[INFO] 
[INFO] Apache Kerby Project .............................. SUCCESS [4.559s]
[INFO] Kerby Config ...................................... SUCCESS [13.498s]
[INFO] Kerby Util ........................................ SUCCESS [2.581s]
[INFO] Kerby ASN1 Project ................................ SUCCESS [5.760s]
[INFO] Kerby-kerb Project ................................ SUCCESS [0.614s]
[INFO] Kerby-kerb core ................................... SUCCESS [3.170s]
[INFO] Kerby-kerb Crypto ................................. SUCCESS [9.708s]
[INFO] Kerby-kerb Util ................................... SUCCESS [4.987s]
[INFO] kerby-kerb-coreTest ............................... SUCCESS [3.033s]
[INFO] Kerby-kerb Common ................................. SUCCESS [1.908s]
[INFO] Kerby-kerb Identity ............................... SUCCESS [1.534s]
[INFO] Kerby-kerb Identity Test .......................... SUCCESS [1.308s]
[INFO] Kerby-kerb Client ................................. SUCCESS [2.944s]
[INFO] Kerby-kerb Server ................................. SUCCESS [2.893s]
[INFO] Kerby-kerb Admin .................................. SUCCESS [1.371s]
[INFO] Kerb Simple Kdc ................................... SUCCESS [1.318s]
[INFO] Kerb Kdc Test ..................................... SUCCESS [13.825s]
[INFO] Kerby providers ................................... SUCCESS [0.635s]
[INFO] Token provider .................................... SUCCESS [4.823s]
[INFO] Kerb Integration Test ............................. SUCCESS [4.857s]
[INFO] Kerby-kerb client api all ......................... SUCCESS [1.090s]
[INFO] Kerby-kerb server all ............................. SUCCESS [1.185s]
[INFO] Kerby KDC Server .................................. FAILURE [0.906s]
[INFO] Kdc Tool Project .................................. SKIPPED
[INFO] Client Tool ....................................... SKIPPED
[INFO] KDC Tool .......................................... SKIPPED
[INFO] Kerby Backend ..................................... SKIPPED
[INFO] Json identity backend ............................. SKIPPED
[INFO] Zookeeper identity backend ........................ SKIPPED
[INFO] Ldap identity backend ............................. SKIPPED
[INFO] Kerby Kdc Test .................................... SKIPPED
[INFO] Kerby Distribution ................................ SKIPPED
[INFO] KDC Dist .......................................... SKIPPED
[INFO] Tool Dist ......................................... SKIPPED
[INFO] Kerby benchmark ................................... SKIPPED
[INFO] ------------------------------------------------------------------------
[INFO] BUILD FAILURE
[INFO] ------------------------------------------------------------------------
[INFO] Total time: 1:39.184s
[INFO] Finished at: Sun Aug 09 03:57:38 UTC 2015
[INFO] Final Memory: 49M/269M
[INFO] ------------------------------------------------------------------------
[JENKINS] Archiving disabled
[JENKINS] Archiving disabled
[JENKINS] Archiving disabled
[JENKINS] Archiving disabled
[JENKINS] Archiving disabled
[JENKINS] Archiving disabled
[JENKINS] Archiving disabled
[JENKINS] Archiving disabled
[JENKINS] Archiving disabled
[JENKINS] Archiving disabled
[JENKINS] Archiving disabled
[JENKINS] Archiving disabled
[JENKINS] Archiving disabled
[JENKINS] Archiving disabled
[JENKINS] Archiving disabled
[JENKINS] Archiving disabled
[JENKINS] Archiving disabled
[JENKINS] Archiving disabled
[JENKINS] Archiving disabled
[JENKINS] Archiving disabled
[JENKINS] Archiving disabled
[JENKINS] Archiving disabled
[JENKINS] Archiving disabled
[JENKINS] Archiving disabled
[JENKINS] Archiving disabled
[JENKINS] Archiving disabled
[JENKINS] Archiving disabled
[JENKINS] Archiving disabled
[JENKINS] Archiving disabled
[JENKINS] Archiving disabled
[JENKINS] Archiving disabled
[JENKINS] Archiving disabled
[JENKINS] Archiving disabled
[JENKINS] Archiving disabled
[JENKINS] Archiving disabled
Waiting for Jenkins to finish collecting data
[ERROR] Failed to execute goal org.apache.maven.plugins:maven-checkstyle-plugin:2.15:check
(validate) on project kerby-kdc: You have 1 Checkstyle violation. -> [Help 1]
[ERROR] 
[ERROR] To see the full stack trace of the errors, re-run Maven with the -e switch.
[ERROR] Re-run Maven using the -X switch to enable full debug logging.
[ERROR] 
[ERROR] For more information about the errors and possible solutions, please read the following
articles:
[ERROR] [Help 1] http://cwiki.apache.org/confluence/display/MAVEN/MojoFailureException
[ERROR] 
[ERROR] After correcting the problems, you can resume the build with the command
[ERROR]   mvn <goals> -rf :kerby-kdc
channel stopped

Mime
View raw message