directory-notifications mailing list archives

Site index · List index
Message view « Date » · « Thread »
Top « Date » · « Thread »
From gmcdon...@apache.org
Subject Build failed in Jenkins: directory-kerby » not-yet-commons-ssl #97
Date Tue, 11 Aug 2015 06:23:53 GMT
See <https://analysis.apache.org/jenkins/job/directory-kerby/org.apache.kerby$not-yet-commons-ssl/97/>

------------------------------------------
[...truncated 104 lines...]
[ERROR] src/main/java/org/apache/commons/ssl/PKCS8Key.java[810:16] (naming) LocalVariableName:
Name 'P' must match pattern '^[a-z][a-zA-Z0-9]*$'.
[ERROR] src/main/java/org/apache/commons/ssl/PKCS8Key.java[819:16] (naming) LocalVariableName:
Name 'I' must match pattern '^[a-z][a-zA-Z0-9]*$'.
[ERROR] src/main/java/org/apache/commons/ssl/PKCS8Key.java[822:16] (naming) LocalVariableName:
Name 'B' must match pattern '^[a-z][a-zA-Z0-9]*$'.
[ERROR] src/main/java/org/apache/commons/ssl/PKCS8Key.java[912:17] (blocks) RightCurly: '}'
should be on the same line.
[ERROR] src/main/java/org/apache/commons/ssl/PKCS8Key.java[987:17] (blocks) RightCurly: '}'
should be on the same line.
[ERROR] src/main/java/org/apache/commons/ssl/PKCS8Key.java[1010] (sizes) LineLength: Line
is longer than 120 characters (found 126).
[ERROR] src/main/java/org/apache/commons/ssl/PKCS8Key.java[1014] (sizes) LineLength: Line
is longer than 120 characters (found 130).
[ERROR] src/main/java/org/apache/commons/ssl/PKCS8Key.java[1016] (sizes) LineLength: Line
is longer than 120 characters (found 130).
[ERROR] src/main/java/org/apache/commons/ssl/PBETestCreate.java[60:13] (blocks) RightCurly:
'}' should be on the same line.
[ERROR] src/main/java/org/apache/commons/ssl/PBETestCreate.java[70:13] (blocks) RightCurly:
'}' should be on the same line.
[ERROR] src/main/java/org/apache/commons/ssl/SSLWrapperFactory.java[35:8] (imports) UnusedImports:
Unused import - javax.net.ssl.SSLSocket.
[ERROR] src/main/java/org/apache/commons/ssl/SSLWrapperFactory.java[77:5] (modifier) RedundantModifier:
Redundant 'final' modifier.
[ERROR] src/main/java/org/apache/commons/ssl/SSLWrapperFactory.java[77:11] (modifier) ModifierOrder:
'static' modifier out of order with the JLS suggestions.
[ERROR] src/main/java/org/apache/commons/ssl/SSLWrapperFactory.java[79:38] (blocks) LeftCurly:
'{' should have line break after.
[ERROR] src/main/java/org/apache/commons/ssl/SSLWrapperFactory.java[94:5] (modifier) RedundantModifier:
Redundant 'final' modifier.
[ERROR] src/main/java/org/apache/commons/ssl/SSLWrapperFactory.java[94:11] (modifier) ModifierOrder:
'static' modifier out of order with the JLS suggestions.
[ERROR] src/main/java/org/apache/commons/ssl/SSLWrapperFactory.java[95:38] (blocks) LeftCurly:
'{' should have line break after.
[ERROR] src/main/java/org/apache/commons/ssl/PEMUtil.java[45] (imports) AvoidStarImport: Using
the '.*' form of import should be avoided - java.util.*.
[ERROR] src/main/java/org/apache/commons/ssl/PEMUtil.java[54:11] (modifier) ModifierOrder:
'static' modifier out of order with the JLS suggestions.
[ERROR] src/main/java/org/apache/commons/ssl/PEMUtil.java[57:22] (naming) LocalFinalVariableName:
Name 'LINE_SEPARATOR_BYTES' must match pattern '^[a-z][a-zA-Z0-9]*$'.
[ERROR] src/main/java/org/apache/commons/ssl/SSLServerSocketWrapper.java[84:43] (blocks) LeftCurly:
'{' should have line break after.
[ERROR] src/main/java/org/apache/commons/ssl/SSLServerSocketWrapper.java[90:40] (blocks) LeftCurly:
'{' should have line break after.
[ERROR] src/main/java/org/apache/commons/ssl/SSLServerSocketWrapper.java[96:45] (blocks) LeftCurly:
'{' should have line break after.
[ERROR] src/main/java/org/apache/commons/ssl/SSLServerSocketWrapper.java[98:39] (blocks) LeftCurly:
'{' should have line break after.
[ERROR] src/main/java/org/apache/commons/ssl/SSLServerSocketWrapper.java[100:40] (blocks)
LeftCurly: '{' should have line break after.
[ERROR] src/main/java/org/apache/commons/ssl/SSLServerSocketWrapper.java[118:47] (blocks)
LeftCurly: '{' should have line break after.
[ERROR] src/main/java/org/apache/commons/ssl/SSLServerSocketWrapper.java[134:44] (blocks)
LeftCurly: '{' should have line break after.
[ERROR] src/main/java/org/apache/commons/ssl/SSLServerSocketWrapper.java[136:45] (blocks)
LeftCurly: '{' should have line break after.
[ERROR] src/main/java/org/apache/commons/ssl/SSLServerSocketWrapper.java[138:41] (blocks)
LeftCurly: '{' should have line break after.
[ERROR] src/main/java/org/apache/commons/ssl/SSLServerSocketWrapper.java[140:31] (blocks)
LeftCurly: '{' should have line break after.
[ERROR] src/main/java/org/apache/commons/ssl/SSLServerSocketWrapper.java[154:50] (blocks)
LeftCurly: '{' should have line break after.
[ERROR] src/main/java/org/apache/commons/ssl/SSLServerSocketWrapper.java[156:30] (blocks)
LeftCurly: '{' should have line break after.
[ERROR] src/main/java/org/apache/commons/ssl/SSLServerSocketWrapper.java[158:31] (blocks)
LeftCurly: '{' should have line break after.
[ERROR] src/main/java/org/apache/commons/ssl/SSLServerSocketWrapper.java[172:30] (blocks)
LeftCurly: '{' should have line break after.
[ERROR] src/main/java/org/apache/commons/ssl/HostnameVerifier.java[114:5] (modifier) RedundantModifier:
Redundant 'final' modifier.
[ERROR] src/main/java/org/apache/commons/ssl/HostnameVerifier.java[114:11] (modifier) ModifierOrder:
'static' modifier out of order with the JLS suggestions.
[ERROR] src/main/java/org/apache/commons/ssl/HostnameVerifier.java[122:44] (blocks) LeftCurly:
'{' should have line break after.
[ERROR] src/main/java/org/apache/commons/ssl/HostnameVerifier.java[132:5] (modifier) RedundantModifier:
Redundant 'final' modifier.
[ERROR] src/main/java/org/apache/commons/ssl/HostnameVerifier.java[132:11] (modifier) ModifierOrder:
'static' modifier out of order with the JLS suggestions.
[ERROR] src/main/java/org/apache/commons/ssl/HostnameVerifier.java[143:44] (blocks) LeftCurly:
'{' should have line break after.
[ERROR] src/main/java/org/apache/commons/ssl/HostnameVerifier.java[162:5] (modifier) RedundantModifier:
Redundant 'final' modifier.
[ERROR] src/main/java/org/apache/commons/ssl/HostnameVerifier.java[162:11] (modifier) ModifierOrder:
'static' modifier out of order with the JLS suggestions.
[ERROR] src/main/java/org/apache/commons/ssl/HostnameVerifier.java[170:44] (blocks) LeftCurly:
'{' should have line break after.
[ERROR] src/main/java/org/apache/commons/ssl/HostnameVerifier.java[179:5] (modifier) RedundantModifier:
Redundant 'static' modifier.
[ERROR] src/main/java/org/apache/commons/ssl/HostnameVerifier.java[187:44] (blocks) LeftCurly:
'{' should have line break after.
[ERROR] src/main/java/org/apache/commons/ssl/HostnameVerifier.java[194:5] (modifier) RedundantModifier:
Redundant 'final' modifier.
[ERROR] src/main/java/org/apache/commons/ssl/HostnameVerifier.java[194:11] (modifier) ModifierOrder:
'static' modifier out of order with the JLS suggestions.
[ERROR] src/main/java/org/apache/commons/ssl/HostnameVerifier.java[201:44] (blocks) LeftCurly:
'{' should have line break after.
[ERROR] src/main/java/org/apache/commons/ssl/HostnameVerifier.java[216:23] (modifier) ModifierOrder:
'static' modifier out of order with the JLS suggestions.
[ERROR] src/main/java/org/apache/commons/ssl/HostnameVerifier.java[220:23] (modifier) ModifierOrder:
'static' modifier out of order with the JLS suggestions.
[ERROR] src/main/java/org/apache/commons/ssl/HostnameVerifier.java[231:39] (whitespace) WhitespaceAround:
'{' is not followed by whitespace.
[ERROR] src/main/java/org/apache/commons/ssl/HostnameVerifier.java[231:39] (whitespace) WhitespaceAround:
'}' is not preceded with whitespace.
[ERROR] src/main/java/org/apache/commons/ssl/HostnameVerifier.java[246:13] (blocks) RightCurly:
'}' should be on the same line.
[ERROR] src/main/java/org/apache/commons/ssl/HostnameVerifier.java[266:38] (misc) ArrayTypeStyle:
Array brackets at illegal position.
[ERROR] src/main/java/org/apache/commons/ssl/HostnameVerifier.java[392:58] (whitespace) OperatorWrap:
'&&' should be on a new line.
[ERROR] src/main/java/org/apache/commons/ssl/HostnameVerifier.java[393:63] (whitespace) OperatorWrap:
'&&' should be on a new line.
[ERROR] src/main/java/org/apache/commons/ssl/HostnameVerifier.java[394:56] (whitespace) OperatorWrap:
'&&' should be on a new line.
[ERROR] src/main/java/org/apache/commons/ssl/KeyStoreBuilder.java[37] (imports) AvoidStarImport:
Using the '.*' form of import should be avoided - java.io.*.
[ERROR] src/main/java/org/apache/commons/ssl/KeyStoreBuilder.java[39] (imports) AvoidStarImport:
Using the '.*' form of import should be avoided - java.security.*.
[ERROR] src/main/java/org/apache/commons/ssl/KeyStoreBuilder.java[48] (imports) AvoidStarImport:
Using the '.*' form of import should be avoided - java.util.*.
[ERROR] src/main/java/org/apache/commons/ssl/KeyStoreBuilder.java[61:19] (modifier) ModifierOrder:
'static' modifier out of order with the JLS suggestions.
[ERROR] src/main/java/org/apache/commons/ssl/KeyStoreBuilder.java[313:9] (blocks) RightCurly:
'}' should be on the same line.
[ERROR] src/main/java/org/apache/commons/ssl/KeyStoreBuilder.java[316:9] (blocks) RightCurly:
'}' should be on the same line.
[ERROR] src/main/java/org/apache/commons/ssl/KeyStoreBuilder.java[317:46] (blocks) EmptyBlock:
Must have at least one statement.
[ERROR] src/main/java/org/apache/commons/ssl/KeyStoreBuilder.java[328:41] (whitespace) OperatorWrap:
'||' should be on a new line.
[ERROR] src/main/java/org/apache/commons/ssl/KeyStoreBuilder.java[329:41] (whitespace) OperatorWrap:
'||' should be on a new line.
[ERROR] src/main/java/org/apache/commons/ssl/KeyStoreBuilder.java[355:9] (blocks) RightCurly:
'}' should be on the same line.
[ERROR] src/main/java/org/apache/commons/ssl/KeyStoreBuilder.java[356:29] (blocks) EmptyBlock:
Must have at least one statement.
[ERROR] src/main/java/org/apache/commons/ssl/KeyStoreBuilder.java[400:13] (blocks) RightCurly:
'}' should be on the same line.
[ERROR] src/main/java/org/apache/commons/ssl/KeyStoreBuilder.java[401:45] (blocks) EmptyBlock:
Must have at least one statement.
[ERROR] src/main/java/org/apache/commons/ssl/KeyStoreBuilder.java[417:13] (blocks) RightCurly:
'}' should be on the same line.
[ERROR] src/main/java/org/apache/commons/ssl/KeyStoreBuilder.java[418:45] (blocks) EmptyBlock:
Must have at least one statement.
[ERROR] src/main/java/org/apache/commons/ssl/KeyStoreBuilder.java[470:60] (blocks) EmptyBlock:
Must have at least one statement.
[ERROR] src/main/java/org/apache/commons/ssl/KeyStoreBuilder.java[493:9] (blocks) RightCurly:
'}' should be on the same line.
[ERROR] src/main/java/org/apache/commons/ssl/KeyStoreBuilder.java[496:9] (blocks) RightCurly:
'}' should be on the same line.
[ERROR] src/main/java/org/apache/commons/ssl/KeyStoreBuilder.java[500:9] (blocks) RightCurly:
'}' should be on the same line.
[ERROR] src/main/java/org/apache/commons/ssl/KeyStoreBuilder.java[584:35] (blocks) EmptyBlock:
Must have at least one statement.
[ERROR] src/main/java/org/apache/commons/ssl/Asn1PkcsUtil.java[29] (imports) AvoidStarImport:
Using the '.*' form of import should be avoided - org.apache.kerby.asn1.type.*.
[ERROR] src/main/java/org/apache/commons/ssl/Asn1PkcsUtil.java[49:18] (modifier) ModifierOrder:
'static' modifier out of order with the JLS suggestions.
[ERROR] src/main/java/org/apache/commons/ssl/Asn1PkcsUtil.java[76:18] (whitespace) NoWhitespaceAfter:
'!' is followed by whitespace.
[ERROR] src/main/java/org/apache/commons/ssl/Asn1PkcsUtil.java[136:46] (whitespace) WhitespaceAround:
'>=' is not followed by whitespace.
[ERROR] src/main/java/org/apache/commons/ssl/Certificates.java[45] (imports) AvoidStarImport:
Using the '.*' form of import should be avoided - java.io.*.
[ERROR] src/main/java/org/apache/commons/ssl/Certificates.java[52] (imports) AvoidStarImport:
Using the '.*' form of import should be avoided - java.security.cert.*.
[ERROR] src/main/java/org/apache/commons/ssl/Certificates.java[55] (imports) AvoidStarImport:
Using the '.*' form of import should be avoided - java.util.*.
[ERROR] src/main/java/org/apache/commons/ssl/Certificates.java[66:18] (modifier) ModifierOrder:
'static' modifier out of order with the JLS suggestions.
[ERROR] src/main/java/org/apache/commons/ssl/Certificates.java[67:18] (modifier) ModifierOrder:
'static' modifier out of order with the JLS suggestions.
[ERROR] src/main/java/org/apache/commons/ssl/Certificates.java[69:19] (modifier) ModifierOrder:
'static' modifier out of order with the JLS suggestions.
[ERROR] src/main/java/org/apache/commons/ssl/Certificates.java[69:34] (naming) ConstantName:
Name 'crl_cache' must match pattern '^[A-Z][A-Z0-9]*(_[A-Z0-9]+)*$'.
[ERROR] src/main/java/org/apache/commons/ssl/Certificates.java[71:18] (modifier) ModifierOrder:
'static' modifier out of order with the JLS suggestions.
[ERROR] src/main/java/org/apache/commons/ssl/Certificates.java[72:18] (modifier) ModifierOrder:
'static' modifier out of order with the JLS suggestions.
[ERROR] src/main/java/org/apache/commons/ssl/Certificates.java[73:19] (modifier) ModifierOrder:
'static' modifier out of order with the JLS suggestions.
[ERROR] src/main/java/org/apache/commons/ssl/Certificates.java[78:18] (modifier) ModifierOrder:
'static' modifier out of order with the JLS suggestions.
[ERROR] src/main/java/org/apache/commons/ssl/Certificates.java[84:17] (blocks) LeftCurly:
'{' should be on the previous line.
[ERROR] src/main/java/org/apache/commons/ssl/Certificates.java[88:17] (blocks) LeftCurly:
'{' should be on the previous line.
[ERROR] src/main/java/org/apache/commons/ssl/Certificates.java[128:33] (blocks) RightCurly:
'}' should be on the same line.
[ERROR] src/main/java/org/apache/commons/ssl/Certificates.java[146:9] (blocks) RightCurly:
'}' should be on the same line.
[ERROR] src/main/java/org/apache/commons/ssl/Certificates.java[149:9] (blocks) RightCurly:
'}' should be on the same line.
[ERROR] src/main/java/org/apache/commons/ssl/Certificates.java[245:13] (blocks) RightCurly:
'}' should be on the same line.
[ERROR] src/main/java/org/apache/commons/ssl/Certificates.java[296:28] (blocks) EmptyBlock:
Must have at least one statement.
[ERROR] src/main/java/org/apache/commons/ssl/Certificates.java[330:9] (blocks) RightCurly:
'}' should be on the same line.
[ERROR] src/main/java/org/apache/commons/ssl/Certificates.java[362:23] (whitespace) WhitespaceAround:
'if' is not followed by whitespace.
[ERROR] src/main/java/org/apache/commons/ssl/Certificates.java[363:114] (whitespace) ParenPad:
')' is preceded with whitespace.
[ERROR] src/main/java/org/apache/commons/ssl/Certificates.java[418:62] (blocks) EmptyBlock:
Must have at least one statement.
[ERROR] src/main/java/org/apache/commons/ssl/Certificates.java[433:21] (blocks) RightCurly:
'}' should be on the same line.
[ERROR] src/main/java/org/apache/commons/ssl/Certificates.java[441:17] (blocks) RightCurly:
'}' should be on the same line.
[ERROR] src/main/java/org/apache/commons/ssl/Certificates.java[442:41] (blocks) EmptyBlock:
Must have at least one statement.
[ERROR] src/main/java/org/apache/commons/ssl/Certificates.java[463:17] (blocks) RightCurly:
'}' should be on the same line.
[ERROR] src/main/java/org/apache/commons/ssl/Certificates.java[464:41] (blocks) EmptyBlock:
Must have at least one statement.
[ERROR] src/main/java/org/apache/commons/ssl/Certificates.java[467:17] (blocks) RightCurly:
'}' should be on the same line.
[ERROR] src/main/java/org/apache/commons/ssl/Certificates.java[468:43] (blocks) EmptyBlock:
Must have at least one statement.
[ERROR] src/main/java/org/apache/commons/ssl/Certificates.java[497:61] (blocks) EmptyBlock:
Must have at least one statement.
[ERROR] src/main/java/org/apache/commons/ssl/Certificates.java[498:54] (blocks) EmptyBlock:
Must have at least one statement.
[ERROR] src/main/java/org/apache/commons/ssl/Certificates.java[505:47] (blocks) EmptyBlock:
Must have at least one statement.
[ERROR] src/main/java/org/apache/commons/ssl/Certificates.java[529:9] (blocks) RightCurly:
'}' should be on the same line.
[ERROR] src/main/java/org/apache/commons/ssl/ProbablyBadPasswordException.java[43:43] (blocks)
LeftCurly: '{' should have line break after.
[ERROR] src/main/java/org/apache/commons/ssl/ProbablyBadPasswordException.java[45:51] (blocks)
LeftCurly: '{' should have line break after.
[ERROR] src/main/java/org/apache/commons/ssl/Util.java[64:18] (modifier) ModifierOrder: 'static'
modifier out of order with the JLS suggestions.
[ERROR] src/main/java/org/apache/commons/ssl/Util.java[65:18] (modifier) ModifierOrder: 'static'
modifier out of order with the JLS suggestions.
[ERROR] src/main/java/org/apache/commons/ssl/Util.java[120:69] (whitespace) OperatorWrap:
'||' should be on a new line.
[ERROR] src/main/java/org/apache/commons/ssl/Util.java[121:75] (whitespace) OperatorWrap:
'||' should be on a new line.
[ERROR] src/main/java/org/apache/commons/ssl/Util.java[172:9] (blocks) RightCurly: '}' should
be on the same line.
[ERROR] src/main/java/org/apache/commons/ssl/Util.java[176:17] (blocks) LeftCurly: '{' should
have line break after.
[ERROR] src/main/java/org/apache/commons/ssl/Util.java[176:31] (blocks) RightCurly: '}' should
have line break before.
[ERROR] src/main/java/org/apache/commons/ssl/Util.java[176:55] (blocks) LeftCurly: '{' should
have line break after.
[ERROR] src/main/java/org/apache/commons/ssl/Util.java[176:66] (blocks) RightCurly: '}' should
have line break before.
[ERROR] src/main/java/org/apache/commons/ssl/Util.java[178:21] (blocks) LeftCurly: '{' should
have line break after.
[ERROR] src/main/java/org/apache/commons/ssl/Util.java[178:36] (blocks) RightCurly: '}' should
have line break before.
[ERROR] src/main/java/org/apache/commons/ssl/Util.java[178:60] (blocks) LeftCurly: '{' should
have line break after.
[ERROR] src/main/java/org/apache/commons/ssl/Util.java[178:71] (blocks) RightCurly: '}' should
have line break before.
[ERROR] src/main/java/org/apache/commons/ssl/Util.java[233:9] (blocks) RightCurly: '}' should
be on the same line.
[ERROR] src/main/java/org/apache/commons/ssl/Util.java[327:13] (naming) LocalVariableName:
Name 'ARGS_MATCH' must match pattern '^[a-z][a-zA-Z0-9]*$'.
[ERROR] src/main/java/org/apache/commons/ssl/Util.java[330:24] (naming) LocalFinalVariableName:
Name 'EMPTY_VALUES' must match pattern '^[a-z][a-zA-Z0-9]*$'.
[ERROR] src/main/java/org/apache/commons/ssl/Asn1PkcsStructure.java[31] (imports) AvoidStarImport:
Using the '.*' form of import should be avoided - java.util.*.
[ERROR] src/main/java/org/apache/commons/ssl/Java14.java[34:8] (imports) UnusedImports: Unused
import - org.apache.commons.ssl.util.IPAddressParser.
[ERROR] src/main/java/org/apache/commons/ssl/Java14.java[41:8] (imports) UnusedImports: Unused
import - java.net.UnknownHostException.
[ERROR] src/main/java/org/apache/commons/ssl/Java14.java[78:9] (blocks) RightCurly: '}' should
be on the same line.
[ERROR] src/main/java/org/apache/commons/ssl/util/ByteArrayReadLine.java[8:55] (blocks) LeftCurly:
'{' should have line break after.
[ERROR] src/main/java/org/apache/commons/ssl/util/ByteArrayReadLine.java[10:26] (blocks) LeftCurly:
'{' should have line break after.
[ERROR] src/main/java/org/apache/commons/ssl/util/ByteArrayReadLine.java[21:33] (blocks) LeftCurly:
'{' should have line break after.
[ERROR] src/main/java/org/apache/commons/ssl/util/ReadLine.java[17:37] (blocks) LeftCurly:
'{' should have line break after.
[ERROR] src/main/java/org/apache/commons/ssl/util/ReadLine.java[19:45] (blocks) LeftCurly:
'{' should have line break after.
[ERROR] src/main/java/org/apache/commons/ssl/util/ReadLine.java[52:52] (blocks) LeftCurly:
'{' should have line break after.
[ERROR] src/main/java/org/apache/commons/ssl/SSLProxyServer.java[137:25] (blocks) RightCurly:
'}' should be on the same line.
[ERROR] src/main/java/org/apache/commons/ssl/SSLProxyServer.java[159:13] (blocks) RightCurly:
'}' should be on the same line.
[ERROR] src/main/java/org/apache/commons/ssl/SSLProxyServer.java[169:17] (blocks) RightCurly:
'}' should be on the same line.
[ERROR] src/main/java/org/apache/commons/ssl/SSLProxyServer.java[170:37] (blocks) EmptyBlock:
Must have at least one statement.
[ERROR] src/main/java/org/apache/commons/ssl/SSLProxyServer.java[181:17] (blocks) RightCurly:
'}' should be on the same line.
[ERROR] src/main/java/org/apache/commons/ssl/SSLProxyServer.java[182:37] (blocks) EmptyBlock:
Must have at least one statement.
[ERROR] src/main/java/org/apache/commons/ssl/LDAPSocket.java[45:19] (modifier) ModifierOrder:
'static' modifier out of order with the JLS suggestions.
[ERROR] src/main/java/org/apache/commons/ssl/LDAPSocket.java[45:37] (naming) ConstantName:
Name 'instance' must match pattern '^[A-Z][A-Z0-9]*(_[A-Z0-9]+)*$'.
[ERROR] src/main/java/org/apache/commons/ssl/LDAPSocket.java[51:9] (blocks) RightCurly: '}'
should be on the same line.
[ERROR] src/main/java/org/apache/commons/ssl/LDAPSocket.java[55:9] (blocks) RightCurly: '}'
should be on the same line.
[ERROR] src/main/java/org/apache/commons/ssl/SSLClient.java[39:8] (imports) UnusedImports:
Unused import - java.net.UnknownHostException.
[ERROR] src/main/java/org/apache/commons/ssl/SSLClient.java[80:40] (blocks) LeftCurly: '{'
should have line break after.
[ERROR] src/main/java/org/apache/commons/ssl/SSLClient.java[82:39] (blocks) LeftCurly: '{'
should have line break after.
[ERROR] src/main/java/org/apache/commons/ssl/SSLClient.java[84:40] (blocks) LeftCurly: '{'
should have line break after.
[ERROR] src/main/java/org/apache/commons/ssl/SSLClient.java[86:43] (blocks) LeftCurly: '{'
should have line break after.
[ERROR] src/main/java/org/apache/commons/ssl/SSLClient.java[88:45] (blocks) LeftCurly: '{'
should have line break after.
[ERROR] src/main/java/org/apache/commons/ssl/SSLClient.java[90:42] (blocks) LeftCurly: '{'
should have line break after.
[ERROR] src/main/java/org/apache/commons/ssl/SSLClient.java[92:46] (blocks) LeftCurly: '{'
should have line break after.
[ERROR] src/main/java/org/apache/commons/ssl/SSLClient.java[106:45] (blocks) LeftCurly: '{'
should have line break after.
[ERROR] src/main/java/org/apache/commons/ssl/SSLClient.java[112:46] (blocks) LeftCurly: '{'
should have line break after.
[ERROR] src/main/java/org/apache/commons/ssl/SSLClient.java[114:46] (blocks) LeftCurly: '{'
should have line break after.
[ERROR] src/main/java/org/apache/commons/ssl/SSLClient.java[116:45] (blocks) LeftCurly: '{'
should have line break after.
[ERROR] src/main/java/org/apache/commons/ssl/SSLClient.java[118:31] (blocks) LeftCurly: '{'
should have line break after.
[ERROR] src/main/java/org/apache/commons/ssl/SSLClient.java[124:34] (blocks) LeftCurly: '{'
should have line break after.
[ERROR] src/main/java/org/apache/commons/ssl/SSLClient.java[126:37] (blocks) LeftCurly: '{'
should have line break after.
[ERROR] src/main/java/org/apache/commons/ssl/SSLClient.java[128:39] (blocks) LeftCurly: '{'
should have line break after.
[ERROR] src/main/java/org/apache/commons/ssl/SSLClient.java[130:36] (blocks) LeftCurly: '{'
should have line break after.
[ERROR] src/main/java/org/apache/commons/ssl/SSLClient.java[132:40] (blocks) LeftCurly: '{'
should have line break after.
[ERROR] src/main/java/org/apache/commons/ssl/SSLClient.java[134:41] (blocks) LeftCurly: '{'
should have line break after.
[ERROR] src/main/java/org/apache/commons/ssl/SSLClient.java[136:43] (blocks) LeftCurly: '{'
should have line break after.
[ERROR] src/main/java/org/apache/commons/ssl/SSLClient.java[142:31] (blocks) LeftCurly: '{'
should have line break after.
[ERROR] src/main/java/org/apache/commons/ssl/SSLClient.java[148:40] (blocks) LeftCurly: '{'
should have line break after.
[ERROR] src/main/java/org/apache/commons/ssl/SSLClient.java[150:40] (blocks) LeftCurly: '{'
should have line break after.
[ERROR] src/main/java/org/apache/commons/ssl/SSLClient.java[160:39] (blocks) LeftCurly: '{'
should have line break after.
[ERROR] src/main/java/org/apache/commons/ssl/JavaImpl.java[60:19] (modifier) ModifierOrder:
'static' modifier out of order with the JLS suggestions.
[ERROR] src/main/java/org/apache/commons/ssl/TrustMaterial.java[57:11] (modifier) ModifierOrder:
'static' modifier out of order with the JLS suggestions.
[ERROR] src/main/java/org/apache/commons/ssl/TrustMaterial.java[58:11] (modifier) ModifierOrder:
'static' modifier out of order with the JLS suggestions.
[ERROR] src/main/java/org/apache/commons/ssl/TrustMaterial.java[63:18] (modifier) ModifierOrder:
'static' modifier out of order with the JLS suggestions.
[ERROR] src/main/java/org/apache/commons/ssl/TrustMaterial.java[68:18] (modifier) ModifierOrder:
'static' modifier out of order with the JLS suggestions.
[ERROR] src/main/java/org/apache/commons/ssl/TrustMaterial.java[76:18] (modifier) ModifierOrder:
'static' modifier out of order with the JLS suggestions.
[ERROR] src/main/java/org/apache/commons/ssl/TrustMaterial.java[90:9] (blocks) RightCurly:
'}' should be on the same line.
[ERROR] src/main/java/org/apache/commons/ssl/TrustMaterial.java[99:9] (blocks) RightCurly:
'}' should be on the same line.
[ERROR] src/main/java/org/apache/commons/ssl/TrustMaterial.java[113:18] (modifier) ModifierOrder:
'static' modifier out of order with the JLS suggestions.
[ERROR] src/main/java/org/apache/commons/ssl/TrustMaterial.java[116:18] (modifier) ModifierOrder:
'static' modifier out of order with the JLS suggestions.
[ERROR] src/main/java/org/apache/commons/ssl/TrustMaterial.java[275:13] (whitespace) ParenPad:
'(' is followed by whitespace.
[ERROR] src/main/java/org/apache/commons/ssl/TrustMaterial.java[275:18] (whitespace) ParenPad:
')' is preceded with whitespace.
[ERROR] src/main/java/org/apache/commons/ssl/SSLEchoServer.java[105:17] (blocks) RightCurly:
'}' should be on the same line.
[ERROR] src/main/java/org/apache/commons/ssl/SSLEchoServer.java[125:13] (blocks) RightCurly:
'}' should be on the same line.
[ERROR] src/main/java/org/apache/commons/ssl/SSLEchoServer.java[135:17] (blocks) RightCurly:
'}' should be on the same line.
[ERROR] src/main/java/org/apache/commons/ssl/SSLEchoServer.java[136:37] (blocks) EmptyBlock:
Must have at least one statement.
[ERROR] src/main/java/org/apache/commons/ssl/SSLServer.java[92:13] (blocks) RightCurly: '}'
should be on the same line.
[ERROR] src/main/java/org/apache/commons/ssl/SSLServer.java[112:39] (blocks) LeftCurly: '{'
should have line break after.
[ERROR] src/main/java/org/apache/commons/ssl/SSLServer.java[132:40] (blocks) LeftCurly: '{'
should have line break after.
[ERROR] src/main/java/org/apache/commons/ssl/SSLServer.java[134:43] (blocks) LeftCurly: '{'
should have line break after.
[ERROR] src/main/java/org/apache/commons/ssl/SSLServer.java[136:45] (blocks) LeftCurly: '{'
should have line break after.
[ERROR] src/main/java/org/apache/commons/ssl/SSLServer.java[138:42] (blocks) LeftCurly: '{'
should have line break after.
[ERROR] src/main/java/org/apache/commons/ssl/SSLServer.java[140:46] (blocks) LeftCurly: '{'
should have line break after.
[ERROR] src/main/java/org/apache/commons/ssl/SSLServer.java[154:45] (blocks) LeftCurly: '{'
should have line break after.
[ERROR] src/main/java/org/apache/commons/ssl/SSLServer.java[160:46] (blocks) LeftCurly: '{'
should have line break after.
[ERROR] src/main/java/org/apache/commons/ssl/SSLServer.java[162:46] (blocks) LeftCurly: '{'
should have line break after.
[ERROR] src/main/java/org/apache/commons/ssl/SSLServer.java[164:45] (blocks) LeftCurly: '{'
should have line break after.
[ERROR] src/main/java/org/apache/commons/ssl/SSLServer.java[170:34] (blocks) LeftCurly: '{'
should have line break after.
[ERROR] src/main/java/org/apache/commons/ssl/SSLServer.java[172:37] (blocks) LeftCurly: '{'
should have line break after.
[ERROR] src/main/java/org/apache/commons/ssl/SSLServer.java[174:39] (blocks) LeftCurly: '{'
should have line break after.
[ERROR] src/main/java/org/apache/commons/ssl/SSLServer.java[176:36] (blocks) LeftCurly: '{'
should have line break after.
[ERROR] src/main/java/org/apache/commons/ssl/SSLServer.java[178:40] (blocks) LeftCurly: '{'
should have line break after.
[ERROR] src/main/java/org/apache/commons/ssl/SSLServer.java[180:41] (blocks) LeftCurly: '{'
should have line break after.
[ERROR] src/main/java/org/apache/commons/ssl/SSLServer.java[182:43] (blocks) LeftCurly: '{'
should have line break after.
[ERROR] src/main/java/org/apache/commons/ssl/SSLServer.java[188:31] (blocks) LeftCurly: '{'
should have line break after.
[ERROR] src/main/java/org/apache/commons/ssl/SSLServer.java[194:40] (blocks) LeftCurly: '{'
should have line break after.
[ERROR] src/main/java/org/apache/commons/ssl/SSLServer.java[196:40] (blocks) LeftCurly: '{'
should have line break after.
[ERROR] src/main/java/org/apache/commons/ssl/SSLServer.java[206:39] (blocks) LeftCurly: '{'
should have line break after.
[ERROR] src/main/java/org/apache/commons/ssl/ComboInputStream.java[74:9] (blocks) RightCurly:
'}' should be on the same line.
[ERROR] src/main/java/org/apache/commons/ssl/ComboInputStream.java[82:27] (misc) ArrayTypeStyle:
Array brackets at illegal position.
[ERROR] src/main/java/org/apache/commons/ssl/CRLUtil.java[56:45] (naming) ParameterName: Name
'extension2_5_29_31' must match pattern '^[a-z][a-zA-Z0-9]*$'.
[ERROR] src/main/java/org/apache/commons/ssl/OpenSSL.java[40] (imports) AvoidStarImport: Using
the '.*' form of import should be avoided - java.io.*.
[ERROR] src/main/java/org/apache/commons/ssl/OpenSSL.java[384:9] (blocks) LeftCurly: '{' should
be on the previous line.
[ERROR] src/main/java/org/apache/commons/ssl/OpenSSL.java[388:9] (blocks) LeftCurly: '{' should
be on the previous line.
[ERROR] src/main/java/org/apache/commons/ssl/OpenSSL.java[578:21] (blocks) RightCurly: '}'
should be on the same line.
[ERROR] src/main/java/org/apache/commons/ssl/OpenSSL.java[593:21] (blocks) RightCurly: '}'
should be on the same line.
[ERROR] src/main/java/org/apache/commons/ssl/OpenSSL.java[714:64] (whitespace) ParenPad: '('
is followed by whitespace.
[ERROR] src/main/java/org/apache/commons/ssl/OpenSSL.java[714:75] (whitespace) ParenPad: ')'
is preceded with whitespace.
[ERROR] src/test/java/org/apache/commons/ssl/TestBase64.java[57:64] (whitespace) ParenPad:
'(' is followed by whitespace.
[ERROR] src/test/java/org/apache/commons/ssl/TestBase64.java[57:68] (whitespace) ParenPad:
')' is preceded with whitespace.
[ERROR] src/test/java/org/apache/commons/ssl/TestBase64.java[58:65] (whitespace) WhitespaceAfter:
',' is not followed by whitespace.
[ERROR] src/test/java/org/apache/commons/ssl/TestBase64.java[60:43] (whitespace) ParenPad:
'(' is followed by whitespace.
[ERROR] src/test/java/org/apache/commons/ssl/TestBase64.java[60:47] (whitespace) ParenPad:
')' is preceded with whitespace.
[ERROR] src/test/java/org/apache/commons/ssl/TestBase64.java[76:64] (whitespace) ParenPad:
'(' is followed by whitespace.
[ERROR] src/test/java/org/apache/commons/ssl/TestBase64.java[76:68] (whitespace) ParenPad:
')' is preceded with whitespace.
[ERROR] src/test/java/org/apache/commons/ssl/TestBase64.java[77:65] (whitespace) WhitespaceAfter:
',' is not followed by whitespace.
[ERROR] src/test/java/org/apache/commons/ssl/TestBase64.java[79:43] (whitespace) ParenPad:
'(' is followed by whitespace.
[ERROR] src/test/java/org/apache/commons/ssl/TestBase64.java[79:47] (whitespace) ParenPad:
')' is preceded with whitespace.
[ERROR] src/test/java/org/apache/commons/ssl/TestCertificates.java[10:8] (imports) UnusedImports:
Unused import - java.io.FileInputStream.
[ERROR] src/test/java/org/apache/commons/ssl/TestCertificates.java[13:8] (imports) UnusedImports:
Unused import - java.security.cert.CertificateException.
[ERROR] src/test/java/org/apache/commons/ssl/TestCertificates.java[14:8] (imports) UnusedImports:
Unused import - java.security.cert.CertificateFactory.
[ERROR] src/test/java/org/apache/commons/ssl/TestKeyMaterial.java[5] (imports) AvoidStarImport:
Using the '.*' form of import should be avoided - org.junit.Assert.*.
[ERROR] src/test/java/org/apache/commons/ssl/TestKeyMaterial.java[36:20] (naming) LocalVariableName:
Name 'F' must match pattern '^[a-z][a-zA-Z0-9]*$'.
[ERROR] src/test/java/org/apache/commons/ssl/TestKeyMaterial.java[46:16] (naming) LocalVariableName:
Name 'FILENAME' must match pattern '^[a-z][a-zA-Z0-9]*$'.
[ERROR] src/test/java/org/apache/commons/ssl/JUnitConfig.java[5:8] (imports) UnusedImports:
Unused import - java.io.FileReader.
[ERROR] src/test/java/org/apache/commons/ssl/JUnitConfig.java[11:18] (modifier) ModifierOrder:
'static' modifier out of order with the JLS suggestions.
[ERROR] src/test/java/org/apache/commons/ssl/TestIPAddressParser.java[3] (imports) AvoidStarImport:
Using the '.*' form of import should be avoided - org.apache.commons.ssl.util.IPAddressParser.*.
[ERROR] src/test/java/org/apache/commons/ssl/TestIPAddressParser.java[4] (imports) AvoidStarImport:
Using the '.*' form of import should be avoided - org.junit.Assert.*.
[ERROR] src/test/java/org/apache/commons/ssl/TestOpenSSL.java[4] (imports) AvoidStarImport:
Using the '.*' form of import should be avoided - org.junit.Assert.*.
[ERROR] src/test/java/org/apache/commons/ssl/TestOpenSSL.java[127] (sizes) LineLength: Line
is longer than 120 characters (found 126).
[ERROR] src/test/java/org/apache/commons/ssl/TestOpenSSL.java[134] (sizes) LineLength: Line
is longer than 120 characters (found 127).
[ERROR] src/test/java/org/apache/commons/ssl/TestPKCS8Key.java[4] (imports) AvoidStarImport:
Using the '.*' form of import should be avoided - org.junit.Assert.*.
[ERROR] src/test/java/org/apache/commons/ssl/TestPKCS8Key.java[35:20] (naming) LocalVariableName:
Name 'FILENAME' must match pattern '^[a-z][a-zA-Z0-9]*$'.

Mime
View raw message