directory-notifications mailing list archives

Site index · List index
Message view « Date » · « Thread »
Top « Date » · « Thread »
From Apache Jenkins Server <jenk...@builds.apache.org>
Subject Build failed in Jenkins: dir-apacheds-ubuntu-deploy #1798
Date Sat, 15 Aug 2015 04:20:36 GMT
See <https://builds.apache.org/job/dir-apacheds-ubuntu-deploy/1798/changes>

Changes:

[lucastheisen] DIRSERVER-2088 - Add the ability to specify additional fields that should be
hashed by the hashing interceptors

[seelmann] Fix checkstyle issues

------------------------------------------
[...truncated 5048 lines...]
	at hudson.remoting.UserRequest.perform(UserRequest.java:118)
	at hudson.remoting.UserRequest.perform(UserRequest.java:48)
	at hudson.remoting.Request$2.run(Request.java:328)
	at hudson.remoting.InterceptingExecutorService$1.call(InterceptingExecutorService.java:72)
	at java.util.concurrent.FutureTask$Sync.innerRun(FutureTask.java:334)
	at java.util.concurrent.FutureTask.run(FutureTask.java:166)
	at java.util.concurrent.ThreadPoolExecutor.runWorker(ThreadPoolExecutor.java:1145)
	at java.util.concurrent.ThreadPoolExecutor$Worker.run(ThreadPoolExecutor.java:615)
	at java.lang.Thread.run(Thread.java:724)
Uploaded: https://repository.apache.org/content/repositories/snapshots/org/apache/directory/server/apacheds-core-constants/2.0.0-M21-SNAPSHOT/maven-metadata.xml
(818 B at 0.0 KB/sec)
Uploading: https://repository.apache.org/content/repositories/snapshots/org/apache/directory/server/apacheds-core-constants/maven-metadata.xml
Uploaded: https://repository.apache.org/content/repositories/snapshots/org/apache/directory/server/apacheds-core-constants/maven-metadata.xml
(462 B at 0.0 KB/sec)
[INFO] 
[INFO] --- maven-bundle-plugin:2.5.3:deploy (default-deploy) @ apacheds-core-constants ---
[INFO] Remote OBR update disabled (enable with -DremoteOBR)
[JENKINS] Archiving disabled
[INFO]                                                                         
[INFO] ------------------------------------------------------------------------
[INFO] Building ApacheDS Core API 2.0.0-M21-SNAPSHOT
[INFO] ------------------------------------------------------------------------
Downloading: http://repo.maven.apache.org/maven2/org/apache/maven/plugins/maven-jar-plugin/2.5/maven-jar-plugin-2.5.pom
Downloaded: http://repo.maven.apache.org/maven2/org/apache/maven/plugins/maven-jar-plugin/2.5/maven-jar-plugin-2.5.pom
(8 KB at 189.4 KB/sec)
Downloading: http://repo.maven.apache.org/maven2/org/apache/maven/plugins/maven-jar-plugin/2.5/maven-jar-plugin-2.5.jar
Downloaded: http://repo.maven.apache.org/maven2/org/apache/maven/plugins/maven-jar-plugin/2.5/maven-jar-plugin-2.5.jar
(25 KB at 565.0 KB/sec)
Downloading: http://repo.maven.apache.org/maven2/org/apache/maven/plugins/maven-source-plugin/2.4/maven-source-plugin-2.4.pom
Downloaded: http://repo.maven.apache.org/maven2/org/apache/maven/plugins/maven-source-plugin/2.4/maven-source-plugin-2.4.pom
(7 KB at 170.7 KB/sec)
Downloading: http://repo.maven.apache.org/maven2/org/apache/maven/plugins/maven-source-plugin/2.4/maven-source-plugin-2.4.jar
Downloaded: http://repo.maven.apache.org/maven2/org/apache/maven/plugins/maven-source-plugin/2.4/maven-source-plugin-2.4.jar
(31 KB at 807.6 KB/sec)
Downloading: http://repo.maven.apache.org/maven2/org/apache/directory/junit/junit-addons/0.1/junit-addons-0.1.pom
Downloaded: http://repo.maven.apache.org/maven2/org/apache/directory/junit/junit-addons/0.1/junit-addons-0.1.pom
(3 KB at 59.7 KB/sec)
Downloading: http://repo.maven.apache.org/maven2/org/apache/directory/project/project/20/project-20.pom
Downloaded: http://repo.maven.apache.org/maven2/org/apache/directory/project/project/20/project-20.pom
(30 KB at 736.7 KB/sec)
Downloading: http://repo.maven.apache.org/maven2/org/apache/apache/8/apache-8.pom
Downloaded: http://repo.maven.apache.org/maven2/org/apache/apache/8/apache-8.pom (14 KB at
343.1 KB/sec)
Downloading: http://repo.maven.apache.org/maven2/commons-lang/commons-lang/2.6/commons-lang-2.6.pom
Downloaded: http://repo.maven.apache.org/maven2/commons-lang/commons-lang/2.6/commons-lang-2.6.pom
(18 KB at 461.7 KB/sec)
Downloading: http://repo.maven.apache.org/maven2/org/apache/commons/commons-parent/17/commons-parent-17.pom
Downloaded: http://repo.maven.apache.org/maven2/org/apache/commons/commons-parent/17/commons-parent-17.pom
(31 KB at 823.1 KB/sec)
Downloading: http://repo.maven.apache.org/maven2/commons-io/commons-io/2.4/commons-io-2.4.pom
Downloaded: http://repo.maven.apache.org/maven2/commons-io/commons-io/2.4/commons-io-2.4.pom
(10 KB at 268.3 KB/sec)
Downloading: http://repo.maven.apache.org/maven2/org/apache/commons/commons-parent/25/commons-parent-25.pom
Downloaded: http://repo.maven.apache.org/maven2/org/apache/commons/commons-parent/25/commons-parent-25.pom
(48 KB at 1241.4 KB/sec)
Downloading: http://repository.apache.org/snapshots/org/apache/directory/api/api-i18n/1.0.0-M32-SNAPSHOT/maven-metadata.xml
Downloaded: http://repository.apache.org/snapshots/org/apache/directory/api/api-i18n/1.0.0-M32-SNAPSHOT/maven-metadata.xml
(1016 B at 0.1 KB/sec)
Downloading: http://repository.apache.org/snapshots/org/apache/directory/api/api-i18n/1.0.0-M32-SNAPSHOT/api-i18n-1.0.0-M32-20150815.030326-45.pom
Downloaded: http://repository.apache.org/snapshots/org/apache/directory/api/api-i18n/1.0.0-M32-SNAPSHOT/api-i18n-1.0.0-M32-20150815.030326-45.pom
(3 KB at 5.5 KB/sec)
Downloading: http://repository.apache.org/snapshots/org/apache/directory/api/api-parent/1.0.0-M32-SNAPSHOT/maven-metadata.xml
Downloaded: http://repository.apache.org/snapshots/org/apache/directory/api/api-parent/1.0.0-M32-SNAPSHOT/maven-metadata.xml
(837 B at 0.2 KB/sec)
Downloading: http://repository.apache.org/snapshots/org/apache/directory/api/api-parent/1.0.0-M32-SNAPSHOT/api-parent-1.0.0-M32-20150815.030155-45.pom
Downloaded: http://repository.apache.org/snapshots/org/apache/directory/api/api-parent/1.0.0-M32-SNAPSHOT/api-parent-1.0.0-M32-20150815.030155-45.pom
(28 KB at 18.4 KB/sec)
Downloading: http://repo.maven.apache.org/maven2/org/apache/directory/project/project/35/project-35.pom
Downloaded: http://repo.maven.apache.org/maven2/org/apache/directory/project/project/35/project-35.pom
(31 KB at 441.6 KB/sec)
Downloading: http://repo.maven.apache.org/maven2/org/apache/apache/17/apache-17.pom
Downloaded: http://repo.maven.apache.org/maven2/org/apache/apache/17/apache-17.pom (16 KB
at 423.8 KB/sec)
Downloading: http://repository.apache.org/snapshots/org/apache/directory/api/api-asn1-api/1.0.0-M32-SNAPSHOT/maven-metadata.xml
Downloaded: http://repository.apache.org/snapshots/org/apache/directory/api/api-asn1-api/1.0.0-M32-SNAPSHOT/maven-metadata.xml
(1020 B at 0.3 KB/sec)
Downloading: http://repository.apache.org/snapshots/org/apache/directory/api/api-asn1-api/1.0.0-M32-SNAPSHOT/api-asn1-api-1.0.0-M32-20150815.030547-45.pom
Downloaded: http://repository.apache.org/snapshots/org/apache/directory/api/api-asn1-api/1.0.0-M32-SNAPSHOT/api-asn1-api-1.0.0-M32-20150815.030547-45.pom
(4 KB at 5.0 KB/sec)
Downloading: http://repository.apache.org/snapshots/org/apache/directory/api/api-asn1-parent/1.0.0-M32-SNAPSHOT/maven-metadata.xml
Downloaded: http://repository.apache.org/snapshots/org/apache/directory/api/api-asn1-parent/1.0.0-M32-SNAPSHOT/maven-metadata.xml
(842 B at 0.4 KB/sec)
Downloading: http://repository.apache.org/snapshots/org/apache/directory/api/api-asn1-parent/1.0.0-M32-SNAPSHOT/api-asn1-parent-1.0.0-M32-20150815.030537-45.pom
Downloaded: http://repository.apache.org/snapshots/org/apache/directory/api/api-asn1-parent/1.0.0-M32-SNAPSHOT/api-asn1-parent-1.0.0-M32-20150815.030537-45.pom
(2 KB at 1.4 KB/sec)
Downloading: http://repository.apache.org/snapshots/org/apache/directory/api/api-ldap-client-api/1.0.0-M32-SNAPSHOT/maven-metadata.xml
[WARNING] Could not transfer metadata org.apache.directory.api:api-ldap-client-api:1.0.0-M32-SNAPSHOT/maven-metadata.xml
from/to Nexus (http://repository.apache.org/snapshots): Failed to transfer file: http://repository.apache.org/snapshots/org/apache/directory/api/api-ldap-client-api/1.0.0-M32-SNAPSHOT/maven-metadata.xml.
Return code is: 502, ReasonPhrase:Proxy Error.
[WARNING] Failure to transfer org.apache.directory.api:api-ldap-client-api:1.0.0-M32-SNAPSHOT/maven-metadata.xml
from http://repository.apache.org/snapshots was cached in the local repository, resolution
will not be reattempted until the update interval of Nexus has elapsed or updates are forced.
Original error: Could not transfer metadata org.apache.directory.api:api-ldap-client-api:1.0.0-M32-SNAPSHOT/maven-metadata.xml
from/to Nexus (http://repository.apache.org/snapshots): Failed to transfer file: http://repository.apache.org/snapshots/org/apache/directory/api/api-ldap-client-api/1.0.0-M32-SNAPSHOT/maven-metadata.xml.
Return code is: 502, ReasonPhrase:Proxy Error.
Downloading: http://repository.apache.org/snapshots/org/apache/directory/api/api-ldap-client-api/1.0.0-M32-SNAPSHOT/api-ldap-client-api-1.0.0-M32-SNAPSHOT.pom
[WARNING] The POM for org.apache.directory.api:api-ldap-client-api:jar:1.0.0-M32-SNAPSHOT
is missing, no dependency information available
Downloading: http://repository.apache.org/snapshots/org/apache/directory/api/api-ldap-codec-core/1.0.0-M32-SNAPSHOT/maven-metadata.xml
[WARNING] Could not transfer metadata org.apache.directory.api:api-ldap-codec-core:1.0.0-M32-SNAPSHOT/maven-metadata.xml
from/to Nexus (http://repository.apache.org/snapshots): Failed to transfer file: http://repository.apache.org/snapshots/org/apache/directory/api/api-ldap-codec-core/1.0.0-M32-SNAPSHOT/maven-metadata.xml.
Return code is: 502, ReasonPhrase:Proxy Error.
[WARNING] Failure to transfer org.apache.directory.api:api-ldap-codec-core:1.0.0-M32-SNAPSHOT/maven-metadata.xml
from http://repository.apache.org/snapshots was cached in the local repository, resolution
will not be reattempted until the update interval of Nexus has elapsed or updates are forced.
Original error: Could not transfer metadata org.apache.directory.api:api-ldap-codec-core:1.0.0-M32-SNAPSHOT/maven-metadata.xml
from/to Nexus (http://repository.apache.org/snapshots): Failed to transfer file: http://repository.apache.org/snapshots/org/apache/directory/api/api-ldap-codec-core/1.0.0-M32-SNAPSHOT/maven-metadata.xml.
Return code is: 502, ReasonPhrase:Proxy Error.
Downloading: http://repository.apache.org/snapshots/org/apache/directory/api/api-ldap-codec-core/1.0.0-M32-SNAPSHOT/api-ldap-codec-core-1.0.0-M32-SNAPSHOT.pom
[WARNING] The POM for org.apache.directory.api:api-ldap-codec-core:jar:1.0.0-M32-SNAPSHOT
is missing, no dependency information available
Downloading: http://repository.apache.org/snapshots/org/apache/directory/api/api-ldap-extras-aci/1.0.0-M32-SNAPSHOT/maven-metadata.xml
Downloaded: http://repository.apache.org/snapshots/org/apache/directory/api/api-ldap-extras-aci/1.0.0-M32-SNAPSHOT/maven-metadata.xml
(2 KB at 0.0 KB/sec)
Downloading: http://repository.apache.org/snapshots/org/apache/directory/api/api-ldap-extras-aci/1.0.0-M32-SNAPSHOT/api-ldap-extras-aci-1.0.0-M32-20150815.031627-44.pom
Downloaded: http://repository.apache.org/snapshots/org/apache/directory/api/api-ldap-extras-aci/1.0.0-M32-SNAPSHOT/api-ldap-extras-aci-1.0.0-M32-20150815.031627-44.pom
(5 KB at 6.2 KB/sec)
Downloading: http://repository.apache.org/snapshots/org/apache/directory/api/api-ldap-extras-parent/1.0.0-M32-SNAPSHOT/maven-metadata.xml
Downloaded: http://repository.apache.org/snapshots/org/apache/directory/api/api-ldap-extras-parent/1.0.0-M32-SNAPSHOT/maven-metadata.xml
(849 B at 0.2 KB/sec)
Downloading: http://repository.apache.org/snapshots/org/apache/directory/api/api-ldap-extras-parent/1.0.0-M32-SNAPSHOT/api-ldap-extras-parent-1.0.0-M32-20150815.031126-44.pom
Downloaded: http://repository.apache.org/snapshots/org/apache/directory/api/api-ldap-extras-parent/1.0.0-M32-SNAPSHOT/api-ldap-extras-parent-1.0.0-M32-20150815.031126-44.pom
(2 KB at 1.1 KB/sec)
Downloading: http://repository.apache.org/snapshots/org/apache/directory/api/api-ldap-parent/1.0.0-M32-SNAPSHOT/maven-metadata.xml
[WARNING] Could not transfer metadata org.apache.directory.api:api-ldap-parent:1.0.0-M32-SNAPSHOT/maven-metadata.xml
from/to Nexus (http://repository.apache.org/snapshots): Failed to transfer file: http://repository.apache.org/snapshots/org/apache/directory/api/api-ldap-parent/1.0.0-M32-SNAPSHOT/maven-metadata.xml.
Return code is: 502, ReasonPhrase:Proxy Error.
Downloading: http://repository.apache.org/snapshots/org/apache/directory/api/api-ldap-parent/1.0.0-M32-SNAPSHOT/api-ldap-parent-1.0.0-M32-SNAPSHOT.pom
Downloading: http://repository.apache.org/snapshots/org/apache/directory/api/api-ldap-extras-util/1.0.0-M32-SNAPSHOT/maven-metadata.xml
Downloaded: http://repository.apache.org/snapshots/org/apache/directory/api/api-ldap-extras-util/1.0.0-M32-SNAPSHOT/maven-metadata.xml
(2 KB at 0.0 KB/sec)
Downloading: http://repository.apache.org/snapshots/org/apache/directory/api/api-ldap-extras-util/1.0.0-M32-SNAPSHOT/api-ldap-extras-util-1.0.0-M32-20150815.031937-44.pom
Downloaded: http://repository.apache.org/snapshots/org/apache/directory/api/api-ldap-extras-util/1.0.0-M32-SNAPSHOT/api-ldap-extras-util-1.0.0-M32-20150815.031937-44.pom
(4 KB at 4.3 KB/sec)
Downloading: http://repository.apache.org/snapshots/org/apache/directory/api/api-ldap-parent/1.0.0-M32-SNAPSHOT/api-ldap-parent-1.0.0-M32-SNAPSHOT.pom
Downloading: http://repository.apache.org/snapshots/org/apache/directory/api/api-ldap-model/1.0.0-M32-SNAPSHOT/maven-metadata.xml
Downloaded: http://repository.apache.org/snapshots/org/apache/directory/api/api-ldap-model/1.0.0-M32-SNAPSHOT/maven-metadata.xml
(1022 B at 0.3 KB/sec)
Downloading: http://repository.apache.org/snapshots/org/apache/directory/api/api-ldap-model/1.0.0-M32-SNAPSHOT/api-ldap-model-1.0.0-M32-20150815.030804-44.pom
Downloaded: http://repository.apache.org/snapshots/org/apache/directory/api/api-ldap-model/1.0.0-M32-SNAPSHOT/api-ldap-model-1.0.0-M32-20150815.030804-44.pom
(9 KB at 4.6 KB/sec)
Downloading: http://repository.apache.org/snapshots/org/apache/directory/api/api-ldap-parent/1.0.0-M32-SNAPSHOT/api-ldap-parent-1.0.0-M32-SNAPSHOT.pom
Downloading: http://repository.apache.org/snapshots/org/apache/directory/api/api-ldap-schema-data/1.0.0-M32-SNAPSHOT/maven-metadata.xml
[WARNING] Could not transfer metadata org.apache.directory.api:api-ldap-schema-data:1.0.0-M32-SNAPSHOT/maven-metadata.xml
from/to Nexus (http://repository.apache.org/snapshots): Failed to transfer file: http://repository.apache.org/snapshots/org/apache/directory/api/api-ldap-schema-data/1.0.0-M32-SNAPSHOT/maven-metadata.xml.
Return code is: 502, ReasonPhrase:Proxy Error.
[WARNING] Failure to transfer org.apache.directory.api:api-ldap-schema-data:1.0.0-M32-SNAPSHOT/maven-metadata.xml
from http://repository.apache.org/snapshots was cached in the local repository, resolution
will not be reattempted until the update interval of Nexus has elapsed or updates are forced.
Original error: Could not transfer metadata org.apache.directory.api:api-ldap-schema-data:1.0.0-M32-SNAPSHOT/maven-metadata.xml
from/to Nexus (http://repository.apache.org/snapshots): Failed to transfer file: http://repository.apache.org/snapshots/org/apache/directory/api/api-ldap-schema-data/1.0.0-M32-SNAPSHOT/maven-metadata.xml.
Return code is: 502, ReasonPhrase:Proxy Error.
Downloading: http://repository.apache.org/snapshots/org/apache/directory/api/api-ldap-schema-data/1.0.0-M32-SNAPSHOT/api-ldap-schema-data-1.0.0-M32-SNAPSHOT.pom
[WARNING] The POM for org.apache.directory.api:api-ldap-schema-data:jar:1.0.0-M32-SNAPSHOT
is missing, no dependency information available
Downloading: http://repository.apache.org/snapshots/org/apache/directory/api/api-util/1.0.0-M32-SNAPSHOT/maven-metadata.xml
Downloaded: http://repository.apache.org/snapshots/org/apache/directory/api/api-util/1.0.0-M32-SNAPSHOT/maven-metadata.xml
(1016 B at 0.0 KB/sec)
Downloading: http://repository.apache.org/snapshots/org/apache/directory/api/api-util/1.0.0-M32-SNAPSHOT/api-util-1.0.0-M32-20150815.030457-45.pom
Downloaded: http://repository.apache.org/snapshots/org/apache/directory/api/api-util/1.0.0-M32-SNAPSHOT/api-util-1.0.0-M32-20150815.030457-45.pom
(3 KB at 1.5 KB/sec)
Downloading: http://repo.maven.apache.org/maven2/org/apache/mina/mina-core/2.0.9/mina-core-2.0.9.pom
Downloaded: http://repo.maven.apache.org/maven2/org/apache/mina/mina-core/2.0.9/mina-core-2.0.9.pom
(7 KB at 158.2 KB/sec)
Downloading: http://repo.maven.apache.org/maven2/org/apache/mina/mina-parent/2.0.9/mina-parent-2.0.9.pom
Downloaded: http://repo.maven.apache.org/maven2/org/apache/mina/mina-parent/2.0.9/mina-parent-2.0.9.pom
(33 KB at 821.8 KB/sec)
Downloading: http://repo.maven.apache.org/maven2/net/sf/ehcache/ehcache/2.8.5/ehcache-2.8.5.pom
Downloaded: http://repo.maven.apache.org/maven2/net/sf/ehcache/ehcache/2.8.5/ehcache-2.8.5.pom
(19 KB at 491.0 KB/sec)
Downloading: http://repo.maven.apache.org/maven2/net/sf/ehcache/ehcache-root/2.8.5/ehcache-root-2.8.5.pom
Downloaded: http://repo.maven.apache.org/maven2/net/sf/ehcache/ehcache-root/2.8.5/ehcache-root-2.8.5.pom
(17 KB at 427.7 KB/sec)
Downloading: http://repo.maven.apache.org/maven2/net/sf/ehcache/ehcache-parent/2.16/ehcache-parent-2.16.pom
Downloaded: http://repo.maven.apache.org/maven2/net/sf/ehcache/ehcache-parent/2.16/ehcache-parent-2.16.pom
(17 KB at 417.7 KB/sec)
[JENKINS] Archiving disabled
[INFO] ------------------------------------------------------------------------
[INFO] Reactor Summary:
[INFO] 
[INFO] ApacheDS .......................................... SUCCESS [1:38.661s]
[INFO] ApacheDS I18n ..................................... SUCCESS [1:56.639s]
[INFO] ApacheDS Core Constants ........................... SUCCESS [2:12.334s]
[INFO] ApacheDS Core API ................................. FAILURE [7:07.930s]
[INFO] ApacheDS Core Shared .............................. SKIPPED
[INFO] ApacheDS Interceptors ............................. SKIPPED
[INFO] ApacheDS AdministrativePoint Interceptor .......... SKIPPED
[INFO] ApacheDS Authentication Interceptor ............... SKIPPED
[INFO] ApacheDS Interceptor to increment numeric attributes  SKIPPED
[INFO] ApacheDS Authorization Interceptor ................ SKIPPED
[INFO] ApacheDS ChangeLog Interceptor .................... SKIPPED
[INFO] ApacheDS Collective Attribute Interceptor ......... SKIPPED
[INFO] ApacheDS Event Interceptor ........................ SKIPPED
[INFO] ApacheDS Exception Interceptor .................... SKIPPED
[INFO] ApacheDS Journal Interceptor ...................... SKIPPED
[INFO] ApacheDS Normalization Interceptor ................ SKIPPED
[INFO] ApacheDS Operational Attribute Interceptor ........ SKIPPED
[INFO] ApacheDS Referral Interceptor ..................... SKIPPED
[INFO] ApacheDS Schema Interceptor ....................... SKIPPED
[INFO] ApacheDS Subtree Interceptor ...................... SKIPPED
[INFO] ApacheDS Triggers Interceptor ..................... SKIPPED
[INFO] ApacheDS Core ..................................... SKIPPED
[INFO] ApacheDS Core AVL ................................. SKIPPED
[INFO] ApacheDS Generalized (X) DBM Partition ............ SKIPPED
[INFO] ApacheDS LDIF Partition ........................... SKIPPED
[INFO] ApacheDS JDBM Partition ........................... SKIPPED
[INFO] ApacheDS Mavibot Partition ........................ SKIPPED
[INFO] ApacheDS Core Annotations ......................... SKIPPED
[INFO] ApacheDS Core JNDI ................................ SKIPPED
[INFO] ApacheDS Protocol Kerberos Codec .................. SKIPPED
[INFO] ApacheDS Interceptors for Kerberos ................ SKIPPED
[INFO] ApacheDS Protocol Dhcp ............................ SKIPPED
[INFO] ApacheDS Protocol Shared .......................... SKIPPED
[INFO] ApacheDS Protocol Dns ............................. SKIPPED
[INFO] ApacheDS Protocol Kerberos ........................ SKIPPED
[INFO] ApacheDS Protocol Ldap ............................ SKIPPED
[INFO] ApacheDS Protocol Ntp ............................. SKIPPED
[INFO] Apacheds Server Annotations ....................... SKIPPED
[INFO] ApacheDS Server Config ............................ SKIPPED
[INFO] ApacheDS Server JNDI .............................. SKIPPED
[INFO] ApacheDS Test Framework ........................... SKIPPED
[INFO] ApacheDS All ...................................... SKIPPED
[INFO] ApacheDS Logger Interceptor ....................... SKIPPED
[INFO] ApacheDS Password Hashing Interceptor ............. SKIPPED
[INFO] ApacheDS Core Integration ......................... SKIPPED
[INFO] ApacheDS Protocol Kerberos Test ................... SKIPPED
[INFO] ApacheDS Server Integration ....................... SKIPPED
[INFO] ApacheDS DirectoryService-WebApp bridge ........... SKIPPED
[INFO] ApacheDS Jetty HTTP Server Integration ............ SKIPPED
[INFO] ApacheDS Service Builder .......................... SKIPPED
[INFO] Apache Directory LDAP Client API test ............. SKIPPED
[INFO] kerberos-client ................................... SKIPPED
[INFO] ApacheDS Service .................................. SKIPPED
[INFO] ApacheDS Wrapper .................................. SKIPPED
[INFO] ApacheDS Installers Maven Plugin .................. SKIPPED
[INFO] ApacheDS Installers ............................... SKIPPED
[INFO] ApacheDS OSGi Integration Tests ................... SKIPPED
[INFO] ------------------------------------------------------------------------
[INFO] BUILD FAILURE
[INFO] ------------------------------------------------------------------------
[INFO] Total time: 13:10.597s
[INFO] Finished at: Sat Aug 15 04:20:57 UTC 2015
[INFO] Final Memory: 37M/209M
[INFO] ------------------------------------------------------------------------
[JENKINS] Archiving disabled
[JENKINS] Archiving disabled
[JENKINS] Archiving disabled
[JENKINS] Archiving disabled
[JENKINS] Archiving disabled
[JENKINS] Archiving disabled
[JENKINS] Archiving disabled
[JENKINS] Archiving disabled
[JENKINS] Archiving disabled
[JENKINS] Archiving disabled
[JENKINS] Archiving disabled
[JENKINS] Archiving disabled
[JENKINS] Archiving disabled
[JENKINS] Archiving disabled
[JENKINS] Archiving disabled
[JENKINS] Archiving disabled
[JENKINS] Archiving disabled
[JENKINS] Archiving disabled
[JENKINS] Archiving disabled
[JENKINS] Archiving disabled
[JENKINS] Archiving disabled
[JENKINS] Archiving disabled
[JENKINS] Archiving disabled
[JENKINS] Archiving disabled
[JENKINS] Archiving disabled
[JENKINS] Archiving disabled
[JENKINS] Archiving disabled
[JENKINS] Archiving disabled
[JENKINS] Archiving disabled
[JENKINS] Archiving disabled
[JENKINS] Archiving disabled
[JENKINS] Archiving disabled
[JENKINS] Archiving disabled
[JENKINS] Archiving disabled
[JENKINS] Archiving disabled
[JENKINS] Archiving disabled
[JENKINS] Archiving disabled
[JENKINS] Archiving disabled
[JENKINS] Archiving disabled
[JENKINS] Archiving disabled
[JENKINS] Archiving disabled
[JENKINS] Archiving disabled
[JENKINS] Archiving disabled
[JENKINS] Archiving disabled
[JENKINS] Archiving disabled
[JENKINS] Archiving disabled
[JENKINS] Archiving disabled
[JENKINS] Archiving disabled
[JENKINS] Archiving disabled
[JENKINS] Archiving disabled
[JENKINS] Archiving disabled
[JENKINS] Archiving disabled
[JENKINS] Archiving disabled
[JENKINS] Archiving disabled
[JENKINS] Archiving disabled
[JENKINS] Archiving disabled
[JENKINS] Archiving disabled
Waiting for Jenkins to finish collecting data
[ERROR] Failed to execute goal on project apacheds-core-api: Could not resolve dependencies
for project org.apache.directory.server:apacheds-core-api:bundle:2.0.0-M21-SNAPSHOT: Failed
to collect dependencies for [org.apache.directory.junit:junit-addons:jar:0.1 (test), commons-lang:commons-lang:jar:2.6
(compile), commons-io:commons-io:jar:2.4 (compile), org.apache.directory.server:apacheds-core-constants:jar:2.0.0-M21-SNAPSHOT
(compile), org.apache.directory.server:apacheds-i18n:jar:2.0.0-M21-SNAPSHOT (compile), org.apache.directory.api:api-i18n:jar:1.0.0-M32-SNAPSHOT
(compile), org.apache.directory.api:api-asn1-api:jar:1.0.0-M32-SNAPSHOT (compile), org.apache.directory.api:api-ldap-client-api:jar:1.0.0-M32-SNAPSHOT
(compile), org.apache.directory.api:api-ldap-codec-core:jar:1.0.0-M32-SNAPSHOT (compile),
org.apache.directory.api:api-ldap-extras-aci:jar:1.0.0-M32-SNAPSHOT (compile), org.apache.directory.api:api-ldap-extras-util:jar:1.0.0-M32-SNAPSHOT
(compile), org.apache.directory.api:api-ldap-model:jar:1.0.0-M32-SNAPSHOT (compile), org.apache.directory.api:api-ldap-schema-data:jar:1.0.0-M32-SNAPSHOT
(compile), org.apache.directory.api:api-util:jar:1.0.0-M32-SNAPSHOT (compile), org.apache.mina:mina-core:jar:2.0.9
(compile), net.sf.ehcache:ehcache:jar:2.8.5 (compile), findbugs:annotations:jar:1.0.0 (provided),
org.slf4j:slf4j-api:jar:1.7.10 (compile), org.slf4j:slf4j-log4j12:jar:1.7.10 (test), junit:junit:jar:4.12
(test)]: Failed to read artifact descriptor for org.apache.directory.api:api-ldap-extras-aci:jar:1.0.0-M32-SNAPSHOT:
Could not find artifact org.apache.directory.api:api-ldap-parent:pom:1.0.0-M32-SNAPSHOT in
Nexus (http://repository.apache.org/snapshots) -> [Help 1]
[ERROR] 
[ERROR] To see the full stack trace of the errors, re-run Maven with the -e switch.
[ERROR] Re-run Maven using the -X switch to enable full debug logging.
[ERROR] 
[ERROR] For more information about the errors and possible solutions, please read the following
articles:
[ERROR] [Help 1] http://cwiki.apache.org/confluence/display/MAVEN/DependencyResolutionException
[ERROR] 
[ERROR] After correcting the problems, you can resume the build with the command
[ERROR]   mvn <goals> -rf :apacheds-core-api
channel stopped

Mime
View raw message