directory-notifications mailing list archives

Site index · List index
Message view « Date » · « Thread »
Top « Date » · « Thread »
From Apache Jenkins Server <jenk...@builds.apache.org>
Subject Build failed in Jenkins: dir-apacheds-ubuntu-deploy #1768
Date Sat, 18 Jul 2015 04:52:05 GMT
See <https://builds.apache.org/job/dir-apacheds-ubuntu-deploy/1768/>

------------------------------------------
[...truncated 4068 lines...]
Running org.apache.directory.server.core.jndi.RootDSEJndiIT
Tests run: 8, Failures: 0, Errors: 0, Skipped: 0, Time elapsed: 9.577 sec - in org.apache.directory.server.core.jndi.RootDSEJndiIT
Running org.apache.directory.server.core.jndi.MixedCaseIT
Tests run: 4, Failures: 0, Errors: 0, Skipped: 0, Time elapsed: 22.17 sec - in org.apache.directory.server.core.jndi.MixedCaseIT
Running org.apache.directory.server.core.jndi.ObjStateFactoryIT
Tests run: 2, Failures: 0, Errors: 0, Skipped: 0, Time elapsed: 12.196 sec - in org.apache.directory.server.core.jndi.ObjStateFactoryIT
Running org.apache.directory.server.core.jndi.ModifyContextIT
Tests run: 3, Failures: 0, Errors: 0, Skipped: 0, Time elapsed: 25.727 sec - in org.apache.directory.server.core.jndi.ModifyContextIT
Running org.apache.directory.server.core.jndi.AddJndiIT
Tests run: 4, Failures: 0, Errors: 0, Skipped: 0, Time elapsed: 12.03 sec - in org.apache.directory.server.core.jndi.AddJndiIT
Running org.apache.directory.server.core.jndi.ExtensibleObjectIT
Tests run: 2, Failures: 0, Errors: 0, Skipped: 0, Time elapsed: 12.765 sec - in org.apache.directory.server.core.jndi.ExtensibleObjectIT
Running org.apache.directory.server.core.jndi.UniqueMemberIT
Tests run: 8, Failures: 0, Errors: 0, Skipped: 0, Time elapsed: 16.504 sec - in org.apache.directory.server.core.jndi.UniqueMemberIT
Running org.apache.directory.server.core.jndi.SimpleBindJndiIT
Tests run: 9, Failures: 0, Errors: 0, Skipped: 0, Time elapsed: 8.962 sec - in org.apache.directory.server.core.jndi.SimpleBindJndiIT
Running org.apache.directory.server.core.jndi.DestroyContextIT
Tests run: 1, Failures: 0, Errors: 0, Skipped: 0, Time elapsed: 16.53 sec - in org.apache.directory.server.core.jndi.DestroyContextIT
Running org.apache.directory.server.core.jndi.ListIT
Tests run: 4, Failures: 0, Errors: 0, Skipped: 0, Time elapsed: 12.022 sec - in org.apache.directory.server.core.jndi.ListIT
Running org.apache.directory.server.core.jndi.CreateContextIT
Tests run: 8, Failures: 0, Errors: 0, Skipped: 0, Time elapsed: 24.243 sec - in org.apache.directory.server.core.jndi.CreateContextIT
Running org.apache.directory.server.core.jndi.RFC2713IT
Tests run: 1, Failures: 0, Errors: 0, Skipped: 0, Time elapsed: 9.899 sec - in org.apache.directory.server.core.jndi.RFC2713IT
Running org.apache.directory.server.core.jndi.DIRSERVER791IT
Tests run: 4, Failures: 0, Errors: 0, Skipped: 0, Time elapsed: 14.263 sec - in org.apache.directory.server.core.jndi.DIRSERVER791IT
Running org.apache.directory.server.core.jndi.referral.ModifyReferralIT
Tests run: 10, Failures: 0, Errors: 0, Skipped: 0, Time elapsed: 13.352 sec - in org.apache.directory.server.core.jndi.referral.ModifyReferralIT
Running org.apache.directory.server.core.jndi.referral.AddReferralIT
Tests run: 6, Failures: 0, Errors: 0, Skipped: 0, Time elapsed: 14.759 sec - in org.apache.directory.server.core.jndi.referral.AddReferralIT
Running org.apache.directory.server.core.jndi.referral.CompareReferralIT
Tests run: 10, Failures: 0, Errors: 0, Skipped: 0, Time elapsed: 12.1 sec - in org.apache.directory.server.core.jndi.referral.CompareReferralIT
Running org.apache.directory.server.core.jndi.referral.DeleteReferralIT
Tests run: 8, Failures: 0, Errors: 0, Skipped: 0, Time elapsed: 15.335 sec - in org.apache.directory.server.core.jndi.referral.DeleteReferralIT
Running org.apache.directory.server.core.jndi.referral.RenameReferralIT
Tests run: 9, Failures: 0, Errors: 0, Skipped: 0, Time elapsed: 14.452 sec - in org.apache.directory.server.core.jndi.referral.RenameReferralIT
Running org.apache.directory.server.core.jndi.referral.RenameReferralIgnoreIT
Tests run: 6, Failures: 0, Errors: 0, Skipped: 0, Time elapsed: 15.559 sec - in org.apache.directory.server.core.jndi.referral.RenameReferralIgnoreIT
Running org.apache.directory.server.core.jndi.referral.MoveReferralIT
Tests run: 14, Failures: 0, Errors: 0, Skipped: 0, Time elapsed: 14.795 sec - in org.apache.directory.server.core.jndi.referral.MoveReferralIT
Running org.apache.directory.server.core.jndi.referral.MoveAndRenameReferralIT
Tests run: 12, Failures: 0, Errors: 0, Skipped: 0, Time elapsed: 16.211 sec - in org.apache.directory.server.core.jndi.referral.MoveAndRenameReferralIT
Running org.apache.directory.server.core.jndi.referral.SearchReferralIT
Tests run: 10, Failures: 0, Errors: 0, Skipped: 0, Time elapsed: 13.791 sec - in org.apache.directory.server.core.jndi.referral.SearchReferralIT
Running org.apache.directory.server.core.jndi.DIRSERVER169IT
Tests run: 2, Failures: 0, Errors: 0, Skipped: 0, Time elapsed: 13.436 sec - in org.apache.directory.server.core.jndi.DIRSERVER169IT
Running org.apache.directory.server.core.jndi.ReferralIT
Tests run: 33, Failures: 0, Errors: 0, Skipped: 0, Time elapsed: 160.292 sec - in org.apache.directory.server.core.jndi.ReferralIT
Running org.apache.directory.server.core.schema.MetaSyntaxHandlerIT
Tests run: 18, Failures: 0, Errors: 0, Skipped: 12, Time elapsed: 10.016 sec - in org.apache.directory.server.core.schema.MetaSyntaxHandlerIT
Running org.apache.directory.server.core.schema.MetaObjectClassHandlerIT
Tests run: 27, Failures: 0, Errors: 0, Skipped: 12, Time elapsed: 9.485 sec - in org.apache.directory.server.core.schema.MetaObjectClassHandlerIT
Running org.apache.directory.server.core.schema.SchemaPersistenceIT
Tests run: 2, Failures: 0, Errors: 0, Skipped: 0, Time elapsed: 20.727 sec - in org.apache.directory.server.core.schema.SchemaPersistenceIT
Running org.apache.directory.server.core.schema.MetaSyntaxCheckerHandlerIT
Tests run: 20, Failures: 0, Errors: 0, Skipped: 12, Time elapsed: 8.997 sec - in org.apache.directory.server.core.schema.MetaSyntaxCheckerHandlerIT
Running org.apache.directory.server.core.schema.MetaNormalizerHandlerIT
Tests run: 20, Failures: 0, Errors: 0, Skipped: 12, Time elapsed: 9.975 sec - in org.apache.directory.server.core.schema.MetaNormalizerHandlerIT
Running org.apache.directory.server.core.schema.ObjectClassCreateIT
Tests run: 4, Failures: 0, Errors: 0, Skipped: 0, Time elapsed: 12.737 sec - in org.apache.directory.server.core.schema.ObjectClassCreateIT
Running org.apache.directory.server.core.schema.SubschemaSubentryIT
Tests run: 18, Failures: 0, Errors: 0, Skipped: 1, Time elapsed: 36.103 sec - in org.apache.directory.server.core.schema.SubschemaSubentryIT
Running org.apache.directory.server.core.schema.SchemaServiceIT
Tests run: 23, Failures: 0, Errors: 0, Skipped: 0, Time elapsed: 14.897 sec - in org.apache.directory.server.core.schema.SchemaServiceIT
Running org.apache.directory.server.core.schema.MetaSchemaHandlerIT
Tests run: 29, Failures: 0, Errors: 0, Skipped: 16, Time elapsed: 8.33 sec - in org.apache.directory.server.core.schema.MetaSchemaHandlerIT
Running org.apache.directory.server.core.schema.PartitionSchemaLoaderIT
Tests run: 1, Failures: 0, Errors: 0, Skipped: 0, Time elapsed: 0.429 sec - in org.apache.directory.server.core.schema.PartitionSchemaLoaderIT
Running org.apache.directory.server.core.schema.MetaComparatorHandlerIT
Tests run: 20, Failures: 0, Errors: 0, Skipped: 12, Time elapsed: 9.61 sec - in org.apache.directory.server.core.schema.MetaComparatorHandlerIT
Running org.apache.directory.server.core.schema.MetaAttributeTypeHandlerIT
Tests run: 19, Failures: 0, Errors: 0, Skipped: 11, Time elapsed: 8.094 sec - in org.apache.directory.server.core.schema.MetaAttributeTypeHandlerIT
Running org.apache.directory.server.core.schema.MetaMatchingRuleHandlerIT
Tests run: 14, Failures: 0, Errors: 0, Skipped: 9, Time elapsed: 7.948 sec - in org.apache.directory.server.core.schema.MetaMatchingRuleHandlerIT
Running org.apache.directory.server.core.authz.MoveRenameAuthorizationIT
Tests run: 5, Failures: 0, Errors: 0, Skipped: 0, Time elapsed: 337.342 sec - in org.apache.directory.server.core.authz.MoveRenameAuthorizationIT
Running org.apache.directory.server.core.authz.CompareAuthorizationIT
Tests run: 5, Failures: 0, Errors: 0, Skipped: 0, Time elapsed: 72.579 sec - in org.apache.directory.server.core.authz.CompareAuthorizationIT
Running org.apache.directory.server.core.authz.support.MaxImmSubFilterIT
Tests run: 5, Failures: 0, Errors: 0, Skipped: 1, Time elapsed: 7.876 sec - in org.apache.directory.server.core.authz.support.MaxImmSubFilterIT
Running org.apache.directory.server.core.authz.GeneralAuthorizationIT
Tests run: 1, Failures: 0, Errors: 0, Skipped: 0, Time elapsed: 8.737 sec - in org.apache.directory.server.core.authz.GeneralAuthorizationIT
Running org.apache.directory.server.core.authz.LookupAuthorizationIT
Tests run: 1, Failures: 0, Errors: 0, Skipped: 0, Time elapsed: 19.565 sec - in org.apache.directory.server.core.authz.LookupAuthorizationIT
Running org.apache.directory.server.core.authz.SearchAuthorizationIT
Tests run: 16, Failures: 0, Errors: 0, Skipped: 1, Time elapsed: 309.875 sec - in org.apache.directory.server.core.authz.SearchAuthorizationIT
Running org.apache.directory.server.core.authz.AdministratorsGroupIT
Tests run: 2, Failures: 0, Errors: 0, Skipped: 0, Time elapsed: 26.732 sec - in org.apache.directory.server.core.authz.AdministratorsGroupIT
Running org.apache.directory.server.core.authz.AddAuthorizationIT
Tests run: 4, Failures: 0, Errors: 0, Skipped: 0, Time elapsed: 32.646 sec - in org.apache.directory.server.core.authz.AddAuthorizationIT
Running org.apache.directory.server.core.authz.AuthorizationServiceAsNonAdminIT
Tests run: 4, Failures: 0, Errors: 0, Skipped: 0, Time elapsed: 12.374 sec - in org.apache.directory.server.core.authz.AuthorizationServiceAsNonAdminIT
Running org.apache.directory.server.core.authz.AuthzAuthnIT
Tests run: 3, Failures: 0, Errors: 0, Skipped: 0, Time elapsed: 14.122 sec - in org.apache.directory.server.core.authz.AuthzAuthnIT
Running org.apache.directory.server.core.authz.DeleteAuthorizationIT
Tests run: 4, Failures: 0, Errors: 0, Skipped: 0, Time elapsed: 71.568 sec - in org.apache.directory.server.core.authz.DeleteAuthorizationIT
Running org.apache.directory.server.core.authz.ModifyAuthorizationIT
Tests run: 7, Failures: 0, Errors: 0, Skipped: 0, Time elapsed: 292.043 sec - in org.apache.directory.server.core.authz.ModifyAuthorizationIT
Running org.apache.directory.server.core.authz.AuthorizationServiceAsAdminIT
Tests run: 4, Failures: 0, Errors: 0, Skipped: 0, Time elapsed: 8.58 sec - in org.apache.directory.server.core.authz.AuthorizationServiceAsAdminIT
Running org.apache.directory.server.core.authn.SimpleAuthenticationIT
Tests run: 12, Failures: 0, Errors: 0, Skipped: 0, Time elapsed: 19.773 sec - in org.apache.directory.server.core.authn.SimpleAuthenticationIT
Running org.apache.directory.server.core.collective.CollectiveAttributeServiceIT
Killed

Results :

Tests run: 496, Failures: 0, Errors: 0, Skipped: 102

[JENKINS] Recording test results
[JENKINS] Archiving disabled
[INFO] ------------------------------------------------------------------------
[INFO] Reactor Summary:
[INFO] 
[INFO] ApacheDS .......................................... SUCCESS [6.395s]
[INFO] ApacheDS I18n ..................................... SUCCESS [10.694s]
[INFO] ApacheDS Core Constants ........................... SUCCESS [6.964s]
[INFO] ApacheDS Core API ................................. SUCCESS [30.001s]
[INFO] ApacheDS Core Shared .............................. SUCCESS [8.855s]
[INFO] ApacheDS Interceptors ............................. SUCCESS [1.537s]
[INFO] ApacheDS AdministrativePoint Interceptor .......... SUCCESS [7.535s]
[INFO] ApacheDS Authentication Interceptor ............... SUCCESS [8.731s]
[INFO] ApacheDS Interceptor to increment numeric attributes  SUCCESS [7.735s]
[INFO] ApacheDS Authorization Interceptor ................ SUCCESS [10.046s]
[INFO] ApacheDS ChangeLog Interceptor .................... SUCCESS [9.108s]
[INFO] ApacheDS Collective Attribute Interceptor ......... SUCCESS [6.760s]
[INFO] ApacheDS Event Interceptor ........................ SUCCESS [5.990s]
[INFO] ApacheDS Exception Interceptor .................... SUCCESS [6.262s]
[INFO] ApacheDS Journal Interceptor ...................... SUCCESS [6.935s]
[INFO] ApacheDS Normalization Interceptor ................ SUCCESS [9.486s]
[INFO] ApacheDS Operational Attribute Interceptor ........ SUCCESS [7.048s]
[INFO] ApacheDS Referral Interceptor ..................... SUCCESS [7.768s]
[INFO] ApacheDS Schema Interceptor ....................... SUCCESS [9.685s]
[INFO] ApacheDS Subtree Interceptor ...................... SUCCESS [10.412s]
[INFO] ApacheDS Triggers Interceptor ..................... SUCCESS [7.297s]
[INFO] ApacheDS Core ..................................... SUCCESS [10.680s]
[INFO] ApacheDS Core AVL ................................. SUCCESS [13.581s]
[INFO] ApacheDS Generalized (X) DBM Partition ............ SUCCESS [20.506s]
[INFO] ApacheDS LDIF Partition ........................... SUCCESS [25.141s]
[INFO] ApacheDS JDBM Partition ........................... SUCCESS [1:27.891s]
[INFO] ApacheDS Mavibot Partition ........................ SUCCESS [19.260s]
[INFO] ApacheDS Core Annotations ......................... SUCCESS [1:26.823s]
[INFO] ApacheDS Core JNDI ................................ SUCCESS [8.253s]
[INFO] ApacheDS Protocol Kerberos Codec .................. SUCCESS [20.750s]
[INFO] ApacheDS Interceptors for Kerberos ................ SUCCESS [11.913s]
[INFO] ApacheDS Protocol Dhcp ............................ SUCCESS [10.583s]
[INFO] ApacheDS Protocol Shared .......................... SUCCESS [7.832s]
[INFO] ApacheDS Protocol Dns ............................. SUCCESS [11.089s]
[INFO] ApacheDS Protocol Kerberos ........................ SUCCESS [12.509s]
[INFO] ApacheDS Protocol Ldap ............................ SUCCESS [2:21.479s]
[INFO] ApacheDS Protocol Ntp ............................. SUCCESS [7.972s]
[INFO] Apacheds Server Annotations ....................... SUCCESS [1:32.479s]
[INFO] ApacheDS Server Config ............................ SUCCESS [15.906s]
[INFO] ApacheDS Server JNDI .............................. SUCCESS [9.200s]
[INFO] ApacheDS Test Framework ........................... SUCCESS [2:56.741s]
[INFO] ApacheDS All ...................................... SUCCESS [12.280s]
[INFO] ApacheDS Logger Interceptor ....................... SUCCESS [31.760s]
[INFO] ApacheDS Password Hashing Interceptor ............. SUCCESS [7.217s]
[INFO] ApacheDS Core Integration ......................... FAILURE [33:15.552s]
[INFO] ApacheDS Protocol Kerberos Test ................... SKIPPED
[INFO] ApacheDS Server Integration ....................... SKIPPED
[INFO] ApacheDS DirectoryService-WebApp bridge ........... SKIPPED
[INFO] ApacheDS Jetty HTTP Server Integration ............ SKIPPED
[INFO] ApacheDS Service Builder .......................... SKIPPED
[INFO] Apache Directory LDAP Client API test ............. SKIPPED
[INFO] kerberos-client ................................... SKIPPED
[INFO] ApacheDS Service .................................. SKIPPED
[INFO] ApacheDS Wrapper .................................. SKIPPED
[INFO] ApacheDS Installers Maven Plugin .................. SKIPPED
[INFO] ApacheDS Installers ............................... SKIPPED
[INFO] ApacheDS OSGi Integration Tests ................... SKIPPED
[INFO] ------------------------------------------------------------------------
[INFO] BUILD FAILURE
[INFO] ------------------------------------------------------------------------
[INFO] Total time: 50:47.262s
[INFO] Finished at: Sat Jul 18 04:52:10 UTC 2015
[INFO] Final Memory: 56M/392M
[INFO] ------------------------------------------------------------------------
[JENKINS] Archiving disabled
[JENKINS] Archiving disabled
[JENKINS] Archiving disabled
[JENKINS] Archiving disabled
[JENKINS] Archiving disabled
[JENKINS] Archiving disabled
[JENKINS] Archiving disabled
[JENKINS] Archiving disabled
[JENKINS] Archiving disabled
[JENKINS] Archiving disabled
[JENKINS] Archiving disabled
[JENKINS] Archiving disabled
[JENKINS] Archiving disabled
[JENKINS] Archiving disabled
[JENKINS] Archiving disabled
[JENKINS] Archiving disabled
[JENKINS] Archiving disabled
[JENKINS] Archiving disabled
[JENKINS] Archiving disabled
[JENKINS] Archiving disabled
[JENKINS] Archiving disabled
[JENKINS] Archiving disabled
[JENKINS] Archiving disabled
[JENKINS] Archiving disabled
[JENKINS] Archiving disabled
[JENKINS] Archiving disabled
[JENKINS] Archiving disabled
[JENKINS] Archiving disabled
[JENKINS] Archiving disabled
[JENKINS] Archiving disabled
[JENKINS] Archiving disabled
[JENKINS] Archiving disabled
[JENKINS] Archiving disabled
[JENKINS] Archiving disabled
[JENKINS] Archiving disabled
[JENKINS] Archiving disabled
[JENKINS] Archiving disabled
[JENKINS] Archiving disabled
[JENKINS] Archiving disabled
[JENKINS] Archiving disabled
[JENKINS] Archiving disabled
[JENKINS] Archiving disabled
[JENKINS] Archiving disabled
[JENKINS] Archiving disabled
[JENKINS] Archiving disabled
[JENKINS] Archiving disabled
[JENKINS] Archiving disabled
[JENKINS] Archiving disabled
[JENKINS] Archiving disabled
[JENKINS] Archiving disabled
[JENKINS] Archiving disabled
[JENKINS] Archiving disabled
[JENKINS] Archiving disabled
[JENKINS] Archiving disabled
[JENKINS] Archiving disabled
[JENKINS] Archiving disabled
[JENKINS] Archiving disabled
Waiting for Jenkins to finish collecting data
[ERROR] Failed to execute goal org.apache.maven.plugins:maven-surefire-plugin:2.18.1:test
(default-test) on project apacheds-core-integ: Execution default-test of goal org.apache.maven.plugins:maven-surefire-plugin:2.18.1:test
failed: The forked VM terminated without properly saying goodbye. VM crash or System.exit
called?
[ERROR] Command was /bin/sh -c cd <https://builds.apache.org/job/dir-apacheds-ubuntu-deploy/ws/trunk/core-integ>
&& /home/jenkins/tools/java/jdk1.7.0_25-32/jre/bin/java -Xmx1024m -jar <https://builds.apache.org/job/dir-apacheds-ubuntu-deploy/ws/trunk/core-integ/target/surefire/surefirebooter3382352378468002012.jar>
<https://builds.apache.org/job/dir-apacheds-ubuntu-deploy/ws/trunk/core-integ/target/surefire/surefire8159911486268063790tmp>
<https://builds.apache.org/job/dir-apacheds-ubuntu-deploy/ws/trunk/core-integ/target/surefire/surefire_257724436177927358975tmp>
[ERROR] -> [Help 1]
[ERROR] 
[ERROR] To see the full stack trace of the errors, re-run Maven with the -e switch.
[ERROR] Re-run Maven using the -X switch to enable full debug logging.
[ERROR] 
[ERROR] For more information about the errors and possible solutions, please read the following
articles:
[ERROR] [Help 1] http://cwiki.apache.org/confluence/display/MAVEN/PluginExecutionException
[ERROR] 
[ERROR] After correcting the problems, you can resume the build with the command
[ERROR]   mvn <goals> -rf :apacheds-core-integ
channel stopped

Mime
View raw message