directory-notifications mailing list archives

Site index · List index
Message view « Date » · « Thread »
Top « Date » · « Thread »
From gmcdon...@apache.org
Subject Build failed in Jenkins: directory-fortress-core #47
Date Thu, 02 Jul 2015 01:07:09 GMT
See <https://analysis.apache.org/jenkins/job/directory-fortress-core/47/>

------------------------------------------
[...truncated 158 lines...]
  found: org.apache.directory.fortress.core.model.AdminRole,org.apache.directory.fortress.core.model.UserAdminRole
  reason: actual argument org.apache.directory.fortress.core.model.AdminRole cannot be converted to org.apache.directory.fortress.core.util.time.Constraint by method invocation conversion
[ERROR] <https://analysis.apache.org/jenkins/job/directory-fortress-core/ws/src/main/java/org/apache/directory/fortress/core/rbac/DelAdminMgrImpl.java>:[284,19] method copyAdminAttrs in class org.apache.directory.fortress.core.util.attr.AttrHelper cannot be applied to given types;
  required: org.apache.directory.fortress.core.rbac.Administrator,org.apache.directory.fortress.core.rbac.Administrator
  found: org.apache.directory.fortress.core.model.AdminRole,org.apache.directory.fortress.core.model.UserAdminRole
  reason: actual argument org.apache.directory.fortress.core.model.AdminRole cannot be converted to org.apache.directory.fortress.core.rbac.Administrator by method invocation conversion
[ERROR] <https://analysis.apache.org/jenkins/job/directory-fortress-core/ws/src/main/java/org/apache/directory/fortress/core/rbac/UserP.java>:[835,14] method validate in class org.apache.directory.fortress.core.util.time.CUtil cannot be applied to given types;
  required: org.apache.directory.fortress.core.util.time.Constraint
  found: org.apache.directory.fortress.core.model.User
  reason: actual argument org.apache.directory.fortress.core.model.User cannot be converted to org.apache.directory.fortress.core.util.time.Constraint by method invocation conversion
[ERROR] <https://analysis.apache.org/jenkins/job/directory-fortress-core/ws/src/main/java/org/apache/directory/fortress/core/rbac/UserP.java>:[847,22] method validateOrCopy in class org.apache.directory.fortress.core.util.time.CUtil cannot be applied to given types;
  required: org.apache.directory.fortress.core.util.time.Constraint,org.apache.directory.fortress.core.util.time.Constraint
  found: org.apache.directory.fortress.core.model.Role,org.apache.directory.fortress.core.model.UserRole
  reason: actual argument org.apache.directory.fortress.core.model.Role cannot be converted to org.apache.directory.fortress.core.util.time.Constraint by method invocation conversion
[ERROR] <https://analysis.apache.org/jenkins/job/directory-fortress-core/ws/src/main/java/org/apache/directory/fortress/core/rbac/UserP.java>:[860,22] method validateOrCopy in class org.apache.directory.fortress.core.util.time.CUtil cannot be applied to given types;
  required: org.apache.directory.fortress.core.util.time.Constraint,org.apache.directory.fortress.core.util.time.Constraint
  found: org.apache.directory.fortress.core.model.AdminRole,org.apache.directory.fortress.core.model.UserAdminRole
  reason: actual argument org.apache.directory.fortress.core.model.AdminRole cannot be converted to org.apache.directory.fortress.core.util.time.Constraint by method invocation conversion
[ERROR] <https://analysis.apache.org/jenkins/job/directory-fortress-core/ws/src/main/java/org/apache/directory/fortress/core/rbac/UserP.java>:[863,27] method copyAdminAttrs in class org.apache.directory.fortress.core.util.attr.AttrHelper cannot be applied to given types;
  required: org.apache.directory.fortress.core.rbac.Administrator,org.apache.directory.fortress.core.rbac.Administrator
  found: org.apache.directory.fortress.core.model.AdminRole,org.apache.directory.fortress.core.model.UserAdminRole
  reason: actual argument org.apache.directory.fortress.core.model.AdminRole cannot be converted to org.apache.directory.fortress.core.rbac.Administrator by method invocation conversion
[ERROR] <https://analysis.apache.org/jenkins/job/directory-fortress-core/ws/src/main/java/org/apache/directory/fortress/core/rbac/OrgUnitDAO.java>:[681,16] incompatible types
  required: org.apache.directory.fortress.core.rbac.Graphable
  found:    org.apache.directory.fortress.core.model.OrgUnit
[ERROR] <https://analysis.apache.org/jenkins/job/directory-fortress-core/ws/src/main/java/org/apache/directory/fortress/core/rbac/AdminRoleDAO.java>:[173,51] no suitable method found for setConstraint(org.apache.directory.fortress.core.model.AdminRole)
    method org.apache.directory.fortress.core.util.time.CUtil.setConstraint(org.apache.directory.fortress.core.util.time.Constraint) is not applicable
      (actual argument org.apache.directory.fortress.core.model.AdminRole cannot be converted to org.apache.directory.fortress.core.util.time.Constraint by method invocation conversion)
    method org.apache.directory.fortress.core.util.time.CUtil.setConstraint(java.lang.String,org.apache.directory.fortress.core.util.time.Constraint) is not applicable
      (actual and formal argument lists differ in length)
[ERROR] <https://analysis.apache.org/jenkins/job/directory-fortress-core/ws/src/main/java/org/apache/directory/fortress/core/rbac/AdminRoleDAO.java>:[238,41] no suitable method found for setConstraint(org.apache.directory.fortress.core.model.AdminRole)
    method org.apache.directory.fortress.core.util.time.CUtil.setConstraint(org.apache.directory.fortress.core.util.time.Constraint) is not applicable
      (actual argument org.apache.directory.fortress.core.model.AdminRole cannot be converted to org.apache.directory.fortress.core.util.time.Constraint by method invocation conversion)
    method org.apache.directory.fortress.core.util.time.CUtil.setConstraint(java.lang.String,org.apache.directory.fortress.core.util.time.Constraint) is not applicable
      (actual and formal argument lists differ in length)
[ERROR] <https://analysis.apache.org/jenkins/job/directory-fortress-core/ws/src/main/java/org/apache/directory/fortress/core/rbac/AdminRoleDAO.java>:[659,16] incompatible types
  required: org.apache.directory.fortress.core.rbac.Graphable
  found:    org.apache.directory.fortress.core.model.Role
[ERROR] <https://analysis.apache.org/jenkins/job/directory-fortress-core/ws/src/main/java/org/apache/directory/fortress/core/rbac/AccessMgrImpl.java>:[318,15] method validateDSD in class org.apache.directory.fortress.core.rbac.SDUtil cannot be applied to given types;
  required: org.apache.directory.fortress.core.model.Session,org.apache.directory.fortress.core.util.time.Constraint
  found: org.apache.directory.fortress.core.model.Session,org.apache.directory.fortress.core.model.UserRole
  reason: actual argument org.apache.directory.fortress.core.model.UserRole cannot be converted to org.apache.directory.fortress.core.util.time.Constraint by method invocation conversion
[ERROR] <https://analysis.apache.org/jenkins/job/directory-fortress-core/ws/src/main/java/org/apache/directory/fortress/core/util/time/CUtil.java>:[481,33] method validate in interface org.apache.directory.fortress.core.util.time.Validator cannot be applied to given types;
  required: org.apache.directory.fortress.core.model.Session,org.apache.directory.fortress.core.model.Constraint,org.apache.directory.fortress.core.util.time.Time
  found: org.apache.directory.fortress.core.model.Session,org.apache.directory.fortress.core.util.time.Constraint,org.apache.directory.fortress.core.util.time.Time
  reason: actual argument org.apache.directory.fortress.core.util.time.Constraint cannot be converted to org.apache.directory.fortress.core.model.Constraint by method invocation conversion
[ERROR] <https://analysis.apache.org/jenkins/job/directory-fortress-core/ws/src/main/java/org/apache/directory/fortress/core/util/time/CUtil.java>:[501,33] method validate in interface org.apache.directory.fortress.core.util.time.Validator cannot be applied to given types;
  required: org.apache.directory.fortress.core.model.Session,org.apache.directory.fortress.core.model.Constraint,org.apache.directory.fortress.core.util.time.Time
  found: org.apache.directory.fortress.core.model.Session,org.apache.directory.fortress.core.util.time.Constraint,org.apache.directory.fortress.core.util.time.Time
  reason: actual argument org.apache.directory.fortress.core.util.time.Constraint cannot be converted to org.apache.directory.fortress.core.model.Constraint by method invocation conversion
[ERROR] <https://analysis.apache.org/jenkins/job/directory-fortress-core/ws/src/main/java/org/apache/directory/fortress/core/rbac/DelAccessMgrImpl.java>:[223,15] method validateDSD in class org.apache.directory.fortress.core.rbac.SDUtil cannot be applied to given types;
  required: org.apache.directory.fortress.core.model.Session,org.apache.directory.fortress.core.util.time.Constraint
  found: org.apache.directory.fortress.core.model.Session,org.apache.directory.fortress.core.model.UserAdminRole
  reason: actual argument org.apache.directory.fortress.core.model.UserAdminRole cannot be converted to org.apache.directory.fortress.core.util.time.Constraint by method invocation conversion
[ERROR] <https://analysis.apache.org/jenkins/job/directory-fortress-core/ws/src/main/java/org/apache/directory/fortress/core/ObjectFactory.java>:[88,53] reference to FortEntity is ambiguous, both class org.apache.directory.fortress.core.rbac.FortEntity in org.apache.directory.fortress.core.rbac and class org.apache.directory.fortress.core.model.FortEntity in org.apache.directory.fortress.core.model match
[ERROR] <https://analysis.apache.org/jenkins/job/directory-fortress-core/ws/src/main/java/org/apache/directory/fortress/core/ObjectFactory.java>:[88,31] unexpected type
  required: class
  found:    <T>javax.xml.bind.JAXBElement<T>
[ERROR] <https://analysis.apache.org/jenkins/job/directory-fortress-core/ws/src/main/java/org/apache/directory/fortress/core/ObjectFactory.java>:[118,50] reference to SDSet is ambiguous, both class org.apache.directory.fortress.core.rbac.SDSet in org.apache.directory.fortress.core.rbac and class org.apache.directory.fortress.core.model.SDSet in org.apache.directory.fortress.core.model match
[INFO] 100 errors 
[INFO] -------------------------------------------------------------
[INFO] ------------------------------------------------------------------------
[INFO] BUILD FAILURE
[INFO] ------------------------------------------------------------------------
[INFO] Total time: 35.883s
[INFO] Finished at: Thu Jul 02 01:06:59 UTC 2015
[INFO] Final Memory: 27M/299M
[INFO] ------------------------------------------------------------------------
Waiting for Jenkins to finish collecting data
[ERROR] Failed to execute goal org.apache.maven.plugins:maven-compiler-plugin:3.2:compile (default-compile) on project fortress-core: Compilation failure: Compilation failure:
[ERROR] <https://analysis.apache.org/jenkins/job/directory-fortress-core/ws/src/main/java/org/apache/directory/fortress/core/ObjectFactory.java>:[86,54] reference to FortEntity is ambiguous, both class org.apache.directory.fortress.core.rbac.FortEntity in org.apache.directory.fortress.core.rbac and class org.apache.directory.fortress.core.model.FortEntity in org.apache.directory.fortress.core.model match
[ERROR] <https://analysis.apache.org/jenkins/job/directory-fortress-core/ws/src/main/java/org/apache/directory/fortress/core/ObjectFactory.java>:[86,24] reference to FortEntity is ambiguous, both class org.apache.directory.fortress.core.rbac.FortEntity in org.apache.directory.fortress.core.rbac and class org.apache.directory.fortress.core.model.FortEntity in org.apache.directory.fortress.core.model match
[ERROR] <https://analysis.apache.org/jenkins/job/directory-fortress-core/ws/src/main/java/org/apache/directory/fortress/core/ObjectFactory.java>:[116,46] reference to SDSet is ambiguous, both class org.apache.directory.fortress.core.rbac.SDSet in org.apache.directory.fortress.core.rbac and class org.apache.directory.fortress.core.model.SDSet in org.apache.directory.fortress.core.model match
[ERROR] <https://analysis.apache.org/jenkins/job/directory-fortress-core/ws/src/main/java/org/apache/directory/fortress/core/ObjectFactory.java>:[116,24] reference to SDSet is ambiguous, both class org.apache.directory.fortress.core.rbac.SDSet in org.apache.directory.fortress.core.rbac and class org.apache.directory.fortress.core.model.SDSet in org.apache.directory.fortress.core.model match
[ERROR] <https://analysis.apache.org/jenkins/job/directory-fortress-core/ws/src/main/java/org/apache/directory/fortress/core/ObjectFactory.java>:[126,52] reference to PwPolicy is ambiguous, both class org.apache.directory.fortress.core.rbac.PwPolicy in org.apache.directory.fortress.core.rbac and class org.apache.directory.fortress.core.model.PwPolicy in org.apache.directory.fortress.core.model match
[ERROR] <https://analysis.apache.org/jenkins/job/directory-fortress-core/ws/src/main/java/org/apache/directory/fortress/core/ObjectFactory.java>:[126,24] reference to PwPolicy is ambiguous, both class org.apache.directory.fortress.core.rbac.PwPolicy in org.apache.directory.fortress.core.rbac and class org.apache.directory.fortress.core.model.PwPolicy in org.apache.directory.fortress.core.model match
[ERROR] <https://analysis.apache.org/jenkins/job/directory-fortress-core/ws/src/main/java/org/apache/directory/fortress/core/ObjectFactory.java>:[136,52] reference to Session is ambiguous, both class org.apache.directory.fortress.core.rbac.Session in org.apache.directory.fortress.core.rbac and class org.apache.directory.fortress.core.model.Session in org.apache.directory.fortress.core.model match
[ERROR] <https://analysis.apache.org/jenkins/job/directory-fortress-core/ws/src/main/java/org/apache/directory/fortress/core/ObjectFactory.java>:[136,24] reference to Session is ambiguous, both class org.apache.directory.fortress.core.rbac.Session in org.apache.directory.fortress.core.rbac and class org.apache.directory.fortress.core.model.Session in org.apache.directory.fortress.core.model match
[ERROR] <https://analysis.apache.org/jenkins/job/directory-fortress-core/ws/src/main/java/org/apache/directory/fortress/core/ObjectFactory.java>:[146,46] reference to User is ambiguous, both class org.apache.directory.fortress.core.rbac.User in org.apache.directory.fortress.core.rbac and class org.apache.directory.fortress.core.model.User in org.apache.directory.fortress.core.model match
[ERROR] <https://analysis.apache.org/jenkins/job/directory-fortress-core/ws/src/main/java/org/apache/directory/fortress/core/ObjectFactory.java>:[146,24] reference to User is ambiguous, both class org.apache.directory.fortress.core.rbac.User in org.apache.directory.fortress.core.rbac and class org.apache.directory.fortress.core.model.User in org.apache.directory.fortress.core.model match
[ERROR] <https://analysis.apache.org/jenkins/job/directory-fortress-core/ws/src/main/java/org/apache/directory/fortress/core/ObjectFactory.java>:[156,54] reference to UserRole is ambiguous, both class org.apache.directory.fortress.core.rbac.UserRole in org.apache.directory.fortress.core.rbac and class org.apache.directory.fortress.core.model.UserRole in org.apache.directory.fortress.core.model match
[ERROR] <https://analysis.apache.org/jenkins/job/directory-fortress-core/ws/src/main/java/org/apache/directory/fortress/core/ObjectFactory.java>:[156,24] reference to UserRole is ambiguous, both class org.apache.directory.fortress.core.rbac.UserRole in org.apache.directory.fortress.core.rbac and class org.apache.directory.fortress.core.model.UserRole in org.apache.directory.fortress.core.model match
[ERROR] <https://analysis.apache.org/jenkins/job/directory-fortress-core/ws/src/main/java/org/apache/directory/fortress/core/ObjectFactory.java>:[166,52] reference to OrgUnit is ambiguous, both class org.apache.directory.fortress.core.rbac.OrgUnit in org.apache.directory.fortress.core.rbac and class org.apache.directory.fortress.core.model.OrgUnit in org.apache.directory.fortress.core.model match
[ERROR] <https://analysis.apache.org/jenkins/job/directory-fortress-core/ws/src/main/java/org/apache/directory/fortress/core/ObjectFactory.java>:[166,24] reference to OrgUnit is ambiguous, both class org.apache.directory.fortress.core.rbac.OrgUnit in org.apache.directory.fortress.core.rbac and class org.apache.directory.fortress.core.model.OrgUnit in org.apache.directory.fortress.core.model match
[ERROR] <https://analysis.apache.org/jenkins/job/directory-fortress-core/ws/src/main/java/org/apache/directory/fortress/core/ObjectFactory.java>:[176,46] reference to Role is ambiguous, both class org.apache.directory.fortress.core.rbac.Role in org.apache.directory.fortress.core.rbac and class org.apache.directory.fortress.core.model.Role in org.apache.directory.fortress.core.model match
[ERROR] <https://analysis.apache.org/jenkins/job/directory-fortress-core/ws/src/main/java/org/apache/directory/fortress/core/ObjectFactory.java>:[176,24] reference to Role is ambiguous, both class org.apache.directory.fortress.core.rbac.Role in org.apache.directory.fortress.core.rbac and class org.apache.directory.fortress.core.model.Role in org.apache.directory.fortress.core.model match
[ERROR] <https://analysis.apache.org/jenkins/job/directory-fortress-core/ws/src/main/java/org/apache/directory/fortress/core/ObjectFactory.java>:[186,52] reference to PermGrant is ambiguous, both class org.apache.directory.fortress.core.rbac.PermGrant in org.apache.directory.fortress.core.rbac and class org.apache.directory.fortress.core.model.PermGrant in org.apache.directory.fortress.core.model match
[ERROR] <https://analysis.apache.org/jenkins/job/directory-fortress-core/ws/src/main/java/org/apache/directory/fortress/core/ObjectFactory.java>:[186,24] reference to PermGrant is ambiguous, both class org.apache.directory.fortress.core.rbac.PermGrant in org.apache.directory.fortress.core.rbac and class org.apache.directory.fortress.core.model.PermGrant in org.apache.directory.fortress.core.model match
[ERROR] <https://analysis.apache.org/jenkins/job/directory-fortress-core/ws/src/main/java/org/apache/directory/fortress/core/ObjectFactory.java>:[196,80] reference to AdminRoleRelationship is ambiguous, both class org.apache.directory.fortress.core.rbac.AdminRoleRelationship in org.apache.directory.fortress.core.rbac and class org.apache.directory.fortress.core.model.AdminRoleRelationship in org.apache.directory.fortress.core.model match
[ERROR] <https://analysis.apache.org/jenkins/job/directory-fortress-core/ws/src/main/java/org/apache/directory/fortress/core/ObjectFactory.java>:[196,24] reference to AdminRoleRelationship is ambiguous, both class org.apache.directory.fortress.core.rbac.AdminRoleRelationship in org.apache.directory.fortress.core.rbac and class org.apache.directory.fortress.core.model.AdminRoleRelationship in org.apache.directory.fortress.core.model match
[ERROR] <https://analysis.apache.org/jenkins/job/directory-fortress-core/ws/src/main/java/org/apache/directory/fortress/core/ObjectFactory.java>:[206,76] reference to OrgUnitRelationship is ambiguous, both class org.apache.directory.fortress.core.rbac.OrgUnitRelationship in org.apache.directory.fortress.core.rbac and class org.apache.directory.fortress.core.model.OrgUnitRelationship in org.apache.directory.fortress.core.model match
[ERROR] <https://analysis.apache.org/jenkins/job/directory-fortress-core/ws/src/main/java/org/apache/directory/fortress/core/ObjectFactory.java>:[206,24] reference to OrgUnitRelationship is ambiguous, both class org.apache.directory.fortress.core.rbac.OrgUnitRelationship in org.apache.directory.fortress.core.rbac and class org.apache.directory.fortress.core.model.OrgUnitRelationship in org.apache.directory.fortress.core.model match
[ERROR] <https://analysis.apache.org/jenkins/job/directory-fortress-core/ws/src/main/java/org/apache/directory/fortress/core/ObjectFactory.java>:[216,70] reference to RoleRelationship is ambiguous, both class org.apache.directory.fortress.core.rbac.RoleRelationship in org.apache.directory.fortress.core.rbac and class org.apache.directory.fortress.core.model.RoleRelationship in org.apache.directory.fortress.core.model match
[ERROR] <https://analysis.apache.org/jenkins/job/directory-fortress-core/ws/src/main/java/org/apache/directory/fortress/core/ObjectFactory.java>:[216,24] reference to RoleRelationship is ambiguous, both class org.apache.directory.fortress.core.rbac.RoleRelationship in org.apache.directory.fortress.core.rbac and class org.apache.directory.fortress.core.model.RoleRelationship in org.apache.directory.fortress.core.model match
[ERROR] <https://analysis.apache.org/jenkins/job/directory-fortress-core/ws/src/main/java/org/apache/directory/fortress/core/ObjectFactory.java>:[226,56] reference to AdminRole is ambiguous, both class org.apache.directory.fortress.core.rbac.AdminRole in org.apache.directory.fortress.core.rbac and class org.apache.directory.fortress.core.model.AdminRole in org.apache.directory.fortress.core.model match
[ERROR] <https://analysis.apache.org/jenkins/job/directory-fortress-core/ws/src/main/java/org/apache/directory/fortress/core/ObjectFactory.java>:[226,24] reference to AdminRole is ambiguous, both class org.apache.directory.fortress.core.rbac.AdminRole in org.apache.directory.fortress.core.rbac and class org.apache.directory.fortress.core.model.AdminRole in org.apache.directory.fortress.core.model match
[ERROR] <https://analysis.apache.org/jenkins/job/directory-fortress-core/ws/src/main/java/org/apache/directory/fortress/core/ObjectFactory.java>:[236,59] reference to UserAdminRole is ambiguous, both class org.apache.directory.fortress.core.rbac.UserAdminRole in org.apache.directory.fortress.core.rbac and class org.apache.directory.fortress.core.model.UserAdminRole in org.apache.directory.fortress.core.model match
[ERROR] <https://analysis.apache.org/jenkins/job/directory-fortress-core/ws/src/main/java/org/apache/directory/fortress/core/ObjectFactory.java>:[236,24] reference to UserAdminRole is ambiguous, both class org.apache.directory.fortress.core.rbac.UserAdminRole in org.apache.directory.fortress.core.rbac and class org.apache.directory.fortress.core.model.UserAdminRole in org.apache.directory.fortress.core.model match
[ERROR] <https://analysis.apache.org/jenkins/job/directory-fortress-core/ws/src/main/java/org/apache/directory/fortress/core/ObjectFactory.java>:[246,51] reference to PermObj is ambiguous, both class org.apache.directory.fortress.core.rbac.PermObj in org.apache.directory.fortress.core.rbac and class org.apache.directory.fortress.core.model.PermObj in org.apache.directory.fortress.core.model match
[ERROR] <https://analysis.apache.org/jenkins/job/directory-fortress-core/ws/src/main/java/org/apache/directory/fortress/core/ObjectFactory.java>:[246,24] reference to PermObj is ambiguous, both class org.apache.directory.fortress.core.rbac.PermObj in org.apache.directory.fortress.core.rbac and class org.apache.directory.fortress.core.model.PermObj in org.apache.directory.fortress.core.model match
[ERROR] <https://analysis.apache.org/jenkins/job/directory-fortress-core/ws/src/main/java/org/apache/directory/fortress/core/ObjectFactory.java>:[256,58] reference to Permission is ambiguous, both class org.apache.directory.fortress.core.rbac.Permission in org.apache.directory.fortress.core.rbac and class org.apache.directory.fortress.core.model.Permission in org.apache.directory.fortress.core.model match
[ERROR] <https://analysis.apache.org/jenkins/job/directory-fortress-core/ws/src/main/java/org/apache/directory/fortress/core/ObjectFactory.java>:[256,24] reference to Permission is ambiguous, both class org.apache.directory.fortress.core.rbac.Permission in org.apache.directory.fortress.core.rbac and class org.apache.directory.fortress.core.model.Permission in org.apache.directory.fortress.core.model match
[ERROR] <https://analysis.apache.org/jenkins/job/directory-fortress-core/ws/src/main/java/org/apache/directory/fortress/core/ObjectFactory.java>:[266,48] reference to Bind is ambiguous, both class org.apache.directory.fortress.core.rbac.Bind in org.apache.directory.fortress.core.rbac and class org.apache.directory.fortress.core.model.Bind in org.apache.directory.fortress.core.model match
[ERROR] <https://analysis.apache.org/jenkins/job/directory-fortress-core/ws/src/main/java/org/apache/directory/fortress/core/ObjectFactory.java>:[266,24] reference to Bind is ambiguous, both class org.apache.directory.fortress.core.rbac.Bind in org.apache.directory.fortress.core.rbac and class org.apache.directory.fortress.core.model.Bind in org.apache.directory.fortress.core.model match
[ERROR] <https://analysis.apache.org/jenkins/job/directory-fortress-core/ws/src/main/java/org/apache/directory/fortress/core/ObjectFactory.java>:[276,56] reference to UserAudit is ambiguous, both class org.apache.directory.fortress.core.rbac.UserAudit in org.apache.directory.fortress.core.rbac and class org.apache.directory.fortress.core.model.UserAudit in org.apache.directory.fortress.core.model match
[ERROR] <https://analysis.apache.org/jenkins/job/directory-fortress-core/ws/src/main/java/org/apache/directory/fortress/core/ObjectFactory.java>:[276,24] reference to UserAudit is ambiguous, both class org.apache.directory.fortress.core.rbac.UserAudit in org.apache.directory.fortress.core.rbac and class org.apache.directory.fortress.core.model.UserAudit in org.apache.directory.fortress.core.model match
[ERROR] <https://analysis.apache.org/jenkins/job/directory-fortress-core/ws/src/main/java/org/apache/directory/fortress/core/ObjectFactory.java>:[286,48] reference to AuthZ is ambiguous, both class org.apache.directory.fortress.core.rbac.AuthZ in org.apache.directory.fortress.core.rbac and class org.apache.directory.fortress.core.model.AuthZ in org.apache.directory.fortress.core.model match
[ERROR] <https://analysis.apache.org/jenkins/job/directory-fortress-core/ws/src/main/java/org/apache/directory/fortress/core/ObjectFactory.java>:[286,24] reference to AuthZ is ambiguous, both class org.apache.directory.fortress.core.rbac.AuthZ in org.apache.directory.fortress.core.rbac and class org.apache.directory.fortress.core.model.AuthZ in org.apache.directory.fortress.core.model match
[ERROR] <https://analysis.apache.org/jenkins/job/directory-fortress-core/ws/src/main/java/org/apache/directory/fortress/core/ObjectFactory.java>:[296,44] reference to Mod is ambiguous, both class org.apache.directory.fortress.core.rbac.Mod in org.apache.directory.fortress.core.rbac and class org.apache.directory.fortress.core.model.Mod in org.apache.directory.fortress.core.model match
[ERROR] <https://analysis.apache.org/jenkins/job/directory-fortress-core/ws/src/main/java/org/apache/directory/fortress/core/ObjectFactory.java>:[296,24] reference to Mod is ambiguous, both class org.apache.directory.fortress.core.rbac.Mod in org.apache.directory.fortress.core.rbac and class org.apache.directory.fortress.core.model.Mod in org.apache.directory.fortress.core.model match
[ERROR] <https://analysis.apache.org/jenkins/job/directory-fortress-core/ws/src/main/java/org/apache/directory/fortress/core/ObjectFactory.java>:[306,54] reference to RolePerm is ambiguous, both class org.apache.directory.fortress.core.rbac.RolePerm in org.apache.directory.fortress.core.rbac and class org.apache.directory.fortress.core.model.RolePerm in org.apache.directory.fortress.core.model match
[ERROR] <https://analysis.apache.org/jenkins/job/directory-fortress-core/ws/src/main/java/org/apache/directory/fortress/core/ObjectFactory.java>:[306,24] reference to RolePerm is ambiguous, both class org.apache.directory.fortress.core.rbac.RolePerm in org.apache.directory.fortress.core.rbac and class org.apache.directory.fortress.core.model.RolePerm in org.apache.directory.fortress.core.model match
[ERROR] <https://analysis.apache.org/jenkins/job/directory-fortress-core/ws/src/main/java/org/apache/directory/fortress/core/ObjectFactory.java>:[316,52] reference to Address is ambiguous, both class org.apache.directory.fortress.core.rbac.Address in org.apache.directory.fortress.core.rbac and class org.apache.directory.fortress.core.model.Address in org.apache.directory.fortress.core.model match
[ERROR] <https://analysis.apache.org/jenkins/job/directory-fortress-core/ws/src/main/java/org/apache/directory/fortress/core/ObjectFactory.java>:[316,24] reference to Address is ambiguous, both class org.apache.directory.fortress.core.rbac.Address in org.apache.directory.fortress.core.rbac and class org.apache.directory.fortress.core.model.Address in org.apache.directory.fortress.core.model match
[ERROR] <https://analysis.apache.org/jenkins/job/directory-fortress-core/ws/src/main/java/org/apache/directory/fortress/core/ObjectFactory.java>:[326,48] reference to Props is ambiguous, both class org.apache.directory.fortress.core.rbac.Props in org.apache.directory.fortress.core.rbac and class org.apache.directory.fortress.core.model.Props in org.apache.directory.fortress.core.model match
[ERROR] <https://analysis.apache.org/jenkins/job/directory-fortress-core/ws/src/main/java/org/apache/directory/fortress/core/ObjectFactory.java>:[326,24] reference to Props is ambiguous, both class org.apache.directory.fortress.core.rbac.Props in org.apache.directory.fortress.core.rbac and class org.apache.directory.fortress.core.model.Props in org.apache.directory.fortress.core.model match
[ERROR] <https://analysis.apache.org/jenkins/job/directory-fortress-core/ws/src/main/java/org/apache/directory/fortress/core/ObjectFactory.java>:[336,52] reference to Warning is ambiguous, both class org.apache.directory.fortress.core.rbac.Warning in org.apache.directory.fortress.core.rbac and class org.apache.directory.fortress.core.model.Warning in org.apache.directory.fortress.core.model match
[ERROR] <https://analysis.apache.org/jenkins/job/directory-fortress-core/ws/src/main/java/org/apache/directory/fortress/core/ObjectFactory.java>:[336,24] reference to Warning is ambiguous, both class org.apache.directory.fortress.core.rbac.Warning in org.apache.directory.fortress.core.rbac and class org.apache.directory.fortress.core.model.Warning in org.apache.directory.fortress.core.model match
[ERROR] <https://analysis.apache.org/jenkins/job/directory-fortress-core/ws/src/main/java/org/apache/directory/fortress/core/ObjectFactory.java>:[361,12] reference to User is ambiguous, both class org.apache.directory.fortress.core.rbac.User in org.apache.directory.fortress.core.rbac and class org.apache.directory.fortress.core.model.User in org.apache.directory.fortress.core.model match
[ERROR] <https://analysis.apache.org/jenkins/job/directory-fortress-core/ws/src/main/java/org/apache/directory/fortress/core/ObjectFactory.java>:[370,12] reference to PwPolicy is ambiguous, both class org.apache.directory.fortress.core.rbac.PwPolicy in org.apache.directory.fortress.core.rbac and class org.apache.directory.fortress.core.model.PwPolicy in org.apache.directory.fortress.core.model match
[ERROR] <https://analysis.apache.org/jenkins/job/directory-fortress-core/ws/src/main/java/org/apache/directory/fortress/core/ObjectFactory.java>:[379,12] reference to Session is ambiguous, both class org.apache.directory.fortress.core.rbac.Session in org.apache.directory.fortress.core.rbac and class org.apache.directory.fortress.core.model.Session in org.apache.directory.fortress.core.model match
[ERROR] <https://analysis.apache.org/jenkins/job/directory-fortress-core/ws/src/main/java/org/apache/directory/fortress/core/ObjectFactory.java>:[388,12] reference to SDSet is ambiguous, both class org.apache.directory.fortress.core.rbac.SDSet in org.apache.directory.fortress.core.rbac and class org.apache.directory.fortress.core.model.SDSet in org.apache.directory.fortress.core.model match
[ERROR] <https://analysis.apache.org/jenkins/job/directory-fortress-core/ws/src/main/java/org/apache/directory/fortress/core/ObjectFactory.java>:[397,12] reference to Role is ambiguous, both class org.apache.directory.fortress.core.rbac.Role in org.apache.directory.fortress.core.rbac and class org.apache.directory.fortress.core.model.Role in org.apache.directory.fortress.core.model match
[ERROR] <https://analysis.apache.org/jenkins/job/directory-fortress-core/ws/src/main/java/org/apache/directory/fortress/core/ObjectFactory.java>:[415,12] reference to PermGrant is ambiguous, both class org.apache.directory.fortress.core.rbac.PermGrant in org.apache.directory.fortress.core.rbac and class org.apache.directory.fortress.core.model.PermGrant in org.apache.directory.fortress.core.model match
[ERROR] <https://analysis.apache.org/jenkins/job/directory-fortress-core/ws/src/main/java/org/apache/directory/fortress/core/ObjectFactory.java>:[424,12] reference to RoleRelationship is ambiguous, both class org.apache.directory.fortress.core.rbac.RoleRelationship in org.apache.directory.fortress.core.rbac and class org.apache.directory.fortress.core.model.RoleRelationship in org.apache.directory.fortress.core.model match
[ERROR] <https://analysis.apache.org/jenkins/job/directory-fortress-core/ws/src/main/java/org/apache/directory/fortress/core/ObjectFactory.java>:[433,12] reference to AdminRoleRelationship is ambiguous, both class org.apache.directory.fortress.core.rbac.AdminRoleRelationship in org.apache.directory.fortress.core.rbac and class org.apache.directory.fortress.core.model.AdminRoleRelationship in org.apache.directory.fortress.core.model match
[ERROR] <https://analysis.apache.org/jenkins/job/directory-fortress-core/ws/src/main/java/org/apache/directory/fortress/core/ObjectFactory.java>:[442,12] reference to OrgUnitRelationship is ambiguous, both class org.apache.directory.fortress.core.rbac.OrgUnitRelationship in org.apache.directory.fortress.core.rbac and class org.apache.directory.fortress.core.model.OrgUnitRelationship in org.apache.directory.fortress.core.model match
[ERROR] <https://analysis.apache.org/jenkins/job/directory-fortress-core/ws/src/main/java/org/apache/directory/fortress/core/ObjectFactory.java>:[451,12] reference to PermObj is ambiguous, both class org.apache.directory.fortress.core.rbac.PermObj in org.apache.directory.fortress.core.rbac and class org.apache.directory.fortress.core.model.PermObj in org.apache.directory.fortress.core.model match
[ERROR] <https://analysis.apache.org/jenkins/job/directory-fortress-core/ws/src/main/java/org/apache/directory/fortress/core/ObjectFactory.java>:[460,12] reference to Permission is ambiguous, both class org.apache.directory.fortress.core.rbac.Permission in org.apache.directory.fortress.core.rbac and class org.apache.directory.fortress.core.model.Permission in org.apache.directory.fortress.core.model match
[ERROR] <https://analysis.apache.org/jenkins/job/directory-fortress-core/ws/src/main/java/org/apache/directory/fortress/core/ObjectFactory.java>:[469,12] reference to AdminRole is ambiguous, both class org.apache.directory.fortress.core.rbac.AdminRole in org.apache.directory.fortress.core.rbac and class org.apache.directory.fortress.core.model.AdminRole in org.apache.directory.fortress.core.model match
[ERROR] <https://analysis.apache.org/jenkins/job/directory-fortress-core/ws/src/main/java/org/apache/directory/fortress/core/ObjectFactory.java>:[478,12] reference to UserRole is ambiguous, both class org.apache.directory.fortress.core.rbac.UserRole in org.apache.directory.fortress.core.rbac and class org.apache.directory.fortress.core.model.UserRole in org.apache.directory.fortress.core.model match
[ERROR] <https://analysis.apache.org/jenkins/job/directory-fortress-core/ws/src/main/java/org/apache/directory/fortress/core/ObjectFactory.java>:[487,12] reference to OrgUnit is ambiguous, both class org.apache.directory.fortress.core.rbac.OrgUnit in org.apache.directory.fortress.core.rbac and class org.apache.directory.fortress.core.model.OrgUnit in org.apache.directory.fortress.core.model match
[ERROR] <https://analysis.apache.org/jenkins/job/directory-fortress-core/ws/src/main/java/org/apache/directory/fortress/core/ObjectFactory.java>:[496,12] reference to UserAdminRole is ambiguous, both class org.apache.directory.fortress.core.rbac.UserAdminRole in org.apache.directory.fortress.core.rbac and class org.apache.directory.fortress.core.model.UserAdminRole in org.apache.directory.fortress.core.model match
[ERROR] <https://analysis.apache.org/jenkins/job/directory-fortress-core/ws/src/main/java/org/apache/directory/fortress/core/ObjectFactory.java>:[505,12] reference to UserAudit is ambiguous, both class org.apache.directory.fortress.core.rbac.UserAudit in org.apache.directory.fortress.core.rbac and class org.apache.directory.fortress.core.model.UserAudit in org.apache.directory.fortress.core.model match
[ERROR] <https://analysis.apache.org/jenkins/job/directory-fortress-core/ws/src/main/java/org/apache/directory/fortress/core/ObjectFactory.java>:[514,12] reference to Bind is ambiguous, both class org.apache.directory.fortress.core.rbac.Bind in org.apache.directory.fortress.core.rbac and class org.apache.directory.fortress.core.model.Bind in org.apache.directory.fortress.core.model match
[ERROR] <https://analysis.apache.org/jenkins/job/directory-fortress-core/ws/src/main/java/org/apache/directory/fortress/core/ObjectFactory.java>:[523,12] reference to AuthZ is ambiguous, both class org.apache.directory.fortress.core.rbac.AuthZ in org.apache.directory.fortress.core.rbac and class org.apache.directory.fortress.core.model.AuthZ in org.apache.directory.fortress.core.model match
[ERROR] <https://analysis.apache.org/jenkins/job/directory-fortress-core/ws/src/main/java/org/apache/directory/fortress/core/ObjectFactory.java>:[532,12] reference to Mod is ambiguous, both class org.apache.directory.fortress.core.rbac.Mod in org.apache.directory.fortress.core.rbac and class org.apache.directory.fortress.core.model.Mod in org.apache.directory.fortress.core.model match
[ERROR] <https://analysis.apache.org/jenkins/job/directory-fortress-core/ws/src/main/java/org/apache/directory/fortress/core/ObjectFactory.java>:[541,12] reference to RolePerm is ambiguous, both class org.apache.directory.fortress.core.rbac.RolePerm in org.apache.directory.fortress.core.rbac and class org.apache.directory.fortress.core.model.RolePerm in org.apache.directory.fortress.core.model match
[ERROR] <https://analysis.apache.org/jenkins/job/directory-fortress-core/ws/src/main/java/org/apache/directory/fortress/core/ObjectFactory.java>:[568,12] reference to Address is ambiguous, both class org.apache.directory.fortress.core.rbac.Address in org.apache.directory.fortress.core.rbac and class org.apache.directory.fortress.core.model.Address in org.apache.directory.fortress.core.model match
[ERROR] <https://analysis.apache.org/jenkins/job/directory-fortress-core/ws/src/main/java/org/apache/directory/fortress/core/ObjectFactory.java>:[577,12] reference to Props is ambiguous, both class org.apache.directory.fortress.core.rbac.Props in org.apache.directory.fortress.core.rbac and class org.apache.directory.fortress.core.model.Props in org.apache.directory.fortress.core.model match
[ERROR] <https://analysis.apache.org/jenkins/job/directory-fortress-core/ws/src/main/java/org/apache/directory/fortress/core/ObjectFactory.java>:[586,55] reference to Warning is ambiguous, both class org.apache.directory.fortress.core.rbac.Warning in org.apache.directory.fortress.core.rbac and class org.apache.directory.fortress.core.model.Warning in org.apache.directory.fortress.core.model match
[ERROR] <https://analysis.apache.org/jenkins/job/directory-fortress-core/ws/src/main/java/org/apache/directory/fortress/core/ObjectFactory.java>:[586,12] reference to Warning is ambiguous, both class org.apache.directory.fortress.core.rbac.Warning in org.apache.directory.fortress.core.rbac and class org.apache.directory.fortress.core.model.Warning in org.apache.directory.fortress.core.model match
[ERROR] <https://analysis.apache.org/jenkins/job/directory-fortress-core/ws/src/main/java/org/apache/directory/fortress/core/ObjectFactory.java>:[595,55] reference to Warning is ambiguous, both class org.apache.directory.fortress.core.rbac.Warning in org.apache.directory.fortress.core.rbac and class org.apache.directory.fortress.core.model.Warning in org.apache.directory.fortress.core.model match
[ERROR] <https://analysis.apache.org/jenkins/job/directory-fortress-core/ws/src/main/java/org/apache/directory/fortress/core/ObjectFactory.java>:[595,12] reference to Warning is ambiguous, both class org.apache.directory.fortress.core.rbac.Warning in org.apache.directory.fortress.core.rbac and class org.apache.directory.fortress.core.model.Warning in org.apache.directory.fortress.core.model match
[ERROR] <https://analysis.apache.org/jenkins/job/directory-fortress-core/ws/src/main/java/org/apache/directory/fortress/core/rbac/RoleDAO.java>:[159,51] no suitable method found for setConstraint(org.apache.directory.fortress.core.model.Role)
[ERROR] method org.apache.directory.fortress.core.util.time.CUtil.setConstraint(org.apache.directory.fortress.core.util.time.Constraint) is not applicable
[ERROR] (actual argument org.apache.directory.fortress.core.model.Role cannot be converted to org.apache.directory.fortress.core.util.time.Constraint by method invocation conversion)
[ERROR] method org.apache.directory.fortress.core.util.time.CUtil.setConstraint(java.lang.String,org.apache.directory.fortress.core.util.time.Constraint) is not applicable
[ERROR] (actual and formal argument lists differ in length)
[ERROR] <https://analysis.apache.org/jenkins/job/directory-fortress-core/ws/src/main/java/org/apache/directory/fortress/core/rbac/RoleDAO.java>:[204,41] no suitable method found for setConstraint(org.apache.directory.fortress.core.model.Role)
[ERROR] method org.apache.directory.fortress.core.util.time.CUtil.setConstraint(org.apache.directory.fortress.core.util.time.Constraint) is not applicable
[ERROR] (actual argument org.apache.directory.fortress.core.model.Role cannot be converted to org.apache.directory.fortress.core.util.time.Constraint by method invocation conversion)
[ERROR] method org.apache.directory.fortress.core.util.time.CUtil.setConstraint(java.lang.String,org.apache.directory.fortress.core.util.time.Constraint) is not applicable
[ERROR] (actual and formal argument lists differ in length)
[ERROR] <https://analysis.apache.org/jenkins/job/directory-fortress-core/ws/src/main/java/org/apache/directory/fortress/core/rbac/RoleDAO.java>:[628,16] incompatible types
[ERROR] required: org.apache.directory.fortress.core.rbac.Graphable
[ERROR] found:    org.apache.directory.fortress.core.model.Role
[ERROR] <https://analysis.apache.org/jenkins/job/directory-fortress-core/ws/src/main/java/org/apache/directory/fortress/core/rbac/UserDAO.java>:[510,53] no suitable method found for setConstraint(org.apache.directory.fortress.core.model.User)
[ERROR] method org.apache.directory.fortress.core.util.time.CUtil.setConstraint(org.apache.directory.fortress.core.util.time.Constraint) is not applicable
[ERROR] (actual argument org.apache.directory.fortress.core.model.User cannot be converted to org.apache.directory.fortress.core.util.time.Constraint by method invocation conversion)
[ERROR] method org.apache.directory.fortress.core.util.time.CUtil.setConstraint(java.lang.String,org.apache.directory.fortress.core.util.time.Constraint) is not applicable
[ERROR] (actual and formal argument lists differ in length)
[ERROR] <https://analysis.apache.org/jenkins/job/directory-fortress-core/ws/src/main/java/org/apache/directory/fortress/core/rbac/UserDAO.java>:[610,41] no suitable method found for setConstraint(org.apache.directory.fortress.core.model.User)
[ERROR] method org.apache.directory.fortress.core.util.time.CUtil.setConstraint(org.apache.directory.fortress.core.util.time.Constraint) is not applicable
[ERROR] (actual argument org.apache.directory.fortress.core.model.User cannot be converted to org.apache.directory.fortress.core.util.time.Constraint by method invocation conversion)
[ERROR] method org.apache.directory.fortress.core.util.time.CUtil.setConstraint(java.lang.String,org.apache.directory.fortress.core.util.time.Constraint) is not applicable
[ERROR] (actual and formal argument lists differ in length)
[ERROR] <https://analysis.apache.org/jenkins/job/directory-fortress-core/ws/src/main/java/org/apache/directory/fortress/core/rbac/UserDAO.java>:[979,17] method checkPwPolicies in class org.apache.directory.fortress.core.rbac.UserDAO cannot be applied to given types;
[ERROR] required: org.apache.directory.fortress.core.rbac.PwMessage,org.apache.directory.api.ldap.extras.controls.ppolicy.PasswordPolicy
[ERROR] found: org.apache.directory.fortress.core.model.Session,org.apache.directory.api.ldap.extras.controls.ppolicy.PasswordPolicy
[ERROR] reason: actual argument org.apache.directory.fortress.core.model.Session cannot be converted to org.apache.directory.fortress.core.rbac.PwMessage by method invocation conversion
[ERROR] <https://analysis.apache.org/jenkins/job/directory-fortress-core/ws/src/main/java/org/apache/directory/fortress/core/rbac/DSDChecker.java>:[58,8] org.apache.directory.fortress.core.rbac.DSDChecker is not abstract and does not override abstract method validate(org.apache.directory.fortress.core.model.Session,org.apache.directory.fortress.core.model.Constraint,org.apache.directory.fortress.core.util.time.Time) in org.apache.directory.fortress.core.util.time.Validator
[ERROR] <https://analysis.apache.org/jenkins/job/directory-fortress-core/ws/src/main/java/org/apache/directory/fortress/core/rbac/DSDChecker.java>:[73,5] method does not override or implement a method from a supertype
[ERROR] <https://analysis.apache.org/jenkins/job/directory-fortress-core/ws/src/main/java/org/apache/directory/fortress/core/rbac/DelAdminMgrImpl.java>:[216,22] method copy in class org.apache.directory.fortress.core.util.time.CUtil cannot be applied to given types;
[ERROR] required: org.apache.directory.fortress.core.util.time.Constraint,org.apache.directory.fortress.core.util.time.Constraint
[ERROR] found: org.apache.directory.fortress.core.model.AdminRole,org.apache.directory.fortress.core.model.UserAdminRole
[ERROR] reason: actual argument org.apache.directory.fortress.core.model.AdminRole cannot be converted to org.apache.directory.fortress.core.util.time.Constraint by method invocation conversion
[ERROR] <https://analysis.apache.org/jenkins/job/directory-fortress-core/ws/src/main/java/org/apache/directory/fortress/core/rbac/DelAdminMgrImpl.java>:[281,14] method validateOrCopy in class org.apache.directory.fortress.core.util.time.CUtil cannot be applied to given types;
[ERROR] required: org.apache.directory.fortress.core.util.time.Constraint,org.apache.directory.fortress.core.util.time.Constraint
[ERROR] found: org.apache.directory.fortress.core.model.AdminRole,org.apache.directory.fortress.core.model.UserAdminRole
[ERROR] reason: actual argument org.apache.directory.fortress.core.model.AdminRole cannot be converted to org.apache.directory.fortress.core.util.time.Constraint by method invocation conversion
[ERROR] <https://analysis.apache.org/jenkins/job/directory-fortress-core/ws/src/main/java/org/apache/directory/fortress/core/rbac/DelAdminMgrImpl.java>:[284,19] method copyAdminAttrs in class org.apache.directory.fortress.core.util.attr.AttrHelper cannot be applied to given types;
[ERROR] required: org.apache.directory.fortress.core.rbac.Administrator,org.apache.directory.fortress.core.rbac.Administrator
[ERROR] found: org.apache.directory.fortress.core.model.AdminRole,org.apache.directory.fortress.core.model.UserAdminRole
[ERROR] reason: actual argument org.apache.directory.fortress.core.model.AdminRole cannot be converted to org.apache.directory.fortress.core.rbac.Administrator by method invocation conversion
[ERROR] <https://analysis.apache.org/jenkins/job/directory-fortress-core/ws/src/main/java/org/apache/directory/fortress/core/rbac/UserP.java>:[835,14] method validate in class org.apache.directory.fortress.core.util.time.CUtil cannot be applied to given types;
[ERROR] required: org.apache.directory.fortress.core.util.time.Constraint
[ERROR] found: org.apache.directory.fortress.core.model.User
[ERROR] reason: actual argument org.apache.directory.fortress.core.model.User cannot be converted to org.apache.directory.fortress.core.util.time.Constraint by method invocation conversion
[ERROR] <https://analysis.apache.org/jenkins/job/directory-fortress-core/ws/src/main/java/org/apache/directory/fortress/core/rbac/UserP.java>:[847,22] method validateOrCopy in class org.apache.directory.fortress.core.util.time.CUtil cannot be applied to given types;
[ERROR] required: org.apache.directory.fortress.core.util.time.Constraint,org.apache.directory.fortress.core.util.time.Constraint
[ERROR] found: org.apache.directory.fortress.core.model.Role,org.apache.directory.fortress.core.model.UserRole
[ERROR] reason: actual argument org.apache.directory.fortress.core.model.Role cannot be converted to org.apache.directory.fortress.core.util.time.Constraint by method invocation conversion
[ERROR] <https://analysis.apache.org/jenkins/job/directory-fortress-core/ws/src/main/java/org/apache/directory/fortress/core/rbac/UserP.java>:[860,22] method validateOrCopy in class org.apache.directory.fortress.core.util.time.CUtil cannot be applied to given types;
[ERROR] required: org.apache.directory.fortress.core.util.time.Constraint,org.apache.directory.fortress.core.util.time.Constraint
[ERROR] found: org.apache.directory.fortress.core.model.AdminRole,org.apache.directory.fortress.core.model.UserAdminRole
[ERROR] reason: actual argument org.apache.directory.fortress.core.model.AdminRole cannot be converted to org.apache.directory.fortress.core.util.time.Constraint by method invocation conversion
[ERROR] <https://analysis.apache.org/jenkins/job/directory-fortress-core/ws/src/main/java/org/apache/directory/fortress/core/rbac/UserP.java>:[863,27] method copyAdminAttrs in class org.apache.directory.fortress.core.util.attr.AttrHelper cannot be applied to given types;
[ERROR] required: org.apache.directory.fortress.core.rbac.Administrator,org.apache.directory.fortress.core.rbac.Administrator
[ERROR] found: org.apache.directory.fortress.core.model.AdminRole,org.apache.directory.fortress.core.model.UserAdminRole
[ERROR] reason: actual argument org.apache.directory.fortress.core.model.AdminRole cannot be converted to org.apache.directory.fortress.core.rbac.Administrator by method invocation conversion
[ERROR] <https://analysis.apache.org/jenkins/job/directory-fortress-core/ws/src/main/java/org/apache/directory/fortress/core/rbac/OrgUnitDAO.java>:[681,16] incompatible types
[ERROR] required: org.apache.directory.fortress.core.rbac.Graphable
[ERROR] found:    org.apache.directory.fortress.core.model.OrgUnit
[ERROR] <https://analysis.apache.org/jenkins/job/directory-fortress-core/ws/src/main/java/org/apache/directory/fortress/core/rbac/AdminRoleDAO.java>:[173,51] no suitable method found for setConstraint(org.apache.directory.fortress.core.model.AdminRole)
[ERROR] method org.apache.directory.fortress.core.util.time.CUtil.setConstraint(org.apache.directory.fortress.core.util.time.Constraint) is not applicable
[ERROR] (actual argument org.apache.directory.fortress.core.model.AdminRole cannot be converted to org.apache.directory.fortress.core.util.time.Constraint by method invocation conversion)
[ERROR] method org.apache.directory.fortress.core.util.time.CUtil.setConstraint(java.lang.String,org.apache.directory.fortress.core.util.time.Constraint) is not applicable
[ERROR] (actual and formal argument lists differ in length)
[JENKINS] Archiving <https://analysis.apache.org/jenkins/job/directory-fortress-core/ws/pom.xml> to org.apache.directory.fortress/fortress-core/1.0-RC41-SNAPSHOT/fortress-core-1.0-RC41-SNAPSHOT.pom
[ERROR] <https://analysis.apache.org/jenkins/job/directory-fortress-core/ws/src/main/java/org/apache/directory/fortress/core/rbac/AdminRoleDAO.java>:[238,41] no suitable method found for setConstraint(org.apache.directory.fortress.core.model.AdminRole)
[ERROR] method org.apache.directory.fortress.core.util.time.CUtil.setConstraint(org.apache.directory.fortress.core.util.time.Constraint) is not applicable
[ERROR] (actual argument org.apache.directory.fortress.core.model.AdminRole cannot be converted to org.apache.directory.fortress.core.util.time.Constraint by method invocation conversion)
[ERROR] method org.apache.directory.fortress.core.util.time.CUtil.setConstraint(java.lang.String,org.apache.directory.fortress.core.util.time.Constraint) is not applicable
[ERROR] (actual and formal argument lists differ in length)
[ERROR] <https://analysis.apache.org/jenkins/job/directory-fortress-core/ws/src/main/java/org/apache/directory/fortress/core/rbac/AdminRoleDAO.java>:[659,16] incompatible types
[ERROR] required: org.apache.directory.fortress.core.rbac.Graphable
[ERROR] found:    org.apache.directory.fortress.core.model.Role
[ERROR] <https://analysis.apache.org/jenkins/job/directory-fortress-core/ws/src/main/java/org/apache/directory/fortress/core/rbac/AccessMgrImpl.java>:[318,15] method validateDSD in class org.apache.directory.fortress.core.rbac.SDUtil cannot be applied to given types;
[ERROR] required: org.apache.directory.fortress.core.model.Session,org.apache.directory.fortress.core.util.time.Constraint
[ERROR] found: org.apache.directory.fortress.core.model.Session,org.apache.directory.fortress.core.model.UserRole
[ERROR] reason: actual argument org.apache.directory.fortress.core.model.UserRole cannot be converted to org.apache.directory.fortress.core.util.time.Constraint by method invocation conversion
[ERROR] <https://analysis.apache.org/jenkins/job/directory-fortress-core/ws/src/main/java/org/apache/directory/fortress/core/util/time/CUtil.java>:[481,33] method validate in interface org.apache.directory.fortress.core.util.time.Validator cannot be applied to given types;
[ERROR] required: org.apache.directory.fortress.core.model.Session,org.apache.directory.fortress.core.model.Constraint,org.apache.directory.fortress.core.util.time.Time
[ERROR] found: org.apache.directory.fortress.core.model.Session,org.apache.directory.fortress.core.util.time.Constraint,org.apache.directory.fortress.core.util.time.Time
[ERROR] reason: actual argument org.apache.directory.fortress.core.util.time.Constraint cannot be converted to org.apache.directory.fortress.core.model.Constraint by method invocation conversion
[ERROR] <https://analysis.apache.org/jenkins/job/directory-fortress-core/ws/src/main/java/org/apache/directory/fortress/core/util/time/CUtil.java>:[501,33] method validate in interface org.apache.directory.fortress.core.util.time.Validator cannot be applied to given types;
[ERROR] required: org.apache.directory.fortress.core.model.Session,org.apache.directory.fortress.core.model.Constraint,org.apache.directory.fortress.core.util.time.Time
[ERROR] found: org.apache.directory.fortress.core.model.Session,org.apache.directory.fortress.core.util.time.Constraint,org.apache.directory.fortress.core.util.time.Time
[ERROR] reason: actual argument org.apache.directory.fortress.core.util.time.Constraint cannot be converted to org.apache.directory.fortress.core.model.Constraint by method invocation conversion
[ERROR] <https://analysis.apache.org/jenkins/job/directory-fortress-core/ws/src/main/java/org/apache/directory/fortress/core/rbac/DelAccessMgrImpl.java>:[223,15] method validateDSD in class org.apache.directory.fortress.core.rbac.SDUtil cannot be applied to given types;
[ERROR] required: org.apache.directory.fortress.core.model.Session,org.apache.directory.fortress.core.util.time.Constraint
[ERROR] found: org.apache.directory.fortress.core.model.Session,org.apache.directory.fortress.core.model.UserAdminRole
[ERROR] reason: actual argument org.apache.directory.fortress.core.model.UserAdminRole cannot be converted to org.apache.directory.fortress.core.util.time.Constraint by method invocation conversion
[ERROR] <https://analysis.apache.org/jenkins/job/directory-fortress-core/ws/src/main/java/org/apache/directory/fortress/core/ObjectFactory.java>:[88,53] reference to FortEntity is ambiguous, both class org.apache.directory.fortress.core.rbac.FortEntity in org.apache.directory.fortress.core.rbac and class org.apache.directory.fortress.core.model.FortEntity in org.apache.directory.fortress.core.model match
[ERROR] <https://analysis.apache.org/jenkins/job/directory-fortress-core/ws/src/main/java/org/apache/directory/fortress/core/ObjectFactory.java>:[88,31] unexpected type
[ERROR] required: class
[ERROR] found:    <T>javax.xml.bind.JAXBElement<T>
[ERROR] <https://analysis.apache.org/jenkins/job/directory-fortress-core/ws/src/main/java/org/apache/directory/fortress/core/ObjectFactory.java>:[118,50] reference to SDSet is ambiguous, both class org.apache.directory.fortress.core.rbac.SDSet in org.apache.directory.fortress.core.rbac and class org.apache.directory.fortress.core.model.SDSet in org.apache.directory.fortress.core.model match
[ERROR] -> [Help 1]
[ERROR] 
[ERROR] To see the full stack trace of the errors, re-run Maven with the -e switch.
[ERROR] Re-run Maven using the -X switch to enable full debug logging.
[ERROR] 
[ERROR] For more information about the errors and possible solutions, please read the following articles:
[ERROR] [Help 1] http://cwiki.apache.org/confluence/display/MAVEN/MojoFailureException
Sending e-mails to: notifications@directory.apache.org
Skipping sonar analysis due to bad build status FAILURE
channel stopped

Mime
View raw message