directory-notifications mailing list archives

Site index · List index
Message view « Date » · « Thread »
Top « Date » · « Thread »
From pct...@apache.org
Subject Build failed in Jenkins: directory-fortress-commander » Apache Fortress Web #46
Date Thu, 04 Jun 2015 09:34:25 GMT
See <https://analysis.apache.org/jenkins/job/directory-fortress-commander/org.apache.directory.fortress$fortress-web/46/changes>

Changes:

[smckinney] FC109 - move the constraint

------------------------------------------
<===[JENKINS REMOTING CAPACITY]===>   channel started
log4j:WARN No appenders could be found for logger (org.apache.commons.beanutils.converters.BooleanConverter).
log4j:WARN Please initialize the log4j system properly.
Executing Maven:  -B -f <https://analysis.apache.org/jenkins/job/directory-fortress-commander/org.apache.directory.fortress$fortress-web/ws/pom.xml>
clean install -U -DskipTests -fae
[INFO] Scanning for projects...
[INFO]                                                                         
[INFO] ------------------------------------------------------------------------
[INFO] Building Apache Fortress Web 1.0-RC41-SNAPSHOT
[INFO] ------------------------------------------------------------------------
Downloading: http://repo1.maven.org/maven2/org/apache/directory/fortress/fortress-realm-impl/1.0-RC41-SNAPSHOT/maven-metadata.xml
Downloading: http://repository.apache.org/snapshots/org/apache/directory/fortress/fortress-realm-impl/1.0-RC41-SNAPSHOT/maven-metadata.xml
Downloading: http://repo1.maven.org/maven2/org/apache/directory/fortress/fortress-realm/1.0-RC41-SNAPSHOT/maven-metadata.xml
Downloading: http://repository.apache.org/snapshots/org/apache/directory/fortress/fortress-realm/1.0-RC41-SNAPSHOT/maven-metadata.xml
Downloading: http://repo1.maven.org/maven2/org/apache/directory/fortress/fortress-core/1.0-RC41-SNAPSHOT/maven-metadata.xml
Downloading: http://repository.apache.org/snapshots/org/apache/directory/fortress/fortress-core/1.0-RC41-SNAPSHOT/maven-metadata.xml
[INFO] 
[INFO] --- maven-clean-plugin:2.6.1:clean (default-clean) @ fortress-web ---
[INFO] Deleting <https://analysis.apache.org/jenkins/job/directory-fortress-commander/org.apache.directory.fortress$fortress-web/ws/target>
[INFO] 
[INFO] --- maven-remote-resources-plugin:1.5:process (default) @ fortress-web ---
[INFO] 
[INFO] --- maven-resources-plugin:2.7:resources (default-resources) @ fortress-web ---
[INFO] Using 'UTF-8' encoding to copy filtered resources.
[INFO] Copying 1 resource
[INFO] Copying 64 resources
[INFO] Copying 5 resources
[INFO] Copying 3 resources
[INFO] 
[INFO] --- maven-compiler-plugin:3.2:compile (default-compile) @ fortress-web ---
[INFO] Changes detected - recompiling the module!
[INFO] Compiling 92 source files to <https://analysis.apache.org/jenkins/job/directory-fortress-commander/org.apache.directory.fortress$fortress-web/ws/target/classes>
[INFO] <https://analysis.apache.org/jenkins/job/directory-fortress-commander/org.apache.directory.fortress$fortress-web/ws/src/main/java/org/apache/directory/fortress/web/LoginPage.java>:
Some input files use unchecked or unsafe operations.
[INFO] <https://analysis.apache.org/jenkins/job/directory-fortress-commander/org.apache.directory.fortress$fortress-web/ws/src/main/java/org/apache/directory/fortress/web/LoginPage.java>:
Recompile with -Xlint:unchecked for details.
[INFO] -------------------------------------------------------------
[ERROR] COMPILATION ERROR : 
[INFO] -------------------------------------------------------------
[ERROR] <https://analysis.apache.org/jenkins/job/directory-fortress-commander/org.apache.directory.fortress$fortress-web/ws/src/main/java/org/apache/directory/fortress/web/panel/ConstraintBasePanel.java>:[33,48]
cannot find symbol
  symbol:   class Constraint
  location: package org.apache.directory.fortress.core.model
[ERROR] <https://analysis.apache.org/jenkins/job/directory-fortress-commander/org.apache.directory.fortress$fortress-web/ws/src/main/java/org/apache/directory/fortress/web/panel/ConstraintBasePanel.java>:[297,36]
cannot find symbol
  symbol:   class Constraint
  location: class org.apache.directory.fortress.web.panel.ConstraintBasePanel
[ERROR] <https://analysis.apache.org/jenkins/job/directory-fortress-commander/org.apache.directory.fortress$fortress-web/ws/src/main/java/org/apache/directory/fortress/web/panel/RoleSearchModalPanel.java>:[48,48]
cannot find symbol
  symbol:   class ConstraintUtil
  location: package org.apache.directory.fortress.core.model
[ERROR] <https://analysis.apache.org/jenkins/job/directory-fortress-commander/org.apache.directory.fortress$fortress-web/ws/src/main/java/org/apache/directory/fortress/web/panel/RoleSearchModalPanel.java>:[49,48]
cannot find symbol
  symbol:   class Constraint
  location: package org.apache.directory.fortress.core.model
[ERROR] <https://analysis.apache.org/jenkins/job/directory-fortress-commander/org.apache.directory.fortress$fortress-web/ws/src/main/java/org/apache/directory/fortress/web/panel/RoleSearchModalPanel.java>:[67,13]
cannot find symbol
  symbol:   class Constraint
  location: class org.apache.directory.fortress.web.panel.RoleSearchModalPanel
[ERROR] <https://analysis.apache.org/jenkins/job/directory-fortress-commander/org.apache.directory.fortress$fortress-web/ws/src/main/java/org/apache/directory/fortress/web/panel/ConstraintRolePanel.java>:[28,48]
cannot find symbol
  symbol:   class Constraint
  location: package org.apache.directory.fortress.core.model
[ERROR] <https://analysis.apache.org/jenkins/job/directory-fortress-commander/org.apache.directory.fortress$fortress-web/ws/src/main/java/org/apache/directory/fortress/web/panel/ConstraintPanel.java>:[28,48]
cannot find symbol
  symbol:   class Constraint
  location: package org.apache.directory.fortress.core.model
[ERROR] <https://analysis.apache.org/jenkins/job/directory-fortress-commander/org.apache.directory.fortress$fortress-web/ws/src/main/java/org/apache/directory/fortress/web/panel/UserDetailPanel.java>:[64,48]
cannot find symbol
  symbol:   class Constraint
  location: package org.apache.directory.fortress.core.model
[ERROR] <https://analysis.apache.org/jenkins/job/directory-fortress-commander/org.apache.directory.fortress$fortress-web/ws/src/main/java/org/apache/directory/fortress/web/panel/UserDetailPanel.java>:[152,17]
cannot find symbol
  symbol:   class Constraint
  location: class org.apache.directory.fortress.web.panel.UserDetailPanel.UserDetailForm
[ERROR] <https://analysis.apache.org/jenkins/job/directory-fortress-commander/org.apache.directory.fortress$fortress-web/ws/src/main/java/org/apache/directory/fortress/web/panel/ConstraintAdminRolePanel.java>:[29,48]
cannot find symbol
  symbol:   class Constraint
  location: package org.apache.directory.fortress.core.model
[ERROR] <https://analysis.apache.org/jenkins/job/directory-fortress-commander/org.apache.directory.fortress$fortress-web/ws/src/main/java/org/apache/directory/fortress/web/panel/ConstraintBasePanel.java>:[130,21]
cannot find symbol
  symbol: class Constraint
[ERROR] <https://analysis.apache.org/jenkins/job/directory-fortress-commander/org.apache.directory.fortress$fortress-web/ws/src/main/java/org/apache/directory/fortress/web/panel/ConstraintBasePanel.java>:[130,47]
cannot find symbol
  symbol: class Constraint
[ERROR] <https://analysis.apache.org/jenkins/job/directory-fortress-commander/org.apache.directory.fortress$fortress-web/ws/src/main/java/org/apache/directory/fortress/web/panel/ConstraintBasePanel.java>:[148,21]
cannot find symbol
  symbol: class Constraint
[ERROR] <https://analysis.apache.org/jenkins/job/directory-fortress-commander/org.apache.directory.fortress$fortress-web/ws/src/main/java/org/apache/directory/fortress/web/panel/ConstraintBasePanel.java>:[148,47]
cannot find symbol
  symbol: class Constraint
[ERROR] <https://analysis.apache.org/jenkins/job/directory-fortress-commander/org.apache.directory.fortress$fortress-web/ws/src/main/java/org/apache/directory/fortress/web/panel/ConstraintBasePanel.java>:[166,21]
cannot find symbol
  symbol: class Constraint
[ERROR] <https://analysis.apache.org/jenkins/job/directory-fortress-commander/org.apache.directory.fortress$fortress-web/ws/src/main/java/org/apache/directory/fortress/web/panel/ConstraintBasePanel.java>:[166,47]
cannot find symbol
  symbol: class Constraint
[ERROR] <https://analysis.apache.org/jenkins/job/directory-fortress-commander/org.apache.directory.fortress$fortress-web/ws/src/main/java/org/apache/directory/fortress/web/panel/ConstraintBasePanel.java>:[184,21]
cannot find symbol
  symbol: class Constraint
[ERROR] <https://analysis.apache.org/jenkins/job/directory-fortress-commander/org.apache.directory.fortress$fortress-web/ws/src/main/java/org/apache/directory/fortress/web/panel/ConstraintBasePanel.java>:[184,47]
cannot find symbol
  symbol: class Constraint
[ERROR] <https://analysis.apache.org/jenkins/job/directory-fortress-commander/org.apache.directory.fortress$fortress-web/ws/src/main/java/org/apache/directory/fortress/web/panel/ConstraintBasePanel.java>:[202,21]
cannot find symbol
  symbol: class Constraint
[ERROR] <https://analysis.apache.org/jenkins/job/directory-fortress-commander/org.apache.directory.fortress$fortress-web/ws/src/main/java/org/apache/directory/fortress/web/panel/ConstraintBasePanel.java>:[202,47]
cannot find symbol
  symbol: class Constraint
[ERROR] <https://analysis.apache.org/jenkins/job/directory-fortress-commander/org.apache.directory.fortress$fortress-web/ws/src/main/java/org/apache/directory/fortress/web/panel/ConstraintBasePanel.java>:[220,21]
cannot find symbol
  symbol: class Constraint
[ERROR] <https://analysis.apache.org/jenkins/job/directory-fortress-commander/org.apache.directory.fortress$fortress-web/ws/src/main/java/org/apache/directory/fortress/web/panel/ConstraintBasePanel.java>:[220,47]
cannot find symbol
  symbol: class Constraint
[ERROR] <https://analysis.apache.org/jenkins/job/directory-fortress-commander/org.apache.directory.fortress$fortress-web/ws/src/main/java/org/apache/directory/fortress/web/panel/ConstraintBasePanel.java>:[238,21]
cannot find symbol
  symbol: class Constraint
[ERROR] <https://analysis.apache.org/jenkins/job/directory-fortress-commander/org.apache.directory.fortress$fortress-web/ws/src/main/java/org/apache/directory/fortress/web/panel/ConstraintBasePanel.java>:[238,47]
cannot find symbol
  symbol: class Constraint
[ERROR] <https://analysis.apache.org/jenkins/job/directory-fortress-commander/org.apache.directory.fortress$fortress-web/ws/src/main/java/org/apache/directory/fortress/web/panel/ConstraintBasePanel.java>:[253,9]
cannot find symbol
  symbol:   class Constraint
  location: class org.apache.directory.fortress.web.panel.ConstraintBasePanel
[ERROR] <https://analysis.apache.org/jenkins/job/directory-fortress-commander/org.apache.directory.fortress$fortress-web/ws/src/main/java/org/apache/directory/fortress/web/panel/ConstraintBasePanel.java>:[253,35]
cannot find symbol
  symbol:   class Constraint
  location: class org.apache.directory.fortress.web.panel.ConstraintBasePanel
[ERROR] <https://analysis.apache.org/jenkins/job/directory-fortress-commander/org.apache.directory.fortress$fortress-web/ws/src/main/java/org/apache/directory/fortress/web/panel/RoleSearchModalPanel.java>:[107,23]
cannot find symbol
  symbol: class Constraint
[ERROR] <https://analysis.apache.org/jenkins/job/directory-fortress-commander/org.apache.directory.fortress$fortress-web/ws/src/main/java/org/apache/directory/fortress/web/panel/RoleSearchModalPanel.java>:[107,50]
cannot find symbol
  symbol: class Constraint
[ERROR] <https://analysis.apache.org/jenkins/job/directory-fortress-commander/org.apache.directory.fortress$fortress-web/ws/src/main/java/org/apache/directory/fortress/web/panel/RoleSearchModalPanel.java>:[203,13]
cannot find symbol
  symbol:   variable ConstraintUtil
  location: class org.apache.directory.fortress.web.panel.RoleSearchModalPanel
[ERROR] <https://analysis.apache.org/jenkins/job/directory-fortress-commander/org.apache.directory.fortress$fortress-web/ws/src/main/java/org/apache/directory/fortress/web/panel/RoleSearchModalPanel.java>:[215,13]
cannot find symbol
  symbol:   variable ConstraintUtil
  location: class org.apache.directory.fortress.web.panel.RoleSearchModalPanel
[ERROR] <https://analysis.apache.org/jenkins/job/directory-fortress-commander/org.apache.directory.fortress$fortress-web/ws/src/main/java/org/apache/directory/fortress/web/panel/ConstraintRolePanel.java>:[71,21]
cannot find symbol
  symbol: class Constraint
[ERROR] <https://analysis.apache.org/jenkins/job/directory-fortress-commander/org.apache.directory.fortress$fortress-web/ws/src/main/java/org/apache/directory/fortress/web/panel/ConstraintRolePanel.java>:[71,47]
cannot find symbol
  symbol: class Constraint
[ERROR] <https://analysis.apache.org/jenkins/job/directory-fortress-commander/org.apache.directory.fortress$fortress-web/ws/src/main/java/org/apache/directory/fortress/web/panel/ConstraintRolePanel.java>:[90,21]
cannot find symbol
  symbol: class Constraint
[ERROR] <https://analysis.apache.org/jenkins/job/directory-fortress-commander/org.apache.directory.fortress$fortress-web/ws/src/main/java/org/apache/directory/fortress/web/panel/ConstraintRolePanel.java>:[90,47]
cannot find symbol
  symbol: class Constraint
[ERROR] <https://analysis.apache.org/jenkins/job/directory-fortress-commander/org.apache.directory.fortress$fortress-web/ws/src/main/java/org/apache/directory/fortress/web/panel/ConstraintRolePanel.java>:[110,21]
cannot find symbol
  symbol: class Constraint
[ERROR] <https://analysis.apache.org/jenkins/job/directory-fortress-commander/org.apache.directory.fortress$fortress-web/ws/src/main/java/org/apache/directory/fortress/web/panel/ConstraintRolePanel.java>:[110,47]
cannot find symbol
  symbol: class Constraint
[ERROR] <https://analysis.apache.org/jenkins/job/directory-fortress-commander/org.apache.directory.fortress$fortress-web/ws/src/main/java/org/apache/directory/fortress/web/panel/ConstraintRolePanel.java>:[130,21]
cannot find symbol
  symbol: class Constraint
[ERROR] <https://analysis.apache.org/jenkins/job/directory-fortress-commander/org.apache.directory.fortress$fortress-web/ws/src/main/java/org/apache/directory/fortress/web/panel/ConstraintRolePanel.java>:[130,47]
cannot find symbol
  symbol: class Constraint
[ERROR] <https://analysis.apache.org/jenkins/job/directory-fortress-commander/org.apache.directory.fortress$fortress-web/ws/src/main/java/org/apache/directory/fortress/web/panel/ConstraintRolePanel.java>:[150,21]
cannot find symbol
  symbol: class Constraint
[ERROR] <https://analysis.apache.org/jenkins/job/directory-fortress-commander/org.apache.directory.fortress$fortress-web/ws/src/main/java/org/apache/directory/fortress/web/panel/ConstraintRolePanel.java>:[150,47]
cannot find symbol
  symbol: class Constraint
[ERROR] <https://analysis.apache.org/jenkins/job/directory-fortress-commander/org.apache.directory.fortress$fortress-web/ws/src/main/java/org/apache/directory/fortress/web/panel/ConstraintRolePanel.java>:[170,21]
cannot find symbol
  symbol: class Constraint
[ERROR] <https://analysis.apache.org/jenkins/job/directory-fortress-commander/org.apache.directory.fortress$fortress-web/ws/src/main/java/org/apache/directory/fortress/web/panel/ConstraintRolePanel.java>:[170,47]
cannot find symbol
  symbol: class Constraint
[ERROR] <https://analysis.apache.org/jenkins/job/directory-fortress-commander/org.apache.directory.fortress$fortress-web/ws/src/main/java/org/apache/directory/fortress/web/panel/ConstraintPanel.java>:[71,21]
cannot find symbol
  symbol: class Constraint
[ERROR] <https://analysis.apache.org/jenkins/job/directory-fortress-commander/org.apache.directory.fortress$fortress-web/ws/src/main/java/org/apache/directory/fortress/web/panel/ConstraintPanel.java>:[71,47]
cannot find symbol
  symbol: class Constraint
[ERROR] <https://analysis.apache.org/jenkins/job/directory-fortress-commander/org.apache.directory.fortress$fortress-web/ws/src/main/java/org/apache/directory/fortress/web/panel/ConstraintPanel.java>:[90,21]
cannot find symbol
  symbol: class Constraint
[ERROR] <https://analysis.apache.org/jenkins/job/directory-fortress-commander/org.apache.directory.fortress$fortress-web/ws/src/main/java/org/apache/directory/fortress/web/panel/ConstraintPanel.java>:[90,47]
cannot find symbol
  symbol: class Constraint
[ERROR] <https://analysis.apache.org/jenkins/job/directory-fortress-commander/org.apache.directory.fortress$fortress-web/ws/src/main/java/org/apache/directory/fortress/web/panel/ConstraintPanel.java>:[110,21]
cannot find symbol
  symbol: class Constraint
[ERROR] <https://analysis.apache.org/jenkins/job/directory-fortress-commander/org.apache.directory.fortress$fortress-web/ws/src/main/java/org/apache/directory/fortress/web/panel/ConstraintPanel.java>:[110,47]
cannot find symbol
  symbol: class Constraint
[ERROR] <https://analysis.apache.org/jenkins/job/directory-fortress-commander/org.apache.directory.fortress$fortress-web/ws/src/main/java/org/apache/directory/fortress/web/panel/ConstraintPanel.java>:[130,21]
cannot find symbol
  symbol: class Constraint
[ERROR] <https://analysis.apache.org/jenkins/job/directory-fortress-commander/org.apache.directory.fortress$fortress-web/ws/src/main/java/org/apache/directory/fortress/web/panel/ConstraintPanel.java>:[130,47]
cannot find symbol
  symbol: class Constraint
[ERROR] <https://analysis.apache.org/jenkins/job/directory-fortress-commander/org.apache.directory.fortress$fortress-web/ws/src/main/java/org/apache/directory/fortress/web/panel/ConstraintPanel.java>:[150,21]
cannot find symbol
  symbol: class Constraint
[ERROR] <https://analysis.apache.org/jenkins/job/directory-fortress-commander/org.apache.directory.fortress$fortress-web/ws/src/main/java/org/apache/directory/fortress/web/panel/ConstraintPanel.java>:[150,47]
cannot find symbol
  symbol: class Constraint
[ERROR] <https://analysis.apache.org/jenkins/job/directory-fortress-commander/org.apache.directory.fortress$fortress-web/ws/src/main/java/org/apache/directory/fortress/web/panel/ConstraintPanel.java>:[170,21]
cannot find symbol
  symbol: class Constraint
[ERROR] <https://analysis.apache.org/jenkins/job/directory-fortress-commander/org.apache.directory.fortress$fortress-web/ws/src/main/java/org/apache/directory/fortress/web/panel/ConstraintPanel.java>:[170,47]
cannot find symbol
  symbol: class Constraint
[ERROR] <https://analysis.apache.org/jenkins/job/directory-fortress-commander/org.apache.directory.fortress$fortress-web/ws/src/main/java/org/apache/directory/fortress/web/panel/ConstraintAdminRolePanel.java>:[72,21]
cannot find symbol
  symbol: class Constraint
[ERROR] <https://analysis.apache.org/jenkins/job/directory-fortress-commander/org.apache.directory.fortress$fortress-web/ws/src/main/java/org/apache/directory/fortress/web/panel/ConstraintAdminRolePanel.java>:[72,47]
cannot find symbol
  symbol: class Constraint
[ERROR] <https://analysis.apache.org/jenkins/job/directory-fortress-commander/org.apache.directory.fortress$fortress-web/ws/src/main/java/org/apache/directory/fortress/web/panel/ConstraintAdminRolePanel.java>:[91,21]
cannot find symbol
  symbol: class Constraint
[ERROR] <https://analysis.apache.org/jenkins/job/directory-fortress-commander/org.apache.directory.fortress$fortress-web/ws/src/main/java/org/apache/directory/fortress/web/panel/ConstraintAdminRolePanel.java>:[91,47]
cannot find symbol
  symbol: class Constraint
[ERROR] <https://analysis.apache.org/jenkins/job/directory-fortress-commander/org.apache.directory.fortress$fortress-web/ws/src/main/java/org/apache/directory/fortress/web/panel/ConstraintAdminRolePanel.java>:[111,21]
cannot find symbol
  symbol: class Constraint
[ERROR] <https://analysis.apache.org/jenkins/job/directory-fortress-commander/org.apache.directory.fortress$fortress-web/ws/src/main/java/org/apache/directory/fortress/web/panel/ConstraintAdminRolePanel.java>:[111,47]
cannot find symbol
  symbol: class Constraint
[ERROR] <https://analysis.apache.org/jenkins/job/directory-fortress-commander/org.apache.directory.fortress$fortress-web/ws/src/main/java/org/apache/directory/fortress/web/panel/ConstraintAdminRolePanel.java>:[131,21]
cannot find symbol
  symbol: class Constraint
[ERROR] <https://analysis.apache.org/jenkins/job/directory-fortress-commander/org.apache.directory.fortress$fortress-web/ws/src/main/java/org/apache/directory/fortress/web/panel/ConstraintAdminRolePanel.java>:[131,47]
cannot find symbol
  symbol: class Constraint
[ERROR] <https://analysis.apache.org/jenkins/job/directory-fortress-commander/org.apache.directory.fortress$fortress-web/ws/src/main/java/org/apache/directory/fortress/web/panel/ConstraintAdminRolePanel.java>:[151,21]
cannot find symbol
  symbol: class Constraint
[ERROR] <https://analysis.apache.org/jenkins/job/directory-fortress-commander/org.apache.directory.fortress$fortress-web/ws/src/main/java/org/apache/directory/fortress/web/panel/ConstraintAdminRolePanel.java>:[151,47]
cannot find symbol
  symbol: class Constraint
[ERROR] <https://analysis.apache.org/jenkins/job/directory-fortress-commander/org.apache.directory.fortress$fortress-web/ws/src/main/java/org/apache/directory/fortress/web/panel/ConstraintAdminRolePanel.java>:[171,21]
cannot find symbol
  symbol: class Constraint
[ERROR] <https://analysis.apache.org/jenkins/job/directory-fortress-commander/org.apache.directory.fortress$fortress-web/ws/src/main/java/org/apache/directory/fortress/web/panel/ConstraintAdminRolePanel.java>:[171,47]
cannot find symbol
  symbol: class Constraint
[INFO] 66 errors 
[INFO] -------------------------------------------------------------

Mime
View raw message