directory-notifications mailing list archives

Site index · List index
Message view « Date » · « Thread »
Top « Date » · « Thread »
From gmcdon...@apache.org
Subject Build failed in Jenkins: directory-kerby » Kerby Kdc Test #48
Date Fri, 26 Jun 2015 06:21:38 GMT
See <https://analysis.apache.org/jenkins/job/directory-kerby/org.apache.kerby$kerby-kdc-test/48/changes>

Changes:

[drankye] Fixed an issue in four passes negotiation case between client and kdc

------------------------------------------
[INFO]                                                                         
[INFO] ------------------------------------------------------------------------
[INFO] Building Kerby Kdc Test 1.0-SNAPSHOT
[INFO] ------------------------------------------------------------------------
[INFO] 
[INFO] --- maven-clean-plugin:2.6.1:clean (default-clean) @ kerby-kdc-test ---
[INFO] Deleting <https://analysis.apache.org/jenkins/job/directory-kerby/org.apache.kerby$kerby-kdc-test/ws/target>
[INFO] 
[INFO] --- maven-pmd-plugin:3.4:pmd (pmd) @ kerby-kdc-test ---
[INFO] 
[INFO] --- maven-pmd-plugin:3.4:check (validate) @ kerby-kdc-test ---
[INFO] 
[INFO] 
[INFO] --- maven-resources-plugin:2.7:resources (default-resources) @ kerby-kdc-test ---
[WARNING] Using platform encoding (UTF-8 actually) to copy filtered resources, i.e. build
is platform dependent!
[INFO] Copying 9 resources
[INFO] 
[INFO] --- maven-compiler-plugin:3.3:compile (default-compile) @ kerby-kdc-test ---
[INFO] No sources to compile
[INFO] 
[INFO] --- maven-compiler-plugin:3.3:compile (default) @ kerby-kdc-test ---
[INFO] No sources to compile
[INFO] 
[INFO] --- maven-resources-plugin:2.7:testResources (default-testResources) @ kerby-kdc-test
---
[WARNING] Using platform encoding (UTF-8 actually) to copy filtered resources, i.e. build
is platform dependent!
[INFO] Copying 3 resources
[INFO] 
[INFO] --- maven-compiler-plugin:3.3:testCompile (default-testCompile) @ kerby-kdc-test ---
[INFO] Changes detected - recompiling the module!
[INFO] Compiling 13 source files to <https://analysis.apache.org/jenkins/job/directory-kerby/org.apache.kerby$kerby-kdc-test/ws/target/test-classes>
[INFO] -------------------------------------------------------------
[ERROR] COMPILATION ERROR : 
[INFO] -------------------------------------------------------------
[ERROR] <https://analysis.apache.org/jenkins/job/directory-kerby/org.apache.kerby$kerby-kdc-test/ws/src/test/java/org/apache/kerby/kerberos/kdc/WithTokenKdcTest.java>:[99,31]
unreported exception org.apache.kerby.kerberos.kerb.KrbException; must be caught or declared
to be thrown
[ERROR] <https://analysis.apache.org/jenkins/job/directory-kerby/org.apache.kerby$kerby-kdc-test/ws/src/test/java/org/apache/kerby/kerberos/kdc/WithTokenKdcTest.java>:[101,34]
unreported exception org.apache.kerby.kerberos.kerb.KrbException; must be caught or declared
to be thrown
[INFO] 2 errors 
[INFO] -------------------------------------------------------------

Mime
View raw message