directory-notifications mailing list archives

Site index · List index
Message view « Date » · « Thread »
Top « Date » · « Thread »
From gmcdon...@apache.org
Subject Build failed in Jenkins: directory-kerby #51
Date Mon, 29 Jun 2015 06:21:25 GMT
See <https://analysis.apache.org/jenkins/job/directory-kerby/51/changes>

Changes:

[drankye] Refined KDC side APIs and codes

------------------------------------------
[...truncated 1138 lines...]
[INFO] --- maven-pmd-plugin:3.4:pmd (pmd) @ ldap-backend ---
[INFO] 
[INFO] --- maven-pmd-plugin:3.4:check (validate) @ ldap-backend ---
[INFO] 
[INFO] 
[INFO] --- maven-resources-plugin:2.7:resources (default-resources) @ ldap-backend ---
[WARNING] Using platform encoding (UTF-8 actually) to copy filtered resources, i.e. build
is platform dependent!
[INFO] skip non existing resourceDirectory <https://analysis.apache.org/jenkins/job/directory-kerby/ws/kerby-backend/ldap-backend/src/main/resources>
[INFO] 
[INFO] --- maven-compiler-plugin:3.3:compile (default-compile) @ ldap-backend ---
[INFO] Changes detected - recompiling the module!
[INFO] Compiling 2 source files to <https://analysis.apache.org/jenkins/job/directory-kerby/ws/kerby-backend/ldap-backend/target/classes>
[INFO] 
[INFO] --- maven-compiler-plugin:3.3:compile (default) @ ldap-backend ---
[INFO] Changes detected - recompiling the module!
[INFO] Compiling 2 source files to <https://analysis.apache.org/jenkins/job/directory-kerby/ws/kerby-backend/ldap-backend/target/classes>
[INFO] 
[INFO] --- maven-resources-plugin:2.7:testResources (default-testResources) @ ldap-backend
---
[WARNING] Using platform encoding (UTF-8 actually) to copy filtered resources, i.e. build
is platform dependent!
[INFO] skip non existing resourceDirectory <https://analysis.apache.org/jenkins/job/directory-kerby/ws/kerby-backend/ldap-backend/src/test/resources>
[INFO] 
[INFO] --- maven-compiler-plugin:3.3:testCompile (default-testCompile) @ ldap-backend ---
[INFO] Changes detected - recompiling the module!
[INFO] Compiling 2 source files to <https://analysis.apache.org/jenkins/job/directory-kerby/ws/kerby-backend/ldap-backend/target/test-classes>
[INFO] 
[INFO] --- maven-surefire-plugin:2.18.1:test (default-test) @ ldap-backend ---
[INFO] Tests are skipped.
[INFO] 
[INFO] --- maven-jar-plugin:2.5:jar (default-jar) @ ldap-backend ---
[INFO] Building jar: <https://analysis.apache.org/jenkins/job/directory-kerby/ws/kerby-backend/ldap-backend/target/ldap-backend-1.0-SNAPSHOT.jar>
[INFO] 
[INFO] --- maven-install-plugin:2.5.2:install (default-install) @ ldap-backend ---
[INFO] Installing <https://analysis.apache.org/jenkins/job/directory-kerby/ws/kerby-backend/ldap-backend/target/ldap-backend-1.0-SNAPSHOT.jar>
to /x1/jenkins/mvn-repo/org/apache/kerby/ldap-backend/1.0-SNAPSHOT/ldap-backend-1.0-SNAPSHOT.jar
[INFO] Installing <https://analysis.apache.org/jenkins/job/directory-kerby/ws/kerby-backend/ldap-backend/pom.xml>
to /x1/jenkins/mvn-repo/org/apache/kerby/ldap-backend/1.0-SNAPSHOT/ldap-backend-1.0-SNAPSHOT.pom
[INFO]                                                                         
[INFO] ------------------------------------------------------------------------
[INFO] Building Kerby Distribution 1.0-SNAPSHOT
[INFO] ------------------------------------------------------------------------
[INFO] 
[INFO] --- maven-clean-plugin:2.6.1:clean (default-clean) @ kerby-dist ---
[INFO] 
[INFO] --- maven-pmd-plugin:3.4:pmd (pmd) @ kerby-dist ---
[INFO] 
[INFO] --- maven-pmd-plugin:3.4:check (validate) @ kerby-dist ---
[INFO] 
[INFO] --- maven-compiler-plugin:3.3:compile (default) @ kerby-dist ---
[INFO] No sources to compile
[INFO] 
[INFO] --- maven-install-plugin:2.5.2:install (default-install) @ kerby-dist ---
[INFO] Installing <https://analysis.apache.org/jenkins/job/directory-kerby/ws/kerby-dist/pom.xml>
to /x1/jenkins/mvn-repo/org/apache/kerby/kerby-dist/1.0-SNAPSHOT/kerby-dist-1.0-SNAPSHOT.pom
[INFO]                                                                         
[INFO] ------------------------------------------------------------------------
[INFO] Building KDC Dist 1.0-SNAPSHOT
[INFO] ------------------------------------------------------------------------
[INFO] 
[INFO] --- maven-clean-plugin:2.6.1:clean (default-clean) @ kdc-dist ---
[INFO] 
[INFO] --- maven-pmd-plugin:3.4:pmd (pmd) @ kdc-dist ---
[INFO] 
[INFO] --- maven-pmd-plugin:3.4:check (validate) @ kdc-dist ---
[INFO] 
[INFO] --- maven-compiler-plugin:3.3:compile (default) @ kdc-dist ---
[INFO] No sources to compile
[INFO] 
[INFO] --- maven-install-plugin:2.5.2:install (default-install) @ kdc-dist ---
[INFO] Installing <https://analysis.apache.org/jenkins/job/directory-kerby/ws/kerby-dist/kdc-dist/pom.xml>
to /x1/jenkins/mvn-repo/org/apache/kerby/kdc-dist/1.0-SNAPSHOT/kdc-dist-1.0-SNAPSHOT.pom
[INFO]                                                                         
[INFO] ------------------------------------------------------------------------
[INFO] Building Tool Dist 1.0-SNAPSHOT
[INFO] ------------------------------------------------------------------------
[INFO] 
[INFO] --- maven-clean-plugin:2.6.1:clean (default-clean) @ tool-dist ---
[INFO] 
[INFO] --- maven-pmd-plugin:3.4:pmd (pmd) @ tool-dist ---
[INFO] 
[INFO] --- maven-pmd-plugin:3.4:check (validate) @ tool-dist ---
[INFO] 
[INFO] --- maven-compiler-plugin:3.3:compile (default) @ tool-dist ---
[INFO] No sources to compile
[INFO] 
[INFO] --- maven-install-plugin:2.5.2:install (default-install) @ tool-dist ---
[INFO] Installing <https://analysis.apache.org/jenkins/job/directory-kerby/ws/kerby-dist/tool-dist/pom.xml>
to /x1/jenkins/mvn-repo/org/apache/kerby/tool-dist/1.0-SNAPSHOT/tool-dist-1.0-SNAPSHOT.pom
[INFO]                                                                         
[INFO] ------------------------------------------------------------------------
[INFO] Building Kerby benchmark 1.0-SNAPSHOT
[INFO] ------------------------------------------------------------------------
[INFO] 
[INFO] --- maven-clean-plugin:2.6.1:clean (default-clean) @ benchmark ---
[INFO] Deleting <https://analysis.apache.org/jenkins/job/directory-kerby/ws/benchmark/target>
[INFO] 
[INFO] --- maven-pmd-plugin:3.4:pmd (pmd) @ benchmark ---
[INFO] 
[INFO] --- maven-pmd-plugin:3.4:check (validate) @ benchmark ---
[INFO] 
[INFO] 
[INFO] --- maven-resources-plugin:2.7:resources (default-resources) @ benchmark ---
[WARNING] Using platform encoding (UTF-8 actually) to copy filtered resources, i.e. build
is platform dependent!
[INFO] Copying 1 resource
[INFO] 
[INFO] --- maven-compiler-plugin:3.3:compile (default-compile) @ benchmark ---
[INFO] No sources to compile
[INFO] 
[INFO] --- maven-compiler-plugin:3.3:compile (default) @ benchmark ---
[INFO] No sources to compile
[INFO] 
[INFO] --- maven-resources-plugin:2.7:testResources (default-testResources) @ benchmark ---
[WARNING] Using platform encoding (UTF-8 actually) to copy filtered resources, i.e. build
is platform dependent!
[INFO] skip non existing resourceDirectory <https://analysis.apache.org/jenkins/job/directory-kerby/ws/benchmark/src/test/resources>
[INFO] 
[INFO] --- maven-compiler-plugin:3.3:testCompile (default-testCompile) @ benchmark ---
[INFO] Changes detected - recompiling the module!
[INFO] Compiling 1 source file to <https://analysis.apache.org/jenkins/job/directory-kerby/ws/benchmark/target/test-classes>
[INFO] 
[INFO] --- maven-surefire-plugin:2.18.1:test (default-test) @ benchmark ---
[INFO] Tests are skipped.
[INFO] 
[INFO] --- maven-jar-plugin:2.5:jar (default-jar) @ benchmark ---
[INFO] Building jar: <https://analysis.apache.org/jenkins/job/directory-kerby/ws/benchmark/target/benchmark-1.0-SNAPSHOT.jar>
[INFO] 
[INFO] --- maven-install-plugin:2.5.2:install (default-install) @ benchmark ---
[INFO] Installing <https://analysis.apache.org/jenkins/job/directory-kerby/ws/benchmark/target/benchmark-1.0-SNAPSHOT.jar>
to /x1/jenkins/mvn-repo/org/apache/kerby/benchmark/1.0-SNAPSHOT/benchmark-1.0-SNAPSHOT.jar
[INFO] Installing <https://analysis.apache.org/jenkins/job/directory-kerby/ws/benchmark/pom.xml>
to /x1/jenkins/mvn-repo/org/apache/kerby/benchmark/1.0-SNAPSHOT/benchmark-1.0-SNAPSHOT.pom
[INFO] ------------------------------------------------------------------------
[INFO] Reactor Summary:
[INFO] 
[INFO] Apache Kerby Project .............................. SUCCESS [4.856s]
[INFO] Lib Projects ...................................... SUCCESS [0.500s]
[INFO] Kerby Config ...................................... SUCCESS [7.244s]
[INFO] Kerby Util ........................................ SUCCESS [3.033s]
[INFO] Kerby ASN1 Project ................................ SUCCESS [4.630s]
[INFO] Kerby-kerb Project ................................ SUCCESS [0.214s]
[INFO] Kerby-kerb core ................................... SUCCESS [4.785s]
[INFO] Kerby-kerb Crypto ................................. SUCCESS [5.984s]
[INFO] Kerby-kerb Util ................................... SUCCESS [2.125s]
[INFO] kerby-kerb-coreTest ............................... SUCCESS [0.713s]
[INFO] Kerby-kerb Common ................................. SUCCESS [1.525s]
[INFO] Kerby-kerb Identity ............................... SUCCESS [1.049s]
[INFO] Kerby-kerb Identity Test .......................... SUCCESS [0.871s]
[INFO] Kerby-kerb Client ................................. SUCCESS [2.292s]
[INFO] Kerby-kerb Server ................................. SUCCESS [1.813s]
[INFO] Kerby-kerb Admin .................................. SUCCESS [1.161s]
[INFO] Kerb Simple Kdc ................................... SUCCESS [0.798s]
[INFO] Kerb Kdc Test ..................................... SUCCESS [1.009s]
[INFO] Kerby-kerb client api all ......................... SUCCESS [0.223s]
[INFO] Kerby-kerb server all ............................. SUCCESS [0.197s]
[INFO] Kerby KDC Server .................................. SUCCESS [1.637s]
[INFO] Kerby providers ................................... SUCCESS [0.213s]
[INFO] Token provider .................................... SUCCESS [1.620s]
[INFO] Kdc Tool Project .................................. SUCCESS [0.168s]
[INFO] Client Tool ....................................... SUCCESS [1.638s]
[INFO] KDC Tool .......................................... SUCCESS [1.301s]
[INFO] Kerby Backend ..................................... SUCCESS [0.168s]
[INFO] Json identity backend ............................. SUCCESS [1.300s]
[INFO] Zookeeper identity backend ........................ SUCCESS [1.387s]
[INFO] Kerby Kdc Test .................................... FAILURE [0.744s]
[INFO] Ldap identity backend ............................. SUCCESS [4.237s]
[INFO] Kerby Distribution ................................ SUCCESS [0.119s]
[INFO] KDC Dist .......................................... SUCCESS [0.156s]
[INFO] Tool Dist ......................................... SUCCESS [0.242s]
[INFO] Kerby benchmark ................................... SUCCESS [3.071s]
[INFO] ------------------------------------------------------------------------
[INFO] BUILD FAILURE
[INFO] ------------------------------------------------------------------------
[INFO] Total time: 1:07.498s
[INFO] Finished at: Mon Jun 29 06:21:23 UTC 2015
[INFO] Final Memory: 72M/324M
[INFO] ------------------------------------------------------------------------
Waiting for Jenkins to finish collecting data[ERROR] Failed to execute goal org.apache.maven.plugins:maven-compiler-plugin:3.3:testCompile
(default-testCompile) on project kerby-kdc-test: Compilation failure: Compilation failure:
[ERROR] <https://analysis.apache.org/jenkins/job/directory-kerby/ws/kerby-kdc-test/src/test/java/org/apache/kerby/kerberos/kdc/WithTokenKdcTest.java>:[101,52]
cannot find symbol
[ERROR] symbol:   variable TEST_PASSWORD
[ERROR] location: class org.apache.kerby.kerberos.kdc.WithTokenKdcTest
[ERROR] <https://analysis.apache.org/jenkins/job/directory-kerby/ws/kerby-kdc-test/src/test/java/org/apache/kerby/kerberos/kdc/WithTokenKdcTest.java>:[109,48]
cannot find symbol
[ERROR] symbol:   variable TEST_PASSWORD
[ERROR] location: class org.apache.kerby.kerberos.kdc.WithTokenKdcTest
[ERROR] <https://analysis.apache.org/jenkins/job/directory-kerby/ws/kerby-kdc-test/src/test/java/org/apache/kerby/kerberos/kdc/WithTokenKdcTest.java>:[119,72]
kdcRealm has private access in org.apache.kerby.kerberos.kerb.server.KdcTestBase
[ERROR] <https://analysis.apache.org/jenkins/job/directory-kerby/ws/kerby-kdc-test/src/test/java/org/apache/kerby/kerberos/kdc/WithTokenKdcTest.java>:[120,46]
kdcRealm has private access in org.apache.kerby.kerberos.kerb.server.KdcTestBase
[ERROR] <https://analysis.apache.org/jenkins/job/directory-kerby/ws/kerby-kdc-test/src/test/java/org/apache/kerby/kerberos/kdc/WithTokenKdcTest.java>:[128,46]
kdcRealm has private access in org.apache.kerby.kerberos.kerb.server.KdcTestBase
[ERROR] -> [Help 1]
[ERROR] 
[ERROR] To see the full stack trace of the errors, re-run Maven with the -e switch.
[ERROR] Re-run Maven using the -X switch to enable full debug logging.
[ERROR] 
[ERROR] For more information about the errors and possible solutions, please read the following
articles:
[ERROR] [Help 1] http://cwiki.apache.org/confluence/display/MAVEN/MojoFailureException
[ERROR] 
[ERROR] After correcting the problems, you can resume the build with the command
[ERROR]   mvn <goals> -rf :kerby-kdc-test

[JENKINS] Archiving <https://analysis.apache.org/jenkins/job/directory-kerby/ws/kerby-backend/ldap-backend/pom.xml>
to org.apache.kerby/ldap-backend/1.0-SNAPSHOT/ldap-backend-1.0-SNAPSHOT.pom
[JENKINS] Archiving <https://analysis.apache.org/jenkins/job/directory-kerby/ws/kerby-backend/ldap-backend/target/ldap-backend-1.0-SNAPSHOT.jar>
to org.apache.kerby/ldap-backend/1.0-SNAPSHOT/ldap-backend-1.0-SNAPSHOT.jar
[JENKINS] Archiving <https://analysis.apache.org/jenkins/job/directory-kerby/ws/kerby-backend/json-backend/pom.xml>
to org.apache.kerby/json-backend/1.0-SNAPSHOT/json-backend-1.0-SNAPSHOT.pom
[JENKINS] Archiving <https://analysis.apache.org/jenkins/job/directory-kerby/ws/kerby-backend/json-backend/target/json-backend-1.0-SNAPSHOT.jar>
to org.apache.kerby/json-backend/1.0-SNAPSHOT/json-backend-1.0-SNAPSHOT.jar
[JENKINS] Archiving <https://analysis.apache.org/jenkins/job/directory-kerby/ws/lib/pom.xml>
to org.apache.kerby/lib/1.0-SNAPSHOT/lib-1.0-SNAPSHOT.pom
[JENKINS] Archiving <https://analysis.apache.org/jenkins/job/directory-kerby/ws/kerby-kdc-test/pom.xml>
to org.apache.kerby/kerby-kdc-test/1.0-SNAPSHOT/kerby-kdc-test-1.0-SNAPSHOT.pom
[JENKINS] Archiving <https://analysis.apache.org/jenkins/job/directory-kerby/ws/kerby-kerb/kerb-util/pom.xml>
to org.apache.kerby/kerb-util/1.0-SNAPSHOT/kerb-util-1.0-SNAPSHOT.pom
[JENKINS] Archiving <https://analysis.apache.org/jenkins/job/directory-kerby/ws/kerby-kerb/kerb-util/target/kerb-util-1.0-SNAPSHOT.jar>
to org.apache.kerby/kerb-util/1.0-SNAPSHOT/kerb-util-1.0-SNAPSHOT.jar
[JENKINS] Archiving <https://analysis.apache.org/jenkins/job/directory-kerby/ws/kerby-kerb/kerb-crypto/pom.xml>
to org.apache.kerby/kerb-crypto/1.0-SNAPSHOT/kerb-crypto-1.0-SNAPSHOT.pom
[JENKINS] Archiving <https://analysis.apache.org/jenkins/job/directory-kerby/ws/kerby-kerb/kerb-crypto/target/kerb-crypto-1.0-SNAPSHOT.jar>
to org.apache.kerby/kerb-crypto/1.0-SNAPSHOT/kerb-crypto-1.0-SNAPSHOT.jar
[JENKINS] Archiving <https://analysis.apache.org/jenkins/job/directory-kerby/ws/kerby-provider/token-provider/pom.xml>
to org.apache.kerby/token-provider/1.0-SNAPSHOT/token-provider-1.0-SNAPSHOT.pom
[JENKINS] Archiving <https://analysis.apache.org/jenkins/job/directory-kerby/ws/kerby-provider/token-provider/target/token-provider-1.0-SNAPSHOT.jar>
to org.apache.kerby/token-provider/1.0-SNAPSHOT/token-provider-1.0-SNAPSHOT.jar
[JENKINS] Archiving <https://analysis.apache.org/jenkins/job/directory-kerby/ws/kerby-kerb/kerb-client-api-all/pom.xml>
to org.apache.kerby/kerb-client-api-all/1.0-SNAPSHOT/kerb-client-api-all-1.0-SNAPSHOT.pom
[JENKINS] Archiving <https://analysis.apache.org/jenkins/job/directory-kerby/ws/kerby-tool/client-tool/pom.xml>
to org.apache.kerby/client-tool/1.0-SNAPSHOT/client-tool-1.0-SNAPSHOT.pom
[JENKINS] Archiving <https://analysis.apache.org/jenkins/job/directory-kerby/ws/kerby-tool/client-tool/target/client-tool-1.0-SNAPSHOT.jar>
to org.apache.kerby/client-tool/1.0-SNAPSHOT/client-tool-1.0-SNAPSHOT.jar
[JENKINS] Archiving <https://analysis.apache.org/jenkins/job/directory-kerby/ws/kerby-dist/pom.xml>
to org.apache.kerby/kerby-dist/1.0-SNAPSHOT/kerby-dist-1.0-SNAPSHOT.pom
[JENKINS] Archiving <https://analysis.apache.org/jenkins/job/directory-kerby/ws/kerby-kerb/kerb-server/pom.xml>
to org.apache.kerby/kerb-server/1.0-SNAPSHOT/kerb-server-1.0-SNAPSHOT.pom
[JENKINS] Archiving <https://analysis.apache.org/jenkins/job/directory-kerby/ws/kerby-kerb/kerb-server/target/kerb-server-1.0-SNAPSHOT.jar>
to org.apache.kerby/kerb-server/1.0-SNAPSHOT/kerb-server-1.0-SNAPSHOT.jar
[JENKINS] Archiving <https://analysis.apache.org/jenkins/job/directory-kerby/ws/kerby-tool/kdc-tool/pom.xml>
to org.apache.kerby/kdc-tool/1.0-SNAPSHOT/kdc-tool-1.0-SNAPSHOT.pom
[JENKINS] Archiving <https://analysis.apache.org/jenkins/job/directory-kerby/ws/kerby-tool/kdc-tool/target/kdc-tool-1.0-SNAPSHOT.jar>
to org.apache.kerby/kdc-tool/1.0-SNAPSHOT/kdc-tool-1.0-SNAPSHOT.jar
[JENKINS] Archiving <https://analysis.apache.org/jenkins/job/directory-kerby/ws/kerby-dist/kdc-dist/pom.xml>
to org.apache.kerby/kdc-dist/1.0-SNAPSHOT/kdc-dist-1.0-SNAPSHOT.pom
[JENKINS] Archiving <https://analysis.apache.org/jenkins/job/directory-kerby/ws/kerby-asn1/pom.xml>
to org.apache.kerby/kerby-asn1/1.0-SNAPSHOT/kerby-asn1-1.0-SNAPSHOT.pom
[JENKINS] Archiving <https://analysis.apache.org/jenkins/job/directory-kerby/ws/kerby-asn1/target/kerby-asn1-1.0-SNAPSHOT.jar>
to org.apache.kerby/kerby-asn1/1.0-SNAPSHOT/kerby-asn1-1.0-SNAPSHOT.jar
[JENKINS] Archiving <https://analysis.apache.org/jenkins/job/directory-kerby/ws/benchmark/pom.xml>
to org.apache.kerby/benchmark/1.0-SNAPSHOT/benchmark-1.0-SNAPSHOT.pom
[JENKINS] Archiving <https://analysis.apache.org/jenkins/job/directory-kerby/ws/benchmark/target/benchmark-1.0-SNAPSHOT.jar>
to org.apache.kerby/benchmark/1.0-SNAPSHOT/benchmark-1.0-SNAPSHOT.jar
[JENKINS] Archiving <https://analysis.apache.org/jenkins/job/directory-kerby/ws/kerby-provider/pom.xml>
to org.apache.kerby/kerby-provider/1.0-SNAPSHOT/kerby-provider-1.0-SNAPSHOT.pom
[JENKINS] Archiving <https://analysis.apache.org/jenkins/job/directory-kerby/ws/kerby-kerb/kerb-admin/pom.xml>
to org.apache.kerby/kerb-admin/1.0-SNAPSHOT/kerb-admin-1.0-SNAPSHOT.pom
[JENKINS] Archiving <https://analysis.apache.org/jenkins/job/directory-kerby/ws/kerby-kerb/kerb-admin/target/kerb-admin-1.0-SNAPSHOT.jar>
to org.apache.kerby/kerb-admin/1.0-SNAPSHOT/kerb-admin-1.0-SNAPSHOT.jar
[JENKINS] Archiving <https://analysis.apache.org/jenkins/job/directory-kerby/ws/kerby-kerb/kerb-simplekdc/pom.xml>
to org.apache.kerby/kerb-simplekdc/1.0-SNAPSHOT/kerb-simplekdc-1.0-SNAPSHOT.pom
[JENKINS] Archiving <https://analysis.apache.org/jenkins/job/directory-kerby/ws/kerby-kerb/kerb-simplekdc/target/kerb-simplekdc-1.0-SNAPSHOT.jar>
to org.apache.kerby/kerb-simplekdc/1.0-SNAPSHOT/kerb-simplekdc-1.0-SNAPSHOT.jar
[JENKINS] Archiving <https://analysis.apache.org/jenkins/job/directory-kerby/ws/kerby-kerb/kerb-core-test/pom.xml>
to org.apache.kerby/kerb-core-test/1.0-SNAPSHOT/kerb-core-test-1.0-SNAPSHOT.pom
[JENKINS] Archiving <https://analysis.apache.org/jenkins/job/directory-kerby/ws/kerby-kerb/kerb-core-test/target/kerb-core-test-1.0-SNAPSHOT.jar>
to org.apache.kerby/kerb-core-test/1.0-SNAPSHOT/kerb-core-test-1.0-SNAPSHOT.jar
[JENKINS] Archiving <https://analysis.apache.org/jenkins/job/directory-kerby/ws/kerby-kerb/kerb-client/pom.xml>
to org.apache.kerby/kerb-client/1.0-SNAPSHOT/kerb-client-1.0-SNAPSHOT.pom
[JENKINS] Archiving <https://analysis.apache.org/jenkins/job/directory-kerby/ws/kerby-kerb/kerb-client/target/kerb-client-1.0-SNAPSHOT.jar>
to org.apache.kerby/kerb-client/1.0-SNAPSHOT/kerb-client-1.0-SNAPSHOT.jar
[JENKINS] Archiving <https://analysis.apache.org/jenkins/job/directory-kerby/ws/kerby-kerb/pom.xml>
to org.apache.kerby/kerby-kerb/1.0-SNAPSHOT/kerby-kerb-1.0-SNAPSHOT.pom
[JENKINS] Archiving <https://analysis.apache.org/jenkins/job/directory-kerby/ws/kerby-backend/zookeeper-backend/pom.xml>
to org.apache.kerby/zookeeper-backend/1.0-SNAPSHOT/zookeeper-backend-1.0-SNAPSHOT.pom
[JENKINS] Archiving <https://analysis.apache.org/jenkins/job/directory-kerby/ws/kerby-backend/zookeeper-backend/target/zookeeper-backend-1.0-SNAPSHOT.jar>
to org.apache.kerby/zookeeper-backend/1.0-SNAPSHOT/zookeeper-backend-1.0-SNAPSHOT.jar
[JENKINS] Archiving <https://analysis.apache.org/jenkins/job/directory-kerby/ws/lib/kerby-config/pom.xml>
to org.apache.kerby/kerby-config/1.0-SNAPSHOT/kerby-config-1.0-SNAPSHOT.pom
[JENKINS] Archiving <https://analysis.apache.org/jenkins/job/directory-kerby/ws/lib/kerby-config/target/kerby-config-1.0-SNAPSHOT.jar>
to org.apache.kerby/kerby-config/1.0-SNAPSHOT/kerby-config-1.0-SNAPSHOT.jar
[JENKINS] Archiving <https://analysis.apache.org/jenkins/job/directory-kerby/ws/lib/kerby-util/pom.xml>
to org.apache.kerby/kerby-util/1.0-SNAPSHOT/kerby-util-1.0-SNAPSHOT.pom
[JENKINS] Archiving <https://analysis.apache.org/jenkins/job/directory-kerby/ws/lib/kerby-util/target/kerby-util-1.0-SNAPSHOT.jar>
to org.apache.kerby/kerby-util/1.0-SNAPSHOT/kerby-util-1.0-SNAPSHOT.jar
[JENKINS] Archiving <https://analysis.apache.org/jenkins/job/directory-kerby/ws/kerby-kerb/kerb-common/pom.xml>
to org.apache.kerby/kerb-common/1.0-SNAPSHOT/kerb-common-1.0-SNAPSHOT.pom
[JENKINS] Archiving <https://analysis.apache.org/jenkins/job/directory-kerby/ws/kerby-kerb/kerb-common/target/kerb-common-1.0-SNAPSHOT.jar>
to org.apache.kerby/kerb-common/1.0-SNAPSHOT/kerb-common-1.0-SNAPSHOT.jar
[JENKINS] Archiving <https://analysis.apache.org/jenkins/job/directory-kerby/ws/kerby-kerb/kerb-core/pom.xml>
to org.apache.kerby/kerb-core/1.0-SNAPSHOT/kerb-core-1.0-SNAPSHOT.pom
[JENKINS] Archiving <https://analysis.apache.org/jenkins/job/directory-kerby/ws/kerby-kerb/kerb-core/target/kerb-core-1.0-SNAPSHOT.jar>
to org.apache.kerby/kerb-core/1.0-SNAPSHOT/kerb-core-1.0-SNAPSHOT.jar
[JENKINS] Archiving <https://analysis.apache.org/jenkins/job/directory-kerby/ws/kerby-kdc/pom.xml>
to org.apache.kerby/kerby-kdc/1.0-SNAPSHOT/kerby-kdc-1.0-SNAPSHOT.pom
[JENKINS] Archiving <https://analysis.apache.org/jenkins/job/directory-kerby/ws/kerby-kdc/target/kerby-kdc-1.0-SNAPSHOT.jar>
to org.apache.kerby/kerby-kdc/1.0-SNAPSHOT/kerby-kdc-1.0-SNAPSHOT.jar
[JENKINS] Archiving <https://analysis.apache.org/jenkins/job/directory-kerby/ws/kerby-kerb/kerb-identity/pom.xml>
to org.apache.kerby/kerb-identity/1.0-SNAPSHOT/kerb-identity-1.0-SNAPSHOT.pom
[JENKINS] Archiving <https://analysis.apache.org/jenkins/job/directory-kerby/ws/kerby-kerb/kerb-identity/target/kerb-identity-1.0-SNAPSHOT.jar>
to org.apache.kerby/kerb-identity/1.0-SNAPSHOT/kerb-identity-1.0-SNAPSHOT.jar
[JENKINS] Archiving <https://analysis.apache.org/jenkins/job/directory-kerby/ws/kerby-backend/pom.xml>
to org.apache.kerby/kerby-backend/1.0-SNAPSHOT/kerby-backend-1.0-SNAPSHOT.pom
[JENKINS] Archiving <https://analysis.apache.org/jenkins/job/directory-kerby/ws/kerby-tool/pom.xml>
to org.apache.kerby/kerby-tool/1.0-SNAPSHOT/kerby-tool-1.0-SNAPSHOT.pom
[JENKINS] Archiving <https://analysis.apache.org/jenkins/job/directory-kerby/ws/pom.xml>
to org.apache.kerby/kerby-all/1.0-SNAPSHOT/kerby-all-1.0-SNAPSHOT.pom
[JENKINS] Archiving <https://analysis.apache.org/jenkins/job/directory-kerby/ws/kerby-kerb/kerb-kdc-test/pom.xml>
to org.apache.kerby/kerb-kdc-test/1.0-SNAPSHOT/kerb-kdc-test-1.0-SNAPSHOT.pom
[JENKINS] Archiving <https://analysis.apache.org/jenkins/job/directory-kerby/ws/kerby-kerb/kerb-kdc-test/target/kerb-kdc-test-1.0-SNAPSHOT.jar>
to org.apache.kerby/kerb-kdc-test/1.0-SNAPSHOT/kerb-kdc-test-1.0-SNAPSHOT.jar
[JENKINS] Archiving <https://analysis.apache.org/jenkins/job/directory-kerby/ws/kerby-dist/tool-dist/pom.xml>
to org.apache.kerby/tool-dist/1.0-SNAPSHOT/tool-dist-1.0-SNAPSHOT.pom
[JENKINS] Archiving <https://analysis.apache.org/jenkins/job/directory-kerby/ws/kerby-kerb/kerb-identity-test/pom.xml>
to org.apache.kerby/kerb-identity-test/1.0-SNAPSHOT/kerb-identity-test-1.0-SNAPSHOT.pom
[JENKINS] Archiving <https://analysis.apache.org/jenkins/job/directory-kerby/ws/kerby-kerb/kerb-identity-test/target/kerb-identity-test-1.0-SNAPSHOT.jar>
to org.apache.kerby/kerb-identity-test/1.0-SNAPSHOT/kerb-identity-test-1.0-SNAPSHOT.jar
[JENKINS] Archiving <https://analysis.apache.org/jenkins/job/directory-kerby/ws/kerby-kerb/kerb-server-api-all/pom.xml>
to org.apache.kerby/kerb-server-api-all/1.0-SNAPSHOT/kerb-server-api-all-1.0-SNAPSHOT.pom
Sending e-mails to: notifications@directory.apache.org
channel stopped
Skipping sonar analysis due to bad build status FAILURE

Mime
View raw message