directory-notifications mailing list archives

Site index · List index
Message view « Date » · « Thread »
Top « Date » · « Thread »
From pct...@apache.org
Subject Build failed in Jenkins: directory-fortress-commander #1
Date Sat, 16 May 2015 12:16:16 GMT
See <https://analysis.apache.org/jenkins/job/directory-fortress-commander/1/>

------------------------------------------
[...truncated 52 lines...]
Downloading: http://repo1.maven.org/maven2/org/apache/wicket/wicket-datetime/6.18.0/wicket-datetime-6.18.0.pom
Downloaded: http://repo1.maven.org/maven2/org/apache/wicket/wicket-datetime/6.18.0/wicket-datetime-6.18.0.pom
(4 KB at 15.5 KB/sec)
Downloading: http://repo1.maven.org/maven2/joda-time/joda-time/2.0/joda-time-2.0.pom
Downloaded: http://repo1.maven.org/maven2/joda-time/joda-time/2.0/joda-time-2.0.pom (15 KB
at 189.2 KB/sec)
Downloading: http://repo1.maven.org/maven2/org/apache/wicket/wicket-velocity/6.18.0/wicket-velocity-6.18.0.pom
Downloaded: http://repo1.maven.org/maven2/org/apache/wicket/wicket-velocity/6.18.0/wicket-velocity-6.18.0.pom
(3 KB at 13.4 KB/sec)
Downloading: http://repo1.maven.org/maven2/org/apache/wicket/wicket-spring/6.18.0/wicket-spring-6.18.0.pom
Downloaded: http://repo1.maven.org/maven2/org/apache/wicket/wicket-spring/6.18.0/wicket-spring-6.18.0.pom
(3 KB at 34.7 KB/sec)
Downloading: http://repo1.maven.org/maven2/org/apache/wicket/wicket-devutils/6.18.0/wicket-devutils-6.18.0.pom
Downloaded: http://repo1.maven.org/maven2/org/apache/wicket/wicket-devutils/6.18.0/wicket-devutils-6.18.0.pom
(3 KB at 35.0 KB/sec)
Downloading: http://repo1.maven.org/maven2/org/wicketstuff/wicketstuff-inmethod-grid/6.18.0/wicketstuff-inmethod-grid-6.18.0.pom
Downloaded: http://repo1.maven.org/maven2/org/wicketstuff/wicketstuff-inmethod-grid/6.18.0/wicketstuff-inmethod-grid-6.18.0.pom
(2 KB at 5.6 KB/sec)
Downloading: http://repo1.maven.org/maven2/org/wicketstuff/inmethod-grid-parent/6.18.0/inmethod-grid-parent-6.18.0.pom
Downloaded: http://repo1.maven.org/maven2/org/wicketstuff/inmethod-grid-parent/6.18.0/inmethod-grid-parent-6.18.0.pom
(3 KB at 7.7 KB/sec)
Downloading: http://repo1.maven.org/maven2/org/wicketstuff/jdk-1.6-parent/6.18.0/jdk-1.6-parent-6.18.0.pom
Downloaded: http://repo1.maven.org/maven2/org/wicketstuff/jdk-1.6-parent/6.18.0/jdk-1.6-parent-6.18.0.pom
(5 KB at 16.7 KB/sec)
Downloading: http://repo1.maven.org/maven2/org/wicketstuff/wicketstuff-core/6.18.0/wicketstuff-core-6.18.0.pom
Downloaded: http://repo1.maven.org/maven2/org/wicketstuff/wicketstuff-core/6.18.0/wicketstuff-core-6.18.0.pom
(30 KB at 123.1 KB/sec)
Downloading: http://repo1.maven.org/maven2/org/apache/wicket/wicket/6.18.0/wicket-6.18.0.pom
Downloaded: http://repo1.maven.org/maven2/org/apache/wicket/wicket/6.18.0/wicket-6.18.0.pom
(3 KB at 10.7 KB/sec)
Downloading: http://repo1.maven.org/maven2/org/wicketstuff/wicketstuff-jwicket-ui-resize/6.18.0/wicketstuff-jwicket-ui-resize-6.18.0.pom
Downloaded: http://repo1.maven.org/maven2/org/wicketstuff/wicketstuff-jwicket-ui-resize/6.18.0/wicketstuff-jwicket-ui-resize-6.18.0.pom
(2 KB at 3.4 KB/sec)
Downloading: http://repo1.maven.org/maven2/org/wicketstuff/wicketstuff-jwicket-ui/6.18.0/wicketstuff-jwicket-ui-6.18.0.pom
Downloaded: http://repo1.maven.org/maven2/org/wicketstuff/wicketstuff-jwicket-ui/6.18.0/wicketstuff-jwicket-ui-6.18.0.pom
(3 KB at 8.6 KB/sec)
Downloading: http://repo1.maven.org/maven2/org/wicketstuff/wicketstuff-jwicket-parent/6.18.0/wicketstuff-jwicket-parent-6.18.0.pom
Downloaded: http://repo1.maven.org/maven2/org/wicketstuff/wicketstuff-jwicket-parent/6.18.0/wicketstuff-jwicket-parent-6.18.0.pom
(4 KB at 12.4 KB/sec)
Downloading: http://repo1.maven.org/maven2/org/wicketstuff/wicketstuff-jwicket-core/6.18.0/wicketstuff-jwicket-core-6.18.0.pom
Downloaded: http://repo1.maven.org/maven2/org/wicketstuff/wicketstuff-jwicket-core/6.18.0/wicketstuff-jwicket-core-6.18.0.pom
(2 KB at 3.9 KB/sec)
Downloading: http://repo1.maven.org/maven2/com/googlecode/wicket-jquery-ui/wicket-jquery-ui/6.18.0/wicket-jquery-ui-6.18.0.pom
Downloaded: http://repo1.maven.org/maven2/com/googlecode/wicket-jquery-ui/wicket-jquery-ui/6.18.0/wicket-jquery-ui-6.18.0.pom
(2 KB at 19.6 KB/sec)
Downloading: http://repo1.maven.org/maven2/com/googlecode/wicket-jquery-ui/wicket-jquery-ui-parent/6.18.0/wicket-jquery-ui-parent-6.18.0.pom
Downloaded: http://repo1.maven.org/maven2/com/googlecode/wicket-jquery-ui/wicket-jquery-ui-parent/6.18.0/wicket-jquery-ui-parent-6.18.0.pom
(6 KB at 65.7 KB/sec)
Downloading: http://repo1.maven.org/maven2/com/googlecode/wicket-jquery-ui/wicket-jquery-ui-core/6.18.0/wicket-jquery-ui-core-6.18.0.pom
Downloaded: http://repo1.maven.org/maven2/com/googlecode/wicket-jquery-ui/wicket-jquery-ui-core/6.18.0/wicket-jquery-ui-core-6.18.0.pom
(2 KB at 19.1 KB/sec)
Downloading: http://repo1.maven.org/maven2/com/googlecode/wicket-jquery-ui/wicket-kendo-ui/6.18.0/wicket-kendo-ui-6.18.0.pom
Downloaded: http://repo1.maven.org/maven2/com/googlecode/wicket-jquery-ui/wicket-kendo-ui/6.18.0/wicket-kendo-ui-6.18.0.pom
(2 KB at 7.8 KB/sec)
Downloading: http://repo1.maven.org/maven2/org/springframework/spring-web/3.2.3.RELEASE/spring-web-3.2.3.RELEASE.pom
Downloaded: http://repo1.maven.org/maven2/org/springframework/spring-web/3.2.3.RELEASE/spring-web-3.2.3.RELEASE.pom
(7 KB at 74.1 KB/sec)
Downloading: http://repo1.maven.org/maven2/org/springframework/spring-aop/3.2.3.RELEASE/spring-aop-3.2.3.RELEASE.pom
Downloaded: http://repo1.maven.org/maven2/org/springframework/spring-aop/3.2.3.RELEASE/spring-aop-3.2.3.RELEASE.pom
(3 KB at 30.7 KB/sec)
Downloading: http://repo1.maven.org/maven2/org/springframework/spring-beans/3.2.3.RELEASE/spring-beans-3.2.3.RELEASE.pom
Downloaded: http://repo1.maven.org/maven2/org/springframework/spring-beans/3.2.3.RELEASE/spring-beans-3.2.3.RELEASE.pom
(2 KB at 23.6 KB/sec)
Downloading: http://repo1.maven.org/maven2/org/springframework/spring-core/3.2.3.RELEASE/spring-core-3.2.3.RELEASE.pom
Downloaded: http://repo1.maven.org/maven2/org/springframework/spring-core/3.2.3.RELEASE/spring-core-3.2.3.RELEASE.pom
(3 KB at 23.6 KB/sec)
Downloading: http://repo1.maven.org/maven2/org/springframework/spring-context/3.2.3.RELEASE/spring-context-3.2.3.RELEASE.pom
Downloaded: http://repo1.maven.org/maven2/org/springframework/spring-context/3.2.3.RELEASE/spring-context-3.2.3.RELEASE.pom
(6 KB at 51.6 KB/sec)
Downloading: http://repo1.maven.org/maven2/org/springframework/spring-expression/3.2.3.RELEASE/spring-expression-3.2.3.RELEASE.pom
Downloaded: http://repo1.maven.org/maven2/org/springframework/spring-expression/3.2.3.RELEASE/spring-expression-3.2.3.RELEASE.pom
(2 KB at 18.3 KB/sec)
Downloading: http://repo1.maven.org/maven2/org/springframework/security/spring-security-core/3.1.4.RELEASE/spring-security-core-3.1.4.RELEASE.pom
Downloaded: http://repo1.maven.org/maven2/org/springframework/security/spring-security-core/3.1.4.RELEASE/spring-security-core-3.1.4.RELEASE.pom
(4 KB at 46.9 KB/sec)
Downloading: http://repo1.maven.org/maven2/org/springframework/security/spring-security-config/3.1.4.RELEASE/spring-security-config-3.1.4.RELEASE.pom
Downloaded: http://repo1.maven.org/maven2/org/springframework/security/spring-security-config/3.1.4.RELEASE/spring-security-config-3.1.4.RELEASE.pom
(4 KB at 47.4 KB/sec)
Downloading: http://repo1.maven.org/maven2/org/springframework/security/spring-security-web/3.1.4.RELEASE/spring-security-web-3.1.4.RELEASE.pom
Downloaded: http://repo1.maven.org/maven2/org/springframework/security/spring-security-web/3.1.4.RELEASE/spring-security-web-3.1.4.RELEASE.pom
(4 KB at 49.2 KB/sec)
Downloading: http://repo1.maven.org/maven2/org/springframework/spring-jdbc/3.0.7.RELEASE/spring-jdbc-3.0.7.RELEASE.pom
Downloaded: http://repo1.maven.org/maven2/org/springframework/spring-jdbc/3.0.7.RELEASE/spring-jdbc-3.0.7.RELEASE.pom
(4 KB at 43.1 KB/sec)
Downloading: http://repo1.maven.org/maven2/org/springframework/spring-tx/3.0.7.RELEASE/spring-tx-3.0.7.RELEASE.pom
Downloaded: http://repo1.maven.org/maven2/org/springframework/spring-tx/3.0.7.RELEASE/spring-tx-3.0.7.RELEASE.pom
(4 KB at 44.4 KB/sec)
Downloading: http://repo1.maven.org/maven2/org/springframework/spring-web/3.0.7.RELEASE/spring-web-3.0.7.RELEASE.pom
Downloaded: http://repo1.maven.org/maven2/org/springframework/spring-web/3.0.7.RELEASE/spring-web-3.0.7.RELEASE.pom
(5 KB at 63.2 KB/sec)
Downloading: http://repo1.maven.org/maven2/httpunit/httpunit/1.6.1/httpunit-1.6.1.pom
Downloaded: http://repo1.maven.org/maven2/httpunit/httpunit/1.6.1/httpunit-1.6.1.pom (3 KB
at 10.1 KB/sec)
Downloading: http://repo1.maven.org/maven2/xerces/xmlParserAPIs/2.2.1/xmlParserAPIs-2.2.1.pom
Downloaded: http://repo1.maven.org/maven2/xerces/xmlParserAPIs/2.2.1/xmlParserAPIs-2.2.1.pom
(153 B at 2.0 KB/sec)
Downloading: http://repo1.maven.org/maven2/nekohtml/nekohtml/0.9.1/nekohtml-0.9.1.pom
Downloaded: http://repo1.maven.org/maven2/nekohtml/nekohtml/0.9.1/nekohtml-0.9.1.pom (346
B at 4.2 KB/sec)
Downloading: http://repo1.maven.org/maven2/org/eclipse/jetty/aggregate/jetty-all-server/8.1.8.v20121106/jetty-all-server-8.1.8.v20121106.pom
Downloaded: http://repo1.maven.org/maven2/org/eclipse/jetty/aggregate/jetty-all-server/8.1.8.v20121106/jetty-all-server-8.1.8.v20121106.pom
(10 KB at 45.6 KB/sec)
Downloading: http://repo1.maven.org/maven2/org/eclipse/jetty/aggregate/jetty-aggregate-project/8.1.8.v20121106/jetty-aggregate-project-8.1.8.v20121106.pom
Downloaded: http://repo1.maven.org/maven2/org/eclipse/jetty/aggregate/jetty-aggregate-project/8.1.8.v20121106/jetty-aggregate-project-8.1.8.v20121106.pom
(2 KB at 7.2 KB/sec)
Downloading: http://repo1.maven.org/maven2/org/eclipse/jetty/jetty-project/8.1.8.v20121106/jetty-project-8.1.8.v20121106.pom
Downloaded: http://repo1.maven.org/maven2/org/eclipse/jetty/jetty-project/8.1.8.v20121106/jetty-project-8.1.8.v20121106.pom
(27 KB at 241.0 KB/sec)
Downloading: http://repo1.maven.org/maven2/org/eclipse/jetty/orbit/javax.security.auth.message/1.0.0.v201108011116/javax.security.auth.message-1.0.0.v201108011116.pom
Downloaded: http://repo1.maven.org/maven2/org/eclipse/jetty/orbit/javax.security.auth.message/1.0.0.v201108011116/javax.security.auth.message-1.0.0.v201108011116.pom
(0 B at 0.0 KB/sec)
Downloading: http://repo1.maven.org/maven2/org/eclipse/jetty/orbit/javax.mail.glassfish/1.4.1.v201005082020/javax.mail.glassfish-1.4.1.v201005082020.pom
Downloaded: http://repo1.maven.org/maven2/org/eclipse/jetty/orbit/javax.mail.glassfish/1.4.1.v201005082020/javax.mail.glassfish-1.4.1.v201005082020.pom
(0 B at 0.0 KB/sec)
Downloading: http://repo1.maven.org/maven2/org/eclipse/jetty/orbit/javax.activation/1.1.0.v201105071233/javax.activation-1.1.0.v201105071233.pom
Downloaded: http://repo1.maven.org/maven2/org/eclipse/jetty/orbit/javax.activation/1.1.0.v201105071233/javax.activation-1.1.0.v201105071233.pom
(0 B at 0.0 KB/sec)
Downloading: http://repo1.maven.org/maven2/org/eclipse/jetty/orbit/javax.annotation/1.1.0.v201108011116/javax.annotation-1.1.0.v201108011116.pom
Downloaded: http://repo1.maven.org/maven2/org/eclipse/jetty/orbit/javax.annotation/1.1.0.v201108011116/javax.annotation-1.1.0.v201108011116.pom
(0 B at 0.0 KB/sec)
Downloading: http://repo1.maven.org/maven2/org/seleniumhq/selenium/selenium-java/2.45.0/selenium-java-2.45.0.pom
Downloaded: http://repo1.maven.org/maven2/org/seleniumhq/selenium/selenium-java/2.45.0/selenium-java-2.45.0.pom
(5 KB at 47.6 KB/sec)
Downloading: http://repo1.maven.org/maven2/org/seleniumhq/selenium/selenium-parent/2.45.0/selenium-parent-2.45.0.pom
Downloaded: http://repo1.maven.org/maven2/org/seleniumhq/selenium/selenium-parent/2.45.0/selenium-parent-2.45.0.pom
(10 KB at 119.4 KB/sec)
Downloading: http://repo1.maven.org/maven2/org/seleniumhq/selenium/selenium-chrome-driver/2.45.0/selenium-chrome-driver-2.45.0.pom
Downloaded: http://repo1.maven.org/maven2/org/seleniumhq/selenium/selenium-chrome-driver/2.45.0/selenium-chrome-driver-2.45.0.pom
(3 KB at 37.4 KB/sec)
Downloading: http://repo1.maven.org/maven2/org/seleniumhq/selenium/selenium-remote-driver/2.45.0/selenium-remote-driver-2.45.0.pom
Downloaded: http://repo1.maven.org/maven2/org/seleniumhq/selenium/selenium-remote-driver/2.45.0/selenium-remote-driver-2.45.0.pom
(4 KB at 40.8 KB/sec)
Downloading: http://repo1.maven.org/maven2/com/google/code/gson/gson/2.3.1/gson-2.3.1.pom
Downloaded: http://repo1.maven.org/maven2/com/google/code/gson/gson/2.3.1/gson-2.3.1.pom (0
B at 0.0 KB/sec)
Downloading: http://repo1.maven.org/maven2/org/seleniumhq/selenium/selenium-api/2.45.0/selenium-api-2.45.0.pom
Downloaded: http://repo1.maven.org/maven2/org/seleniumhq/selenium/selenium-api/2.45.0/selenium-api-2.45.0.pom
(6 KB at 65.5 KB/sec)
Downloading: http://repo1.maven.org/maven2/org/seleniumhq/selenium/selenium-htmlunit-driver/2.45.0/selenium-htmlunit-driver-2.45.0.pom
Downloaded: http://repo1.maven.org/maven2/org/seleniumhq/selenium/selenium-htmlunit-driver/2.45.0/selenium-htmlunit-driver-2.45.0.pom
(3 KB at 28.2 KB/sec)
Downloading: http://repo1.maven.org/maven2/net/sourceforge/htmlunit/htmlunit/2.15/htmlunit-2.15.pom
Downloaded: http://repo1.maven.org/maven2/net/sourceforge/htmlunit/htmlunit/2.15/htmlunit-2.15.pom
(36 KB at 317.0 KB/sec)
Downloading: http://repo1.maven.org/maven2/net/sourceforge/htmlunit/htmlunit-core-js/2.15/htmlunit-core-js-2.15.pom
Downloaded: http://repo1.maven.org/maven2/net/sourceforge/htmlunit/htmlunit-core-js/2.15/htmlunit-core-js-2.15.pom
(2 KB at 18.3 KB/sec)
Downloading: http://repo1.maven.org/maven2/net/sourceforge/nekohtml/nekohtml/1.9.21/nekohtml-1.9.21.pom
Downloaded: http://repo1.maven.org/maven2/net/sourceforge/nekohtml/nekohtml/1.9.21/nekohtml-1.9.21.pom
(2 KB at 18.1 KB/sec)
Downloading: http://repo1.maven.org/maven2/net/sourceforge/cssparser/cssparser/0.9.14/cssparser-0.9.14.pom
Downloaded: http://repo1.maven.org/maven2/net/sourceforge/cssparser/cssparser/0.9.14/cssparser-0.9.14.pom
(12 KB at 142.0 KB/sec)
Downloading: http://repo1.maven.org/maven2/org/eclipse/jetty/jetty-websocket/8.1.15.v20140411/jetty-websocket-8.1.15.v20140411.pom
Downloaded: http://repo1.maven.org/maven2/org/eclipse/jetty/jetty-websocket/8.1.15.v20140411/jetty-websocket-8.1.15.v20140411.pom
(5 KB at 47.7 KB/sec)
Downloading: http://repo1.maven.org/maven2/org/seleniumhq/selenium/selenium-firefox-driver/2.45.0/selenium-firefox-driver-2.45.0.pom
Downloaded: http://repo1.maven.org/maven2/org/seleniumhq/selenium/selenium-firefox-driver/2.45.0/selenium-firefox-driver-2.45.0.pom
(4 KB at 40.4 KB/sec)
Downloading: http://repo1.maven.org/maven2/org/seleniumhq/selenium/selenium-ie-driver/2.45.0/selenium-ie-driver-2.45.0.pom
Downloaded: http://repo1.maven.org/maven2/org/seleniumhq/selenium/selenium-ie-driver/2.45.0/selenium-ie-driver-2.45.0.pom
(4 KB at 40.9 KB/sec)
Downloading: http://repo1.maven.org/maven2/org/seleniumhq/selenium/selenium-safari-driver/2.45.0/selenium-safari-driver-2.45.0.pom
Downloaded: http://repo1.maven.org/maven2/org/seleniumhq/selenium/selenium-safari-driver/2.45.0/selenium-safari-driver-2.45.0.pom
(4 KB at 38.5 KB/sec)
Downloading: http://repo1.maven.org/maven2/org/seleniumhq/selenium/selenium-support/2.45.0/selenium-support-2.45.0.pom
Downloaded: http://repo1.maven.org/maven2/org/seleniumhq/selenium/selenium-support/2.45.0/selenium-support-2.45.0.pom
(3 KB at 31.6 KB/sec)
Downloading: http://repo1.maven.org/maven2/org/seleniumhq/selenium/selenium-leg-rc/2.45.0/selenium-leg-rc-2.45.0.pom
Downloaded: http://repo1.maven.org/maven2/org/seleniumhq/selenium/selenium-leg-rc/2.45.0/selenium-leg-rc-2.45.0.pom
(5 KB at 55.7 KB/sec)
Downloading: http://repo1.maven.org/maven2/org/seleniumhq/selenium/selenium-common/2.0b1/selenium-common-2.0b1.pom
Downloaded: http://repo1.maven.org/maven2/org/seleniumhq/selenium/selenium-common/2.0b1/selenium-common-2.0b1.pom
(2 KB at 8.6 KB/sec)
Downloading: http://repo1.maven.org/maven2/org/seleniumhq/selenium/selenium-parent/2.0b1/selenium-parent-2.0b1.pom
Downloaded: http://repo1.maven.org/maven2/org/seleniumhq/selenium/selenium-parent/2.0b1/selenium-parent-2.0b1.pom
(5 KB at 53.2 KB/sec)
Downloading: http://repo1.maven.org/maven2/org/apache/directory/fortress/fortress-realm-impl/1.0-RC40-SNAPSHOT/fortress-realm-impl-1.0-RC40-SNAPSHOT.jar
Downloading: http://repo1.maven.org/maven2/org/apache/wicket/wicket-extensions/6.18.0/wicket-extensions-6.18.0.jar
Downloading: http://repo1.maven.org/maven2/org/apache/wicket/wicket-core/6.18.0/wicket-core-6.18.0.jar
Downloading: http://repo1.maven.org/maven2/org/apache/wicket/wicket-request/6.18.0/wicket-request-6.18.0.jar
Downloading: http://repo1.maven.org/maven2/org/apache/wicket/wicket-util/6.18.0/wicket-util-6.18.0.jar
Downloading: http://repo1.maven.org/maven2/org/apache/wicket/wicket-guice/6.18.0/wicket-guice-6.18.0.jar
Downloaded: http://repo1.maven.org/maven2/org/apache/wicket/wicket-request/6.18.0/wicket-request-6.18.0.jar
(85 KB at 348.6 KB/sec)
Downloading: http://repo1.maven.org/maven2/org/apache/wicket/wicket-ioc/6.18.0/wicket-ioc-6.18.0.jar
Downloaded: http://repo1.maven.org/maven2/org/apache/wicket/wicket-ioc/6.18.0/wicket-ioc-6.18.0.jar
(22 KB at 274.5 KB/sec)
Downloading: http://repo1.maven.org/maven2/org/apache/wicket/wicket-jmx/6.18.0/wicket-jmx-6.18.0.jar
Downloaded: http://repo1.maven.org/maven2/org/apache/wicket/wicket-util/6.18.0/wicket-util-6.18.0.jar
(415 KB at 876.9 KB/sec)
Downloading: http://repo1.maven.org/maven2/org/apache/wicket/wicket-auth-roles/6.18.0/wicket-auth-roles-6.18.0.jar
Downloaded: http://repo1.maven.org/maven2/org/apache/wicket/wicket-guice/6.18.0/wicket-guice-6.18.0.jar
(17 KB at 45.2 KB/sec)
Downloading: http://repo1.maven.org/maven2/org/apache/wicket/wicket-datetime/6.18.0/wicket-datetime-6.18.0.jar
Downloaded: http://repo1.maven.org/maven2/org/apache/wicket/wicket-auth-roles/6.18.0/wicket-auth-roles-6.18.0.jar
(49 KB at 342.6 KB/sec)
Downloading: http://repo1.maven.org/maven2/joda-time/joda-time/2.0/joda-time-2.0.jar
Downloaded: http://repo1.maven.org/maven2/org/apache/wicket/wicket-jmx/6.18.0/wicket-jmx-6.18.0.jar
(28 KB at 84.8 KB/sec)
Downloading: http://repo1.maven.org/maven2/org/apache/wicket/wicket-velocity/6.18.0/wicket-velocity-6.18.0.jar
Downloaded: http://repo1.maven.org/maven2/joda-time/joda-time/2.0/joda-time-2.0.jar (556 KB
at 1903.7 KB/sec)
Downloading: http://repo1.maven.org/maven2/org/apache/wicket/wicket-spring/6.18.0/wicket-spring-6.18.0.jar
Downloaded: http://repo1.maven.org/maven2/org/apache/wicket/wicket-core/6.18.0/wicket-core-6.18.0.jar
(2137 KB at 2319.8 KB/sec)
Downloading: http://repo1.maven.org/maven2/org/apache/wicket/wicket-devutils/6.18.0/wicket-devutils-6.18.0.jar
Downloaded: http://repo1.maven.org/maven2/org/apache/wicket/wicket-velocity/6.18.0/wicket-velocity-6.18.0.jar
(20 KB at 62.8 KB/sec)
Downloading: http://repo1.maven.org/maven2/org/wicketstuff/wicketstuff-inmethod-grid/6.18.0/wicketstuff-inmethod-grid-6.18.0.jar
Downloaded: http://repo1.maven.org/maven2/org/apache/wicket/wicket-datetime/6.18.0/wicket-datetime-6.18.0.jar
(233 KB at 491.8 KB/sec)
Downloading: http://repo1.maven.org/maven2/org/wicketstuff/wicketstuff-jwicket-ui-resize/6.18.0/wicketstuff-jwicket-ui-resize-6.18.0.jar
Downloaded: http://repo1.maven.org/maven2/org/apache/wicket/wicket-spring/6.18.0/wicket-spring-6.18.0.jar
(26 KB at 180.0 KB/sec)
Downloading: http://repo1.maven.org/maven2/org/wicketstuff/wicketstuff-jwicket-core/6.18.0/wicketstuff-jwicket-core-6.18.0.jar
Downloaded: http://repo1.maven.org/maven2/org/apache/wicket/wicket-devutils/6.18.0/wicket-devutils-6.18.0.jar
(111 KB at 755.9 KB/sec)
Downloading: http://repo1.maven.org/maven2/com/googlecode/wicket-jquery-ui/wicket-jquery-ui/6.18.0/wicket-jquery-ui-6.18.0.jar
Downloaded: http://repo1.maven.org/maven2/org/apache/wicket/wicket-extensions/6.18.0/wicket-extensions-6.18.0.jar
(1348 KB at 1205.4 KB/sec)
Downloading: http://repo1.maven.org/maven2/com/googlecode/wicket-jquery-ui/wicket-jquery-ui-core/6.18.0/wicket-jquery-ui-core-6.18.0.jar
Downloaded: http://repo1.maven.org/maven2/com/googlecode/wicket-jquery-ui/wicket-jquery-ui-core/6.18.0/wicket-jquery-ui-core-6.18.0.jar
(62 KB at 697.4 KB/sec)
Downloading: http://repo1.maven.org/maven2/com/googlecode/wicket-jquery-ui/wicket-kendo-ui/6.18.0/wicket-kendo-ui-6.18.0.jar
Downloaded: http://repo1.maven.org/maven2/com/googlecode/wicket-jquery-ui/wicket-jquery-ui/6.18.0/wicket-jquery-ui-6.18.0.jar
(419 KB at 3033.6 KB/sec)
Downloading: http://repo1.maven.org/maven2/org/springframework/spring-web/3.2.3.RELEASE/spring-web-3.2.3.RELEASE.jar
Downloaded: http://repo1.maven.org/maven2/org/wicketstuff/wicketstuff-jwicket-ui-resize/6.18.0/wicketstuff-jwicket-ui-resize-6.18.0.jar
(24 KB at 79.2 KB/sec)
Downloading: http://repo1.maven.org/maven2/org/springframework/spring-aop/3.2.3.RELEASE/spring-aop-3.2.3.RELEASE.jar
Downloaded: http://repo1.maven.org/maven2/org/springframework/spring-web/3.2.3.RELEASE/spring-web-3.2.3.RELEASE.jar
(611 KB at 3891.0 KB/sec)
Downloading: http://repo1.maven.org/maven2/org/springframework/spring-beans/3.2.3.RELEASE/spring-beans-3.2.3.RELEASE.jar
Downloaded: http://repo1.maven.org/maven2/org/wicketstuff/wicketstuff-jwicket-core/6.18.0/wicketstuff-jwicket-core-6.18.0.jar
(173 KB at 404.5 KB/sec)
Downloading: http://repo1.maven.org/maven2/org/springframework/spring-context/3.2.3.RELEASE/spring-context-3.2.3.RELEASE.jar
Downloaded: http://repo1.maven.org/maven2/org/springframework/spring-beans/3.2.3.RELEASE/spring-beans-3.2.3.RELEASE.jar
(594 KB at 4093.0 KB/sec)
Downloading: http://repo1.maven.org/maven2/org/springframework/spring-core/3.2.3.RELEASE/spring-core-3.2.3.RELEASE.jar
Downloaded: http://repo1.maven.org/maven2/org/springframework/spring-aop/3.2.3.RELEASE/spring-aop-3.2.3.RELEASE.jar
(328 KB at 1161.4 KB/sec)
Downloading: http://repo1.maven.org/maven2/org/springframework/spring-expression/3.2.3.RELEASE/spring-expression-3.2.3.RELEASE.jar
Downloaded: http://repo1.maven.org/maven2/org/wicketstuff/wicketstuff-inmethod-grid/6.18.0/wicketstuff-inmethod-grid-6.18.0.jar
(282 KB at 456.9 KB/sec)
Downloading: http://repo1.maven.org/maven2/org/springframework/security/spring-security-core/3.1.4.RELEASE/spring-security-core-3.1.4.RELEASE.jar
Downloaded: http://repo1.maven.org/maven2/org/springframework/spring-context/3.2.3.RELEASE/spring-context-3.2.3.RELEASE.jar
(843 KB at 2967.1 KB/sec)
Downloading: http://repo1.maven.org/maven2/org/springframework/security/spring-security-config/3.1.4.RELEASE/spring-security-config-3.1.4.RELEASE.jar
Downloaded: http://repo1.maven.org/maven2/org/springframework/spring-expression/3.2.3.RELEASE/spring-expression-3.2.3.RELEASE.jar
(191 KB at 837.5 KB/sec)
Downloading: http://repo1.maven.org/maven2/org/springframework/security/spring-security-web/3.1.4.RELEASE/spring-security-web-3.1.4.RELEASE.jar
Downloaded: http://repo1.maven.org/maven2/org/springframework/spring-core/3.2.3.RELEASE/spring-core-3.2.3.RELEASE.jar
(848 KB at 2648.3 KB/sec)
Downloading: http://repo1.maven.org/maven2/org/springframework/spring-jdbc/3.0.7.RELEASE/spring-jdbc-3.0.7.RELEASE.jar
Downloaded: http://repo1.maven.org/maven2/com/googlecode/wicket-jquery-ui/wicket-kendo-ui/6.18.0/wicket-kendo-ui-6.18.0.jar
(663 KB at 1046.5 KB/sec)
Downloading: http://repo1.maven.org/maven2/org/springframework/spring-tx/3.0.7.RELEASE/spring-tx-3.0.7.RELEASE.jar
Downloaded: http://repo1.maven.org/maven2/org/springframework/security/spring-security-config/3.1.4.RELEASE/spring-security-config-3.1.4.RELEASE.jar
(199 KB at 2260.4 KB/sec)
Downloading: http://repo1.maven.org/maven2/httpunit/httpunit/1.6.1/httpunit-1.6.1.jar
Downloaded: http://repo1.maven.org/maven2/org/springframework/security/spring-security-core/3.1.4.RELEASE/spring-security-core-3.1.4.RELEASE.jar
(333 KB at 1010.1 KB/sec)
Downloading: http://repo1.maven.org/maven2/xerces/xmlParserAPIs/2.2.1/xmlParserAPIs-2.2.1.jar
Downloaded: http://repo1.maven.org/maven2/org/springframework/spring-tx/3.0.7.RELEASE/spring-tx-3.0.7.RELEASE.jar
(227 KB at 2041.7 KB/sec)
Downloading: http://repo1.maven.org/maven2/nekohtml/nekohtml/0.9.1/nekohtml-0.9.1.jar
Downloaded: http://repo1.maven.org/maven2/org/springframework/security/spring-security-web/3.1.4.RELEASE/spring-security-web-3.1.4.RELEASE.jar
(248 KB at 1392.6 KB/sec)
Downloading: http://repo1.maven.org/maven2/org/eclipse/jetty/aggregate/jetty-all-server/8.1.8.v20121106/jetty-all-server-8.1.8.v20121106.jar
Downloaded: http://repo1.maven.org/maven2/httpunit/httpunit/1.6.1/httpunit-1.6.1.jar (398
KB at 3054.2 KB/sec)
Downloading: http://repo1.maven.org/maven2/org/eclipse/jetty/orbit/javax.security.auth.message/1.0.0.v201108011116/javax.security.auth.message-1.0.0.v201108011116.jar
Downloaded: http://repo1.maven.org/maven2/xerces/xmlParserAPIs/2.2.1/xmlParserAPIs-2.2.1.jar
(82 KB at 954.6 KB/sec)
Downloaded: http://repo1.maven.org/maven2/org/springframework/spring-jdbc/3.0.7.RELEASE/spring-jdbc-3.0.7.RELEASE.jar
(378 KB at 2464.3 KB/sec)
Downloading: http://repo1.maven.org/maven2/org/eclipse/jetty/orbit/javax.mail.glassfish/1.4.1.v201005082020/javax.mail.glassfish-1.4.1.v201005082020.jar
Downloading: http://repo1.maven.org/maven2/org/eclipse/jetty/orbit/javax.activation/1.1.0.v201105071233/javax.activation-1.1.0.v201105071233.jar
Downloaded: http://repo1.maven.org/maven2/nekohtml/nekohtml/0.9.1/nekohtml-0.9.1.jar (66 KB
at 840.3 KB/sec)
Downloading: http://repo1.maven.org/maven2/org/eclipse/jetty/orbit/javax.annotation/1.1.0.v201108011116/javax.annotation-1.1.0.v201108011116.jar
Downloaded: http://repo1.maven.org/maven2/org/eclipse/jetty/orbit/javax.security.auth.message/1.0.0.v201108011116/javax.security.auth.message-1.0.0.v201108011116.jar
(0 B at 0.0 KB/sec)
Downloading: http://repo1.maven.org/maven2/org/seleniumhq/selenium/selenium-java/2.45.0/selenium-java-2.45.0.jar
Downloaded: http://repo1.maven.org/maven2/org/eclipse/jetty/orbit/javax.mail.glassfish/1.4.1.v201005082020/javax.mail.glassfish-1.4.1.v201005082020.jar
(0 B at 0.0 KB/sec)
Downloading: http://repo1.maven.org/maven2/org/seleniumhq/selenium/selenium-chrome-driver/2.45.0/selenium-chrome-driver-2.45.0.jar
Downloaded: http://repo1.maven.org/maven2/org/eclipse/jetty/orbit/javax.activation/1.1.0.v201105071233/javax.activation-1.1.0.v201105071233.jar
(0 B at 0.0 KB/sec)
Downloading: http://repo1.maven.org/maven2/org/seleniumhq/selenium/selenium-remote-driver/2.45.0/selenium-remote-driver-2.45.0.jar
Downloaded: http://repo1.maven.org/maven2/org/eclipse/jetty/orbit/javax.annotation/1.1.0.v201108011116/javax.annotation-1.1.0.v201108011116.jar
(0 B at 0.0 KB/sec)
Downloading: http://repo1.maven.org/maven2/com/google/code/gson/gson/2.3.1/gson-2.3.1.jar
Downloaded: http://repo1.maven.org/maven2/org/seleniumhq/selenium/selenium-java/2.45.0/selenium-java-2.45.0.jar
(3 KB at 27.7 KB/sec)
Downloading: http://repo1.maven.org/maven2/org/seleniumhq/selenium/selenium-api/2.45.0/selenium-api-2.45.0.jar
Downloaded: http://repo1.maven.org/maven2/org/seleniumhq/selenium/selenium-chrome-driver/2.45.0/selenium-chrome-driver-2.45.0.jar
(10 KB at 125.0 KB/sec)
Downloading: http://repo1.maven.org/maven2/org/seleniumhq/selenium/selenium-htmlunit-driver/2.45.0/selenium-htmlunit-driver-2.45.0.jar
Downloaded: http://repo1.maven.org/maven2/org/seleniumhq/selenium/selenium-remote-driver/2.45.0/selenium-remote-driver-2.45.0.jar
(225 KB at 2102.2 KB/sec)
Downloading: http://repo1.maven.org/maven2/net/sourceforge/htmlunit/htmlunit/2.15/htmlunit-2.15.jar
Downloaded: http://repo1.maven.org/maven2/org/seleniumhq/selenium/selenium-api/2.45.0/selenium-api-2.45.0.jar
(134 KB at 1692.0 KB/sec)
Downloading: http://repo1.maven.org/maven2/net/sourceforge/htmlunit/htmlunit-core-js/2.15/htmlunit-core-js-2.15.jar
Downloaded: http://repo1.maven.org/maven2/org/seleniumhq/selenium/selenium-htmlunit-driver/2.45.0/selenium-htmlunit-driver-2.45.0.jar
(58 KB at 730.4 KB/sec)
Downloading: http://repo1.maven.org/maven2/net/sourceforge/nekohtml/nekohtml/1.9.21/nekohtml-1.9.21.jar
Downloaded: http://repo1.maven.org/maven2/com/google/code/gson/gson/2.3.1/gson-2.3.1.jar (0
B at 0.0 KB/sec)
Downloading: http://repo1.maven.org/maven2/net/sourceforge/cssparser/cssparser/0.9.14/cssparser-0.9.14.jar
Downloaded: http://repo1.maven.org/maven2/net/sourceforge/nekohtml/nekohtml/1.9.21/nekohtml-1.9.21.jar
(123 KB at 1388.8 KB/sec)
Downloading: http://repo1.maven.org/maven2/org/eclipse/jetty/jetty-websocket/8.1.15.v20140411/jetty-websocket-8.1.15.v20140411.jar
Downloaded: http://repo1.maven.org/maven2/net/sourceforge/cssparser/cssparser/0.9.14/cssparser-0.9.14.jar
(347 KB at 2910.4 KB/sec)
Downloading: http://repo1.maven.org/maven2/org/seleniumhq/selenium/selenium-firefox-driver/2.45.0/selenium-firefox-driver-2.45.0.jar
Downloaded: http://repo1.maven.org/maven2/org/eclipse/jetty/jetty-websocket/8.1.15.v20140411/jetty-websocket-8.1.15.v20140411.jar
(125 KB at 1235.2 KB/sec)
Downloading: http://repo1.maven.org/maven2/org/seleniumhq/selenium/selenium-ie-driver/2.45.0/selenium-ie-driver-2.45.0.jar
Downloaded: http://repo1.maven.org/maven2/net/sourceforge/htmlunit/htmlunit/2.15/htmlunit-2.15.jar
(1419 KB at 5030.4 KB/sec)
Downloading: http://repo1.maven.org/maven2/org/seleniumhq/selenium/selenium-safari-driver/2.45.0/selenium-safari-driver-2.45.0.jar
Downloaded: http://repo1.maven.org/maven2/org/seleniumhq/selenium/selenium-ie-driver/2.45.0/selenium-ie-driver-2.45.0.jar
(12 KB at 146.3 KB/sec)
Downloading: http://repo1.maven.org/maven2/org/seleniumhq/selenium/selenium-support/2.45.0/selenium-support-2.45.0.jar
Downloaded: http://repo1.maven.org/maven2/org/seleniumhq/selenium/selenium-support/2.45.0/selenium-support-2.45.0.jar
(133 KB at 1727.2 KB/sec)
Downloading: http://repo1.maven.org/maven2/org/seleniumhq/selenium/selenium-leg-rc/2.45.0/selenium-leg-rc-2.45.0.jar
Downloaded: http://repo1.maven.org/maven2/org/seleniumhq/selenium/selenium-safari-driver/2.45.0/selenium-safari-driver-2.45.0.jar
(298 KB at 2654.8 KB/sec)
Downloading: http://repo1.maven.org/maven2/org/seleniumhq/selenium/selenium-common/2.0b1/selenium-common-2.0b1.jar
Downloaded: http://repo1.maven.org/maven2/net/sourceforge/htmlunit/htmlunit-core-js/2.15/htmlunit-core-js-2.15.jar
(1003 KB at 2783.9 KB/sec)
Downloaded: http://repo1.maven.org/maven2/org/seleniumhq/selenium/selenium-common/2.0b1/selenium-common-2.0b1.jar
(143 KB at 1714.1 KB/sec)
Downloaded: http://repo1.maven.org/maven2/org/seleniumhq/selenium/selenium-leg-rc/2.45.0/selenium-leg-rc-2.45.0.jar
(398 KB at 3546.6 KB/sec)
Downloaded: http://repo1.maven.org/maven2/org/eclipse/jetty/aggregate/jetty-all-server/8.1.8.v20121106/jetty-all-server-8.1.8.v20121106.jar
(1787 KB at 2173.4 KB/sec)
Downloaded: http://repo1.maven.org/maven2/org/seleniumhq/selenium/selenium-firefox-driver/2.45.0/selenium-firefox-driver-2.45.0.jar
(2575 KB at 5891.8 KB/sec)
Downloading: http://repository.apache.org/snapshots/org/apache/directory/fortress/fortress-realm-impl/1.0-RC40-SNAPSHOT/fortress-realm-impl-1.0-RC40-SNAPSHOT.jar
[INFO] ------------------------------------------------------------------------
[INFO] BUILD FAILURE
[INFO] ------------------------------------------------------------------------
[INFO] Total time: 21.289s
[INFO] Finished at: Sat May 16 12:16:14 UTC 2015
[INFO] Final Memory: 15M/310M
[INFO] ------------------------------------------------------------------------
Waiting for Jenkins to finish collecting data[ERROR] Failed to execute goal on project fortress-web:
Could not resolve dependencies for project org.apache.directory.fortress:fortress-web:war:1.0-RC40-SNAPSHOT:
Could not find artifact org.apache.directory.fortress:fortress-realm-impl:jar:1.0-RC40-SNAPSHOT
in maven2 (http://repo1.maven.org/maven2) -> [Help 1]
[ERROR] 
[ERROR] To see the full stack trace of the errors, re-run Maven with the -e switch.
[ERROR] Re-run Maven using the -X switch to enable full debug logging.
[ERROR] 
[ERROR] For more information about the errors and possible solutions, please read the following
articles:
[ERROR] [Help 1] http://cwiki.apache.org/confluence/display/MAVEN/DependencyResolutionException

[JENKINS] Archiving <https://analysis.apache.org/jenkins/job/directory-fortress-commander/ws/pom.xml>
to org.apache.directory.fortress/fortress-web/1.0-RC40-SNAPSHOT/fortress-web-1.0-RC40-SNAPSHOT.pom
Sending e-mails to: notifications@directory.apache.org
channel stopped
Skipping sonar analysis due to bad build status FAILURE

Mime
View raw message