directory-notifications mailing list archives

Site index · List index
Message view « Date » · « Thread »
Top « Date » · « Thread »
From Apache Jenkins Server <jenk...@builds.apache.org>
Subject Build failed in Jenkins: dir-apacheds-ubuntu-deploy #1689
Date Wed, 29 Apr 2015 04:14:52 GMT
See <https://builds.apache.org/job/dir-apacheds-ubuntu-deploy/1689/changes>

Changes:

[elecharny] [maven-release-plugin] prepare for next development iteration

[elecharny] [maven-release-plugin] prepare release 2.0.0-M20

[elecharny] Added the missing AL 2.0 header and a class header

[elecharny] Also bumped up to the latest Mavibot revision

[elecharny] Bumped up the LDAP API to the latest revision

[elecharny] Added a perf test with Mavibot partition

[elecharny] Added a perf test.

------------------------------------------
[...truncated 213 lines...]
[INFO] --- maven-bundle-plugin:2.5.3:install (default-install) @ apacheds-i18n ---
[INFO] Installing org/apache/directory/server/apacheds-i18n/2.0.0-M21-SNAPSHOT/apacheds-i18n-2.0.0-M21-SNAPSHOT.jar
[INFO] Writing OBR metadata
[INFO] 
[INFO] --- maven-deploy-plugin:2.8.2:deploy (default-deploy) @ apacheds-i18n ---
Downloading: https://repository.apache.org/content/repositories/snapshots/org/apache/directory/server/apacheds-i18n/2.0.0-M21-SNAPSHOT/maven-metadata.xml
Uploading: https://repository.apache.org/content/repositories/snapshots/org/apache/directory/server/apacheds-i18n/2.0.0-M21-SNAPSHOT/apacheds-i18n-2.0.0-M21-20150429.041411-1.jar
Uploaded: https://repository.apache.org/content/repositories/snapshots/org/apache/directory/server/apacheds-i18n/2.0.0-M21-SNAPSHOT/apacheds-i18n-2.0.0-M21-20150429.041411-1.jar
(44 KB at 8.6 KB/sec)
Uploading: https://repository.apache.org/content/repositories/snapshots/org/apache/directory/server/apacheds-i18n/2.0.0-M21-SNAPSHOT/apacheds-i18n-2.0.0-M21-20150429.041411-1.pom
Uploaded: https://repository.apache.org/content/repositories/snapshots/org/apache/directory/server/apacheds-i18n/2.0.0-M21-SNAPSHOT/apacheds-i18n-2.0.0-M21-20150429.041411-1.pom
(3 KB at 3.5 KB/sec)
Downloading: https://repository.apache.org/content/repositories/snapshots/org/apache/directory/server/apacheds-i18n/maven-metadata.xml
Downloaded: https://repository.apache.org/content/repositories/snapshots/org/apache/directory/server/apacheds-i18n/maven-metadata.xml
(452 B at 0.5 KB/sec)
Uploading: https://repository.apache.org/content/repositories/snapshots/org/apache/directory/server/apacheds-i18n/2.0.0-M21-SNAPSHOT/maven-metadata.xml
Uploaded: https://repository.apache.org/content/repositories/snapshots/org/apache/directory/server/apacheds-i18n/2.0.0-M21-SNAPSHOT/maven-metadata.xml
(802 B at 0.7 KB/sec)
Uploading: https://repository.apache.org/content/repositories/snapshots/org/apache/directory/server/apacheds-i18n/maven-metadata.xml
Uploaded: https://repository.apache.org/content/repositories/snapshots/org/apache/directory/server/apacheds-i18n/maven-metadata.xml
(496 B at 0.2 KB/sec)
[INFO] 
[INFO] --- maven-bundle-plugin:2.5.3:deploy (default-deploy) @ apacheds-i18n ---
[INFO] Remote OBR update disabled (enable with -DremoteOBR)
[JENKINS] Archiving disabled
[INFO]                                                                         
[INFO] ------------------------------------------------------------------------
[INFO] Building ApacheDS Core Constants 2.0.0-M21-SNAPSHOT
[INFO] ------------------------------------------------------------------------
[INFO] 
[INFO] --- maven-clean-plugin:2.6.1:clean (default-clean) @ apacheds-core-constants ---
[INFO] Deleting <https://builds.apache.org/job/dir-apacheds-ubuntu-deploy/ws/trunk/core-constants/target>
[INFO] 
[INFO] --- maven-remote-resources-plugin:1.5:process (default) @ apacheds-core-constants ---
[INFO] 
[INFO] --- maven-resources-plugin:2.7:resources (default-resources) @ apacheds-core-constants
---
[INFO] Using 'UTF-8' encoding to copy filtered resources.
[INFO] Copying 0 resource
[INFO] Copying 3 resources
[INFO] 
[INFO] --- maven-compiler-plugin:3.2:compile (default-compile) @ apacheds-core-constants ---
[INFO] Changes detected - recompiling the module!
[INFO] Compiling 4 source files to <https://builds.apache.org/job/dir-apacheds-ubuntu-deploy/ws/trunk/core-constants/target/classes>
[INFO] 
[INFO] --- maven-resources-plugin:2.7:testResources (default-testResources) @ apacheds-core-constants
---
[INFO] Using 'UTF-8' encoding to copy filtered resources.
[INFO] skip non existing resourceDirectory <https://builds.apache.org/job/dir-apacheds-ubuntu-deploy/ws/trunk/core-constants/src/test/resources>
[INFO] Copying 3 resources
[INFO] 
[INFO] --- maven-compiler-plugin:3.2:testCompile (default-testCompile) @ apacheds-core-constants
---
[INFO] No sources to compile
[INFO] 
[INFO] --- maven-surefire-plugin:2.18.1:test (default-test) @ apacheds-core-constants ---
[JENKINS] Recording test results[INFO] 
[INFO] --- maven-bundle-plugin:2.5.3:bundle (default-bundle) @ apacheds-core-constants ---

[INFO] 
[INFO] --- maven-site-plugin:3.4:attach-descriptor (attach-descriptor) @ apacheds-core-constants
---
[INFO] 
[INFO] --- tools-maven-plugin:1.4:verify-legal-files (verify-legal-files) @ apacheds-core-constants
---
[INFO] Checking legal files in: apacheds-core-constants-2.0.0-M21-SNAPSHOT.jar
[INFO] 
[INFO] --- maven-install-plugin:2.5.2:install (default-install) @ apacheds-core-constants
---
[INFO] Installing <https://builds.apache.org/job/dir-apacheds-ubuntu-deploy/ws/trunk/core-constants/target/apacheds-core-constants-2.0.0-M21-SNAPSHOT.jar>
to /home/jenkins/jenkins-slave/maven-repositories/1/org/apache/directory/server/apacheds-core-constants/2.0.0-M21-SNAPSHOT/apacheds-core-constants-2.0.0-M21-SNAPSHOT.jar
[INFO] Installing <https://builds.apache.org/job/dir-apacheds-ubuntu-deploy/ws/trunk/core-constants/pom.xml>
to /home/jenkins/jenkins-slave/maven-repositories/1/org/apache/directory/server/apacheds-core-constants/2.0.0-M21-SNAPSHOT/apacheds-core-constants-2.0.0-M21-SNAPSHOT.pom
[INFO] 
[INFO] --- maven-bundle-plugin:2.5.3:install (default-install) @ apacheds-core-constants ---
[INFO] Installing org/apache/directory/server/apacheds-core-constants/2.0.0-M21-SNAPSHOT/apacheds-core-constants-2.0.0-M21-SNAPSHOT.jar
[INFO] Writing OBR metadata
[INFO] 
[INFO] --- maven-deploy-plugin:2.8.2:deploy (default-deploy) @ apacheds-core-constants ---
Downloading: https://repository.apache.org/content/repositories/snapshots/org/apache/directory/server/apacheds-core-constants/2.0.0-M21-SNAPSHOT/maven-metadata.xml
Uploading: https://repository.apache.org/content/repositories/snapshots/org/apache/directory/server/apacheds-core-constants/2.0.0-M21-SNAPSHOT/apacheds-core-constants-2.0.0-M21-20150429.041426-1.jar
Uploaded: https://repository.apache.org/content/repositories/snapshots/org/apache/directory/server/apacheds-core-constants/2.0.0-M21-SNAPSHOT/apacheds-core-constants-2.0.0-M21-20150429.041426-1.jar
(10 KB at 5.8 KB/sec)
Uploading: https://repository.apache.org/content/repositories/snapshots/org/apache/directory/server/apacheds-core-constants/2.0.0-M21-SNAPSHOT/apacheds-core-constants-2.0.0-M21-20150429.041426-1.pom
Uploaded: https://repository.apache.org/content/repositories/snapshots/org/apache/directory/server/apacheds-core-constants/2.0.0-M21-SNAPSHOT/apacheds-core-constants-2.0.0-M21-20150429.041426-1.pom
(3 KB at 3.5 KB/sec)
Downloading: https://repository.apache.org/content/repositories/snapshots/org/apache/directory/server/apacheds-core-constants/maven-metadata.xml
Downloaded: https://repository.apache.org/content/repositories/snapshots/org/apache/directory/server/apacheds-core-constants/maven-metadata.xml
(462 B at 2.7 KB/sec)
Uploading: https://repository.apache.org/content/repositories/snapshots/org/apache/directory/server/apacheds-core-constants/2.0.0-M21-SNAPSHOT/maven-metadata.xml
Uploaded: https://repository.apache.org/content/repositories/snapshots/org/apache/directory/server/apacheds-core-constants/2.0.0-M21-SNAPSHOT/maven-metadata.xml
(812 B at 3.5 KB/sec)
Uploading: https://repository.apache.org/content/repositories/snapshots/org/apache/directory/server/apacheds-core-constants/maven-metadata.xml
Uploaded: https://repository.apache.org/content/repositories/snapshots/org/apache/directory/server/apacheds-core-constants/maven-metadata.xml
(506 B at 0.7 KB/sec)
[INFO] 
[INFO] --- maven-bundle-plugin:2.5.3:deploy (default-deploy) @ apacheds-core-constants ---
[INFO] Remote OBR update disabled (enable with -DremoteOBR)
[JENKINS] Archiving disabled
[INFO]                                                                         
[INFO] ------------------------------------------------------------------------
[INFO] Building ApacheDS Core API 2.0.0-M21-SNAPSHOT
[INFO] ------------------------------------------------------------------------
Downloading: http://repo.maven.apache.org/maven2/org/apache/directory/api/api-i18n/1.0.0-M30/api-i18n-1.0.0-M30.pom
[WARNING] The POM for org.apache.directory.api:api-i18n:jar:1.0.0-M30 is missing, no dependency
information available
Downloading: http://repo.maven.apache.org/maven2/org/apache/directory/api/api-asn1-api/1.0.0-M30/api-asn1-api-1.0.0-M30.pom
[WARNING] The POM for org.apache.directory.api:api-asn1-api:jar:1.0.0-M30 is missing, no dependency
information available
Downloading: http://repo.maven.apache.org/maven2/org/apache/directory/api/api-ldap-client-api/1.0.0-M30/api-ldap-client-api-1.0.0-M30.pom
[WARNING] The POM for org.apache.directory.api:api-ldap-client-api:jar:1.0.0-M30 is missing,
no dependency information available
Downloading: http://repo.maven.apache.org/maven2/org/apache/directory/api/api-ldap-codec-core/1.0.0-M30/api-ldap-codec-core-1.0.0-M30.pom
[WARNING] The POM for org.apache.directory.api:api-ldap-codec-core:jar:1.0.0-M30 is missing,
no dependency information available
Downloading: http://repo.maven.apache.org/maven2/org/apache/directory/api/api-ldap-extras-aci/1.0.0-M30/api-ldap-extras-aci-1.0.0-M30.pom
[WARNING] The POM for org.apache.directory.api:api-ldap-extras-aci:jar:1.0.0-M30 is missing,
no dependency information available
Downloading: http://repo.maven.apache.org/maven2/org/apache/directory/api/api-ldap-extras-util/1.0.0-M30/api-ldap-extras-util-1.0.0-M30.pom
[WARNING] The POM for org.apache.directory.api:api-ldap-extras-util:jar:1.0.0-M30 is missing,
no dependency information available
Downloading: http://repo.maven.apache.org/maven2/org/apache/directory/api/api-ldap-model/1.0.0-M30/api-ldap-model-1.0.0-M30.pom
[WARNING] The POM for org.apache.directory.api:api-ldap-model:jar:1.0.0-M30 is missing, no
dependency information available
Downloading: http://repo.maven.apache.org/maven2/org/apache/directory/api/api-ldap-schema-data/1.0.0-M30/api-ldap-schema-data-1.0.0-M30.pom
[WARNING] The POM for org.apache.directory.api:api-ldap-schema-data:jar:1.0.0-M30 is missing,
no dependency information available
Downloading: http://repo.maven.apache.org/maven2/org/apache/directory/api/api-util/1.0.0-M30/api-util-1.0.0-M30.pom
[WARNING] The POM for org.apache.directory.api:api-util:jar:1.0.0-M30 is missing, no dependency
information available
Downloading: http://repo.maven.apache.org/maven2/org/apache/directory/api/api-i18n/1.0.0-M30/api-i18n-1.0.0-M30.jar
Downloading: http://repo.maven.apache.org/maven2/org/apache/directory/api/api-asn1-api/1.0.0-M30/api-asn1-api-1.0.0-M30.jar
Downloading: http://repo.maven.apache.org/maven2/org/apache/directory/api/api-ldap-client-api/1.0.0-M30/api-ldap-client-api-1.0.0-M30.jar
Downloading: http://repo.maven.apache.org/maven2/org/apache/directory/api/api-ldap-extras-aci/1.0.0-M30/api-ldap-extras-aci-1.0.0-M30.jar
Downloading: http://repo.maven.apache.org/maven2/org/apache/directory/api/api-ldap-codec-core/1.0.0-M30/api-ldap-codec-core-1.0.0-M30.jar
Downloading: http://repo.maven.apache.org/maven2/org/apache/directory/api/api-ldap-extras-util/1.0.0-M30/api-ldap-extras-util-1.0.0-M30.jar
Downloading: http://repo.maven.apache.org/maven2/org/apache/directory/api/api-ldap-model/1.0.0-M30/api-ldap-model-1.0.0-M30.jar
Downloading: http://repo.maven.apache.org/maven2/org/apache/directory/api/api-ldap-schema-data/1.0.0-M30/api-ldap-schema-data-1.0.0-M30.jar
Downloading: http://repo.maven.apache.org/maven2/org/apache/directory/api/api-util/1.0.0-M30/api-util-1.0.0-M30.jar
[JENKINS] Archiving disabled
[INFO] ------------------------------------------------------------------------
[INFO] Reactor Summary:
[INFO] 
[INFO] ApacheDS .......................................... SUCCESS [7.676s]
[INFO] ApacheDS I18n ..................................... SUCCESS [18.315s]
[INFO] ApacheDS Core Constants ........................... SUCCESS [7.811s]
[INFO] ApacheDS Core API ................................. FAILURE [1.699s]
[INFO] ApacheDS Core Shared .............................. SKIPPED
[INFO] ApacheDS Interceptors ............................. SKIPPED
[INFO] ApacheDS AdministrativePoint Interceptor .......... SKIPPED
[INFO] ApacheDS Authentication Interceptor ............... SKIPPED
[INFO] ApacheDS Interceptor to increment numeric attributes  SKIPPED
[INFO] ApacheDS Authorization Interceptor ................ SKIPPED
[INFO] ApacheDS ChangeLog Interceptor .................... SKIPPED
[INFO] ApacheDS Collective Attribute Interceptor ......... SKIPPED
[INFO] ApacheDS Event Interceptor ........................ SKIPPED
[INFO] ApacheDS Exception Interceptor .................... SKIPPED
[INFO] ApacheDS Journal Interceptor ...................... SKIPPED
[INFO] ApacheDS Normalization Interceptor ................ SKIPPED
[INFO] ApacheDS Operational Attribute Interceptor ........ SKIPPED
[INFO] ApacheDS Referral Interceptor ..................... SKIPPED
[INFO] ApacheDS Schema Interceptor ....................... SKIPPED
[INFO] ApacheDS Subtree Interceptor ...................... SKIPPED
[INFO] ApacheDS Triggers Interceptor ..................... SKIPPED
[INFO] ApacheDS Core ..................................... SKIPPED
[INFO] ApacheDS Core AVL ................................. SKIPPED
[INFO] ApacheDS Generalized (X) DBM Partition ............ SKIPPED
[INFO] ApacheDS LDIF Partition ........................... SKIPPED
[INFO] ApacheDS JDBM Partition ........................... SKIPPED
[INFO] ApacheDS Mavibot Partition ........................ SKIPPED
[INFO] ApacheDS Core Annotations ......................... SKIPPED
[INFO] ApacheDS Core JNDI ................................ SKIPPED
[INFO] ApacheDS Protocol Kerberos Codec .................. SKIPPED
[INFO] ApacheDS Interceptors for Kerberos ................ SKIPPED
[INFO] ApacheDS Protocol Dhcp ............................ SKIPPED
[INFO] ApacheDS Protocol Shared .......................... SKIPPED
[INFO] ApacheDS Protocol Dns ............................. SKIPPED
[INFO] ApacheDS Protocol Kerberos ........................ SKIPPED
[INFO] ApacheDS Protocol Ldap ............................ SKIPPED
[INFO] ApacheDS Protocol Ntp ............................. SKIPPED
[INFO] Apacheds Server Annotations ....................... SKIPPED
[INFO] ApacheDS Server Config ............................ SKIPPED
[INFO] ApacheDS Server JNDI .............................. SKIPPED
[INFO] ApacheDS Test Framework ........................... SKIPPED
[INFO] ApacheDS All ...................................... SKIPPED
[INFO] ApacheDS Logger Interceptor ....................... SKIPPED
[INFO] ApacheDS Password Hashing Interceptor ............. SKIPPED
[INFO] ApacheDS Core Integration ......................... SKIPPED
[INFO] ApacheDS Protocol Kerberos Test ................... SKIPPED
[INFO] ApacheDS Server Integration ....................... SKIPPED
[INFO] ApacheDS DirectoryService-WebApp bridge ........... SKIPPED
[INFO] ApacheDS Jetty HTTP Server Integration ............ SKIPPED
[INFO] ApacheDS Service Builder .......................... SKIPPED
[INFO] Apache Directory LDAP Client API test ............. SKIPPED
[INFO] kerberos-client ................................... SKIPPED
[INFO] ApacheDS Service .................................. SKIPPED
[INFO] ApacheDS Wrapper .................................. SKIPPED
[INFO] ApacheDS Installers Maven Plugin .................. SKIPPED
[INFO] ApacheDS Installers ............................... SKIPPED
[INFO] ApacheDS OSGi Integration Tests ................... SKIPPED
[INFO] ------------------------------------------------------------------------
[INFO] BUILD FAILURE
[INFO] ------------------------------------------------------------------------
[INFO] Total time: 40.297s
[INFO] Finished at: Wed Apr 29 04:14:32 UTC 2015
[INFO] Final Memory: 39M/249M
[INFO] ------------------------------------------------------------------------
[JENKINS] Archiving disabled
[JENKINS] Archiving disabled
[JENKINS] Archiving disabled
[JENKINS] Archiving disabled
[JENKINS] Archiving disabled
[JENKINS] Archiving disabled
[JENKINS] Archiving disabled
[JENKINS] Archiving disabled
[JENKINS] Archiving disabled
[JENKINS] Archiving disabled
[JENKINS] Archiving disabled
[JENKINS] Archiving disabled
[JENKINS] Archiving disabled
[JENKINS] Archiving disabled
[JENKINS] Archiving disabled
[JENKINS] Archiving disabled
[JENKINS] Archiving disabled
[JENKINS] Archiving disabled
[JENKINS] Archiving disabled
[JENKINS] Archiving disabled
[JENKINS] Archiving disabled
[JENKINS] Archiving disabled
[JENKINS] Archiving disabled
[JENKINS] Archiving disabled
[JENKINS] Archiving disabled
[JENKINS] Archiving disabled
[JENKINS] Archiving disabled
[JENKINS] Archiving disabled
[JENKINS] Archiving disabled
[JENKINS] Archiving disabled
[JENKINS] Archiving disabled
[JENKINS] Archiving disabled
[JENKINS] Archiving disabled
[JENKINS] Archiving disabled
[JENKINS] Archiving disabled
[JENKINS] Archiving disabled
[JENKINS] Archiving disabled
[JENKINS] Archiving disabled
[JENKINS] Archiving disabled
[JENKINS] Archiving disabled
[JENKINS] Archiving disabled
[JENKINS] Archiving disabled
[JENKINS] Archiving disabled
[JENKINS] Archiving disabled
[JENKINS] Archiving disabled
[JENKINS] Archiving disabled
[JENKINS] Archiving disabled
[JENKINS] Archiving disabled
[JENKINS] Archiving disabled
[JENKINS] Archiving disabled
[JENKINS] Archiving disabled
[JENKINS] Archiving disabled
[JENKINS] Archiving disabled
[JENKINS] Archiving disabled
[JENKINS] Archiving disabled
[JENKINS] Archiving disabled
[JENKINS] Archiving disabled
Waiting for Jenkins to finish collecting data[ERROR] Failed to execute goal on project apacheds-core-api:
Could not resolve dependencies for project org.apache.directory.server:apacheds-core-api:bundle:2.0.0-M21-SNAPSHOT:
The following artifacts could not be resolved: org.apache.directory.api:api-i18n:jar:1.0.0-M30,
org.apache.directory.api:api-asn1-api:jar:1.0.0-M30, org.apache.directory.api:api-ldap-client-api:jar:1.0.0-M30,
org.apache.directory.api:api-ldap-codec-core:jar:1.0.0-M30, org.apache.directory.api:api-ldap-extras-aci:jar:1.0.0-M30,
org.apache.directory.api:api-ldap-extras-util:jar:1.0.0-M30, org.apache.directory.api:api-ldap-model:jar:1.0.0-M30,
org.apache.directory.api:api-ldap-schema-data:jar:1.0.0-M30, org.apache.directory.api:api-util:jar:1.0.0-M30:
Could not find artifact org.apache.directory.api:api-i18n:jar:1.0.0-M30 in central (http://repo.maven.apache.org/maven2)
-> [Help 1]
[ERROR] 
[ERROR] To see the full stack trace of the errors, re-run Maven with the -e switch.
[ERROR] Re-run Maven using the -X switch to enable full debug logging.
[ERROR] 
[ERROR] For more information about the errors and possible solutions, please read the following
articles:
[ERROR] [Help 1] http://cwiki.apache.org/confluence/display/MAVEN/DependencyResolutionException
[ERROR] 
[ERROR] After correcting the problems, you can resume the build with the command
[ERROR]   mvn <goals> -rf :apacheds-core-api

channel stopped

Mime
View raw message