directory-notifications mailing list archives

Site index · List index
Message view « Date » · « Thread »
Top « Date » · « Thread »
From Apache Jenkins Server <jenk...@builds.apache.org>
Subject Build failed in Jenkins: dir-apacheds-docker-installers #11
Date Wed, 29 Apr 2015 02:57:10 GMT
See <https://builds.apache.org/job/dir-apacheds-docker-installers/11/changes>

Changes:

[elecharny] [maven-release-plugin] prepare for next development iteration

[elecharny] [maven-release-plugin] prepare release 2.0.0-M20

[elecharny] Added the missing AL 2.0 header and a class header

[elecharny] Also bumped up to the latest Mavibot revision

[elecharny] Bumped up the LDAP API to the latest revision

[elecharny] Added a perf test with Mavibot partition

[elecharny] Added a perf test.

[seelmann] Another test to demonstrate DIRAPI-236

[elecharny] o Cancel all the future in the session map when an unbind is sent
o Improve the test that was hanging for ever before (DIRAPI-236)

[seelmann] Testcase to demonstrate DIRAPI-236, disabled

------------------------------------------
[...truncated 3773 lines...]
[INFO] Installing <https://builds.apache.org/job/dir-apacheds-docker-installers/ws/i18n/target/apacheds-i18n-2.0.0-M21-SNAPSHOT.jar>
to /home/jenkins/.m2/repository/org/apache/directory/server/apacheds-i18n/2.0.0-M21-SNAPSHOT/apacheds-i18n-2.0.0-M21-SNAPSHOT.jar
[INFO] Installing <https://builds.apache.org/job/dir-apacheds-docker-installers/ws/i18n/pom.xml>
to /home/jenkins/.m2/repository/org/apache/directory/server/apacheds-i18n/2.0.0-M21-SNAPSHOT/apacheds-i18n-2.0.0-M21-SNAPSHOT.pom
[INFO] 
[INFO] --- maven-bundle-plugin:2.5.3:install (default-install) @ apacheds-i18n ---
[INFO] Installing org/apache/directory/server/apacheds-i18n/2.0.0-M21-SNAPSHOT/apacheds-i18n-2.0.0-M21-SNAPSHOT.jar
[INFO] Writing OBR metadata
[INFO]                                                                         
[INFO] ------------------------------------------------------------------------
[INFO] Building ApacheDS Core Constants 2.0.0-M21-SNAPSHOT
[INFO] ------------------------------------------------------------------------
[INFO] 
[INFO] --- maven-clean-plugin:2.6.1:clean (default-clean) @ apacheds-core-constants ---
[INFO] 
[INFO] --- maven-remote-resources-plugin:1.5:process (default) @ apacheds-core-constants ---
[INFO] 
[INFO] --- maven-resources-plugin:2.7:resources (default-resources) @ apacheds-core-constants
---
[INFO] Using 'UTF-8' encoding to copy filtered resources.
[INFO] Copying 0 resource
[INFO] Copying 3 resources
[INFO] 
[INFO] --- maven-compiler-plugin:3.2:compile (default-compile) @ apacheds-core-constants ---
[INFO] Changes detected - recompiling the module!
[INFO] Compiling 4 source files to <https://builds.apache.org/job/dir-apacheds-docker-installers/ws/core-constants/target/classes>
[INFO] 
[INFO] --- maven-resources-plugin:2.7:testResources (default-testResources) @ apacheds-core-constants
---
[INFO] Using 'UTF-8' encoding to copy filtered resources.
[INFO] skip non existing resourceDirectory <https://builds.apache.org/job/dir-apacheds-docker-installers/ws/core-constants/src/test/resources>
[INFO] Copying 3 resources
[INFO] 
[INFO] --- maven-compiler-plugin:3.2:testCompile (default-testCompile) @ apacheds-core-constants
---
[INFO] No sources to compile
[INFO] 
[INFO] --- maven-surefire-plugin:2.18.1:test (default-test) @ apacheds-core-constants ---
[INFO] Tests are skipped.
[INFO] 
[INFO] --- maven-bundle-plugin:2.5.3:bundle (default-bundle) @ apacheds-core-constants ---
[INFO] 
[INFO] --- maven-site-plugin:3.4:attach-descriptor (attach-descriptor) @ apacheds-core-constants
---
[INFO] 
[INFO] --- tools-maven-plugin:1.4:verify-legal-files (verify-legal-files) @ apacheds-core-constants
---
[INFO] Checking legal files in: apacheds-core-constants-2.0.0-M21-SNAPSHOT.jar
[INFO] 
[INFO] --- maven-install-plugin:2.5.2:install (default-install) @ apacheds-core-constants
---
[INFO] Installing <https://builds.apache.org/job/dir-apacheds-docker-installers/ws/core-constants/target/apacheds-core-constants-2.0.0-M21-SNAPSHOT.jar>
to /home/jenkins/.m2/repository/org/apache/directory/server/apacheds-core-constants/2.0.0-M21-SNAPSHOT/apacheds-core-constants-2.0.0-M21-SNAPSHOT.jar
[INFO] Installing <https://builds.apache.org/job/dir-apacheds-docker-installers/ws/core-constants/pom.xml>
to /home/jenkins/.m2/repository/org/apache/directory/server/apacheds-core-constants/2.0.0-M21-SNAPSHOT/apacheds-core-constants-2.0.0-M21-SNAPSHOT.pom
[INFO] 
[INFO] --- maven-bundle-plugin:2.5.3:install (default-install) @ apacheds-core-constants ---
[INFO] Installing org/apache/directory/server/apacheds-core-constants/2.0.0-M21-SNAPSHOT/apacheds-core-constants-2.0.0-M21-SNAPSHOT.jar
[INFO] Writing OBR metadata
[INFO]                                                                         
[INFO] ------------------------------------------------------------------------
[INFO] Building ApacheDS Core API 2.0.0-M21-SNAPSHOT
[INFO] ------------------------------------------------------------------------
Downloading: http://repo.maven.apache.org/maven2/org/apache/directory/junit/junit-addons/0.1/junit-addons-0.1.pom
3/3 KB     
         
Downloaded: http://repo.maven.apache.org/maven2/org/apache/directory/junit/junit-addons/0.1/junit-addons-0.1.pom
(3 KB at 30.2 KB/sec)
Downloading: http://repo.maven.apache.org/maven2/org/apache/directory/project/project/20/project-20.pom
4/30 KB   
7/30 KB   
11/30 KB   
15/30 KB   
19/30 KB   
21/30 KB   
25/30 KB   
29/30 KB   
30/30 KB   
           
Downloaded: http://repo.maven.apache.org/maven2/org/apache/directory/project/project/20/project-20.pom
(30 KB at 172.3 KB/sec)
Downloading: http://repo.maven.apache.org/maven2/org/apache/directory/api/api-i18n/1.0.0-M30/api-i18n-1.0.0-M30.pom
           
[WARNING] The POM for org.apache.directory.api:api-i18n:jar:1.0.0-M30 is missing, no dependency
information available
Downloading: http://repo.maven.apache.org/maven2/org/apache/directory/api/api-asn1-api/1.0.0-M30/api-asn1-api-1.0.0-M30.pom
           
[WARNING] The POM for org.apache.directory.api:api-asn1-api:jar:1.0.0-M30 is missing, no dependency
information available
Downloading: http://repo.maven.apache.org/maven2/org/apache/directory/api/api-ldap-client-api/1.0.0-M30/api-ldap-client-api-1.0.0-M30.pom
           
[WARNING] The POM for org.apache.directory.api:api-ldap-client-api:jar:1.0.0-M30 is missing,
no dependency information available
Downloading: http://repo.maven.apache.org/maven2/org/apache/directory/api/api-ldap-codec-core/1.0.0-M30/api-ldap-codec-core-1.0.0-M30.pom
           
[WARNING] The POM for org.apache.directory.api:api-ldap-codec-core:jar:1.0.0-M30 is missing,
no dependency information available
Downloading: http://repo.maven.apache.org/maven2/org/apache/directory/api/api-ldap-extras-aci/1.0.0-M30/api-ldap-extras-aci-1.0.0-M30.pom
           
[WARNING] The POM for org.apache.directory.api:api-ldap-extras-aci:jar:1.0.0-M30 is missing,
no dependency information available
Downloading: http://repo.maven.apache.org/maven2/org/apache/directory/api/api-ldap-extras-util/1.0.0-M30/api-ldap-extras-util-1.0.0-M30.pom
           
[WARNING] The POM for org.apache.directory.api:api-ldap-extras-util:jar:1.0.0-M30 is missing,
no dependency information available
Downloading: http://repo.maven.apache.org/maven2/org/apache/directory/api/api-ldap-model/1.0.0-M30/api-ldap-model-1.0.0-M30.pom
           
[WARNING] The POM for org.apache.directory.api:api-ldap-model:jar:1.0.0-M30 is missing, no
dependency information available
Downloading: http://repo.maven.apache.org/maven2/org/apache/directory/api/api-ldap-schema-data/1.0.0-M30/api-ldap-schema-data-1.0.0-M30.pom
           
[WARNING] The POM for org.apache.directory.api:api-ldap-schema-data:jar:1.0.0-M30 is missing,
no dependency information available
Downloading: http://repo.maven.apache.org/maven2/org/apache/directory/api/api-util/1.0.0-M30/api-util-1.0.0-M30.pom
           
[WARNING] The POM for org.apache.directory.api:api-util:jar:1.0.0-M30 is missing, no dependency
information available
Downloading: http://repo.maven.apache.org/maven2/org/apache/mina/mina-core/2.0.9/mina-core-2.0.9.pom
4/7 KB     
7/7 KB   
         
Downloaded: http://repo.maven.apache.org/maven2/org/apache/mina/mina-core/2.0.9/mina-core-2.0.9.pom
(7 KB at 57.1 KB/sec)
Downloading: http://repo.maven.apache.org/maven2/org/apache/mina/mina-parent/2.0.9/mina-parent-2.0.9.pom
2/33 KB   
6/33 KB   
10/33 KB   
14/33 KB   
14/33 KB   
16/33 KB   
20/33 KB   
24/33 KB   
28/33 KB   
30/33 KB   
31/33 KB   
33/33 KB   
           
Downloaded: http://repo.maven.apache.org/maven2/org/apache/mina/mina-parent/2.0.9/mina-parent-2.0.9.pom
(33 KB at 199.2 KB/sec)
Downloading: http://repo.maven.apache.org/maven2/net/sf/ehcache/ehcache/2.8.5/ehcache-2.8.5.pom
2/19 KB    
6/19 KB   
10/19 KB   
14/19 KB   
17/19 KB   
19/19 KB   
           
Downloaded: http://repo.maven.apache.org/maven2/net/sf/ehcache/ehcache/2.8.5/ehcache-2.8.5.pom
(19 KB at 168.2 KB/sec)
Downloading: http://repo.maven.apache.org/maven2/net/sf/ehcache/ehcache-root/2.8.5/ehcache-root-2.8.5.pom
2/17 KB    
6/17 KB   
10/17 KB   
14/17 KB   
17/17 KB   
           
Downloaded: http://repo.maven.apache.org/maven2/net/sf/ehcache/ehcache-root/2.8.5/ehcache-root-2.8.5.pom
(17 KB at 216.6 KB/sec)
Downloading: http://repo.maven.apache.org/maven2/net/sf/ehcache/ehcache-parent/2.16/ehcache-parent-2.16.pom
2/17 KB    
6/17 KB   
10/17 KB   
14/17 KB   
17/17 KB   
           
Downloaded: http://repo.maven.apache.org/maven2/net/sf/ehcache/ehcache-parent/2.16/ehcache-parent-2.16.pom
(17 KB at 211.6 KB/sec)
Downloading: http://repo.maven.apache.org/maven2/org/apache/directory/junit/junit-addons/0.1/junit-addons-0.1.jar
Downloading: http://repo.maven.apache.org/maven2/org/apache/directory/api/api-i18n/1.0.0-M30/api-i18n-1.0.0-M30.jar
Downloading: http://repo.maven.apache.org/maven2/org/apache/directory/api/api-asn1-api/1.0.0-M30/api-asn1-api-1.0.0-M30.jar
Downloading: http://repo.maven.apache.org/maven2/org/apache/directory/api/api-ldap-client-api/1.0.0-M30/api-ldap-client-api-1.0.0-M30.jar
Downloading: http://repo.maven.apache.org/maven2/org/apache/directory/api/api-ldap-codec-core/1.0.0-M30/api-ldap-codec-core-1.0.0-M30.jar
4/24 KB    
7/24 KB   
11/24 KB   
15/24 KB   
19/24 KB   
21/24 KB   
23/24 KB   
24/24 KB   
           
Downloading: http://repo.maven.apache.org/maven2/org/apache/directory/api/api-ldap-extras-aci/1.0.0-M30/api-ldap-extras-aci-1.0.0-M30.jar
           
Downloading: http://repo.maven.apache.org/maven2/org/apache/directory/api/api-ldap-extras-util/1.0.0-M30/api-ldap-extras-util-1.0.0-M30.jar
           
Downloading: http://repo.maven.apache.org/maven2/org/apache/directory/api/api-ldap-model/1.0.0-M30/api-ldap-model-1.0.0-M30.jar
           
Downloading: http://repo.maven.apache.org/maven2/org/apache/directory/api/api-ldap-schema-data/1.0.0-M30/api-ldap-schema-data-1.0.0-M30.jar
           
Downloaded: http://repo.maven.apache.org/maven2/org/apache/directory/junit/junit-addons/0.1/junit-addons-0.1.jar
(24 KB at 135.2 KB/sec)
Downloading: http://repo.maven.apache.org/maven2/org/apache/directory/api/api-util/1.0.0-M30/api-util-1.0.0-M30.jar
           
           
           
           
           
[INFO] ------------------------------------------------------------------------
[INFO] Reactor Summary:
[INFO] 
[INFO] ApacheDS .......................................... SUCCESS [2.622s]
[INFO] ApacheDS I18n ..................................... SUCCESS [2.927s]
[INFO] ApacheDS Core Constants ........................... SUCCESS [0.480s]
[INFO] ApacheDS Core API ................................. FAILURE [2.835s]
[INFO] ApacheDS Core Shared .............................. SKIPPED
[INFO] ApacheDS Interceptors ............................. SKIPPED
[INFO] ApacheDS AdministrativePoint Interceptor .......... SKIPPED
[INFO] ApacheDS Authentication Interceptor ............... SKIPPED
[INFO] ApacheDS Interceptor to increment numeric attributes  SKIPPED
[INFO] ApacheDS Authorization Interceptor ................ SKIPPED
[INFO] ApacheDS ChangeLog Interceptor .................... SKIPPED
[INFO] ApacheDS Collective Attribute Interceptor ......... SKIPPED
[INFO] ApacheDS Event Interceptor ........................ SKIPPED
[INFO] ApacheDS Exception Interceptor .................... SKIPPED
[INFO] ApacheDS Journal Interceptor ...................... SKIPPED
[INFO] ApacheDS Normalization Interceptor ................ SKIPPED
[INFO] ApacheDS Operational Attribute Interceptor ........ SKIPPED
[INFO] ApacheDS Referral Interceptor ..................... SKIPPED
[INFO] ApacheDS Schema Interceptor ....................... SKIPPED
[INFO] ApacheDS Subtree Interceptor ...................... SKIPPED
[INFO] ApacheDS Triggers Interceptor ..................... SKIPPED
[INFO] ApacheDS Core ..................................... SKIPPED
[INFO] ApacheDS Core AVL ................................. SKIPPED
[INFO] ApacheDS Generalized (X) DBM Partition ............ SKIPPED
[INFO] ApacheDS LDIF Partition ........................... SKIPPED
[INFO] ApacheDS JDBM Partition ........................... SKIPPED
[INFO] ApacheDS Mavibot Partition ........................ SKIPPED
[INFO] ApacheDS Core Annotations ......................... SKIPPED
[INFO] ApacheDS Core JNDI ................................ SKIPPED
[INFO] ApacheDS Protocol Kerberos Codec .................. SKIPPED
[INFO] ApacheDS Interceptors for Kerberos ................ SKIPPED
[INFO] ApacheDS Protocol Dhcp ............................ SKIPPED
[INFO] ApacheDS Protocol Shared .......................... SKIPPED
[INFO] ApacheDS Protocol Dns ............................. SKIPPED
[INFO] ApacheDS Protocol Kerberos ........................ SKIPPED
[INFO] ApacheDS Protocol Ldap ............................ SKIPPED
[INFO] ApacheDS Protocol Ntp ............................. SKIPPED
[INFO] Apacheds Server Annotations ....................... SKIPPED
[INFO] ApacheDS Server Config ............................ SKIPPED
[INFO] ApacheDS Server JNDI .............................. SKIPPED
[INFO] ApacheDS Test Framework ........................... SKIPPED
[INFO] ApacheDS All ...................................... SKIPPED
[INFO] ApacheDS Logger Interceptor ....................... SKIPPED
[INFO] ApacheDS Password Hashing Interceptor ............. SKIPPED
[INFO] ApacheDS Core Integration ......................... SKIPPED
[INFO] ApacheDS Protocol Kerberos Test ................... SKIPPED
[INFO] ApacheDS Server Integration ....................... SKIPPED
[INFO] ApacheDS DirectoryService-WebApp bridge ........... SKIPPED
[INFO] ApacheDS Jetty HTTP Server Integration ............ SKIPPED
[INFO] ApacheDS Service Builder .......................... SKIPPED
[INFO] Apache Directory LDAP Client API test ............. SKIPPED
[INFO] kerberos-client ................................... SKIPPED
[INFO] ApacheDS Service .................................. SKIPPED
[INFO] ApacheDS Wrapper .................................. SKIPPED
[INFO] ApacheDS Installers Maven Plugin .................. SKIPPED
[INFO] ApacheDS Installers ............................... SKIPPED
[INFO] ApacheDS OSGi Integration Tests ................... SKIPPED
[INFO] ------------------------------------------------------------------------
[INFO] BUILD FAILURE
[INFO] ------------------------------------------------------------------------
[INFO] Total time: 11.625s
[INFO] Finished at: Wed Apr 29 02:57:10 UTC 2015
[INFO] Final Memory: 36M/218M
[INFO] ------------------------------------------------------------------------
[ERROR] Failed to execute goal on project apacheds-core-api: Could not resolve dependencies
for project org.apache.directory.server:apacheds-core-api:bundle:2.0.0-M21-SNAPSHOT: The following
artifacts could not be resolved: org.apache.directory.api:api-i18n:jar:1.0.0-M30, org.apache.directory.api:api-asn1-api:jar:1.0.0-M30,
org.apache.directory.api:api-ldap-client-api:jar:1.0.0-M30, org.apache.directory.api:api-ldap-codec-core:jar:1.0.0-M30,
org.apache.directory.api:api-ldap-extras-aci:jar:1.0.0-M30, org.apache.directory.api:api-ldap-extras-util:jar:1.0.0-M30,
org.apache.directory.api:api-ldap-model:jar:1.0.0-M30, org.apache.directory.api:api-ldap-schema-data:jar:1.0.0-M30,
org.apache.directory.api:api-util:jar:1.0.0-M30: Could not find artifact org.apache.directory.api:api-i18n:jar:1.0.0-M30
in central (http://repo.maven.apache.org/maven2) -> [Help 1]
[ERROR] 
[ERROR] To see the full stack trace of the errors, re-run Maven with the -e switch.
[ERROR] Re-run Maven using the -X switch to enable full debug logging.
[ERROR] 
[ERROR] For more information about the errors and possible solutions, please read the following
articles:
[ERROR] [Help 1] http://cwiki.apache.org/confluence/display/MAVEN/DependencyResolutionException
[ERROR] 
[ERROR] After correcting the problems, you can resume the build with the command
[ERROR]   mvn <goals> -rf :apacheds-core-api
Build step 'Invoke top-level Maven targets' marked build as failure
Archiving artifacts

Mime
View raw message