directory-notifications mailing list archives

Site index · List index
Message view « Date » · « Thread »
Top « Date » · « Thread »
From Apache Jenkins Server <jenk...@builds.apache.org>
Subject Build failed in Jenkins: dir-apacheds-ubuntu-deploy #1575
Date Sun, 11 Jan 2015 04:21:14 GMT
See <https://builds.apache.org/job/dir-apacheds-ubuntu-deploy/1575/changes>

Changes:

[drankye] Kai is testing his commit, removing the test file

[drankye] Kai is testing his commit

[elecharny] Used LDAP constants instead of Strings

------------------------------------------
[...truncated 3163 lines...]
Tests run: 4, Failures: 0, Errors: 0, Skipped: 1, Time elapsed: 0.705 sec - in org.apache.directory.server.kerberos.protocol.AuthenticationEncryptionTypeTest
Running org.apache.directory.server.kerberos.protocol.TicketGrantingPolicyTest
Tests run: 12, Failures: 0, Errors: 0, Skipped: 0, Time elapsed: 0.251 sec - in org.apache.directory.server.kerberos.protocol.TicketGrantingPolicyTest
Running org.apache.directory.server.kerberos.protocol.TicketGrantingServiceTest
Tests run: 37, Failures: 0, Errors: 0, Skipped: 2, Time elapsed: 0.504 sec - in org.apache.directory.server.kerberos.protocol.TicketGrantingServiceTest
Running org.apache.directory.server.kerberos.protocol.EncTktInSkeyTest
Tests run: 1, Failures: 0, Errors: 0, Skipped: 0, Time elapsed: 0.013 sec - in org.apache.directory.server.kerberos.protocol.EncTktInSkeyTest
Running org.apache.directory.server.kerberos.protocol.AuthenticationPolicyTest
Tests run: 7, Failures: 0, Errors: 0, Skipped: 0, Time elapsed: 0.005 sec - in org.apache.directory.server.kerberos.protocol.AuthenticationPolicyTest
Running org.apache.directory.server.kerberos.protocol.AuthenticationServiceTest
Tests run: 30, Failures: 0, Errors: 0, Skipped: 0, Time elapsed: 0.319 sec - in org.apache.directory.server.kerberos.protocol.AuthenticationServiceTest
Running org.apache.directory.server.kerberos.protocol.TicketGrantingEncryptionTypeTest
Tests run: 6, Failures: 0, Errors: 0, Skipped: 1, Time elapsed: 0.073 sec - in org.apache.directory.server.kerberos.protocol.TicketGrantingEncryptionTypeTest
Running org.apache.directory.server.kerberos.protocol.PreAuthenticationTest
Tests run: 4, Failures: 0, Errors: 0, Skipped: 0, Time elapsed: 0.034 sec - in org.apache.directory.server.kerberos.protocol.PreAuthenticationTest

Results :

Tests run: 101, Failures: 0, Errors: 0, Skipped: 4

[JENKINS] Recording test results
[INFO] 
[INFO] --- maven-bundle-plugin:2.5.0:bundle (default-bundle) @ apacheds-protocol-kerberos
---
[INFO] 
[INFO] --- maven-site-plugin:3.3:attach-descriptor (attach-descriptor) @ apacheds-protocol-kerberos
---
[INFO] 
[INFO] --- tools-maven-plugin:1.4:verify-legal-files (verify-legal-files) @ apacheds-protocol-kerberos
---
[INFO] Checking legal files in: apacheds-protocol-kerberos-2.0.0-M20-SNAPSHOT.jar
[WARNING] Failed to getClass for org.apache.maven.plugin.source.SourceJarMojo
[INFO] 
[INFO] --- maven-source-plugin:2.2.1:jar (attach-sources) @ apacheds-protocol-kerberos ---
[INFO] Building jar: <https://builds.apache.org/job/dir-apacheds-ubuntu-deploy/ws/trunk/protocol-kerberos/target/apacheds-protocol-kerberos-2.0.0-M20-SNAPSHOT-sources.jar>
[INFO] 
[INFO] --- maven-install-plugin:2.5.1:install (default-install) @ apacheds-protocol-kerberos
---
[INFO] Installing <https://builds.apache.org/job/dir-apacheds-ubuntu-deploy/ws/trunk/protocol-kerberos/target/apacheds-protocol-kerberos-2.0.0-M20-SNAPSHOT.jar>
to /home/jenkins/jenkins-slave/maven-repositories/1/org/apache/directory/server/apacheds-protocol-kerberos/2.0.0-M20-SNAPSHOT/apacheds-protocol-kerberos-2.0.0-M20-SNAPSHOT.jar
[INFO] Installing <https://builds.apache.org/job/dir-apacheds-ubuntu-deploy/ws/trunk/protocol-kerberos/pom.xml>
to /home/jenkins/jenkins-slave/maven-repositories/1/org/apache/directory/server/apacheds-protocol-kerberos/2.0.0-M20-SNAPSHOT/apacheds-protocol-kerberos-2.0.0-M20-SNAPSHOT.pom
[INFO] Installing <https://builds.apache.org/job/dir-apacheds-ubuntu-deploy/ws/trunk/protocol-kerberos/target/apacheds-protocol-kerberos-2.0.0-M20-SNAPSHOT-sources.jar>
to /home/jenkins/jenkins-slave/maven-repositories/1/org/apache/directory/server/apacheds-protocol-kerberos/2.0.0-M20-SNAPSHOT/apacheds-protocol-kerberos-2.0.0-M20-SNAPSHOT-sources.jar
[INFO] 
[INFO] --- maven-bundle-plugin:2.5.0:install (default-install) @ apacheds-protocol-kerberos
---
[INFO] Installing org/apache/directory/server/apacheds-protocol-kerberos/2.0.0-M20-SNAPSHOT/apacheds-protocol-kerberos-2.0.0-M20-SNAPSHOT.jar
[INFO] Writing OBR metadata
[INFO] 
[INFO] --- maven-deploy-plugin:2.8.1:deploy (default-deploy) @ apacheds-protocol-kerberos
---
Downloading: https://repository.apache.org/content/repositories/snapshots/org/apache/directory/server/apacheds-protocol-kerberos/2.0.0-M20-SNAPSHOT/maven-metadata.xml
Downloaded: https://repository.apache.org/content/repositories/snapshots/org/apache/directory/server/apacheds-protocol-kerberos/2.0.0-M20-SNAPSHOT/maven-metadata.xml
(2 KB at 1.4 KB/sec)
Uploading: https://repository.apache.org/content/repositories/snapshots/org/apache/directory/server/apacheds-protocol-kerberos/2.0.0-M20-SNAPSHOT/apacheds-protocol-kerberos-2.0.0-M20-20150111.042037-56.jar
Uploaded: https://repository.apache.org/content/repositories/snapshots/org/apache/directory/server/apacheds-protocol-kerberos/2.0.0-M20-SNAPSHOT/apacheds-protocol-kerberos-2.0.0-M20-20150111.042037-56.jar
(78 KB at 115.4 KB/sec)
Uploading: https://repository.apache.org/content/repositories/snapshots/org/apache/directory/server/apacheds-protocol-kerberos/2.0.0-M20-SNAPSHOT/apacheds-protocol-kerberos-2.0.0-M20-20150111.042037-56.pom
Uploaded: https://repository.apache.org/content/repositories/snapshots/org/apache/directory/server/apacheds-protocol-kerberos/2.0.0-M20-SNAPSHOT/apacheds-protocol-kerberos-2.0.0-M20-20150111.042037-56.pom
(5 KB at 7.5 KB/sec)
Downloading: https://repository.apache.org/content/repositories/snapshots/org/apache/directory/server/apacheds-protocol-kerberos/maven-metadata.xml
Downloaded: https://repository.apache.org/content/repositories/snapshots/org/apache/directory/server/apacheds-protocol-kerberos/maven-metadata.xml
(421 B at 0.7 KB/sec)
Uploading: https://repository.apache.org/content/repositories/snapshots/org/apache/directory/server/apacheds-protocol-kerberos/2.0.0-M20-SNAPSHOT/maven-metadata.xml
Uploaded: https://repository.apache.org/content/repositories/snapshots/org/apache/directory/server/apacheds-protocol-kerberos/2.0.0-M20-SNAPSHOT/maven-metadata.xml
(2 KB at 0.2 KB/sec)
Uploading: https://repository.apache.org/content/repositories/snapshots/org/apache/directory/server/apacheds-protocol-kerberos/maven-metadata.xml
Uploaded: https://repository.apache.org/content/repositories/snapshots/org/apache/directory/server/apacheds-protocol-kerberos/maven-metadata.xml
(421 B at 0.9 KB/sec)
Uploading: https://repository.apache.org/content/repositories/snapshots/org/apache/directory/server/apacheds-protocol-kerberos/2.0.0-M20-SNAPSHOT/apacheds-protocol-kerberos-2.0.0-M20-20150111.042037-56-sources.jar
Uploaded: https://repository.apache.org/content/repositories/snapshots/org/apache/directory/server/apacheds-protocol-kerberos/2.0.0-M20-SNAPSHOT/apacheds-protocol-kerberos-2.0.0-M20-20150111.042037-56-sources.jar
(69 KB at 123.2 KB/sec)
Uploading: https://repository.apache.org/content/repositories/snapshots/org/apache/directory/server/apacheds-protocol-kerberos/2.0.0-M20-SNAPSHOT/maven-metadata.xml
Uploaded: https://repository.apache.org/content/repositories/snapshots/org/apache/directory/server/apacheds-protocol-kerberos/2.0.0-M20-SNAPSHOT/maven-metadata.xml
(2 KB at 2.3 KB/sec)
[INFO] 
[INFO] --- maven-bundle-plugin:2.5.0:deploy (default-deploy) @ apacheds-protocol-kerberos
---
[INFO] Remote OBR update disabled (enable with -DremoteOBR)
[JENKINS] Archiving disabled
[INFO]                                                                         
[INFO] ------------------------------------------------------------------------
[INFO] Building ApacheDS Protocol Ldap 2.0.0-M20-SNAPSHOT
[INFO] ------------------------------------------------------------------------
Downloading: http://repository.apache.org/snapshots/org/apache/directory/api/api-ldap-extras-sp/1.0.0-M28-SNAPSHOT/maven-metadata.xml
Downloaded: http://repository.apache.org/snapshots/org/apache/directory/api/api-ldap-extras-sp/1.0.0-M28-SNAPSHOT/maven-metadata.xml
(2 KB at 1.0 KB/sec)
Downloading: http://repository.apache.org/snapshots/org/apache/directory/api/api-ldap-extras-sp/1.0.0-M28-SNAPSHOT/api-ldap-extras-sp-1.0.0-M28-20150110.020120-17.pom
Downloaded: http://repository.apache.org/snapshots/org/apache/directory/api/api-ldap-extras-sp/1.0.0-M28-SNAPSHOT/api-ldap-extras-sp-1.0.0-M28-20150110.020120-17.pom
(4 KB at 29.9 KB/sec)
Downloading: http://repository.apache.org/snapshots/org/apache/directory/api/api-ldap-extras-sp/1.0.0-M28-SNAPSHOT/api-ldap-extras-sp-1.0.0-M28-20150110.020120-17.jar
Downloaded: http://repository.apache.org/snapshots/org/apache/directory/api/api-ldap-extras-sp/1.0.0-M28-SNAPSHOT/api-ldap-extras-sp-1.0.0-M28-20150110.020120-17.jar
(13 KB at 35.0 KB/sec)
[INFO] 
[INFO] --- maven-clean-plugin:2.4.1:clean (default-clean) @ apacheds-protocol-ldap ---
[INFO] Deleting <https://builds.apache.org/job/dir-apacheds-ubuntu-deploy/ws/trunk/protocol-ldap/target>
[INFO] 
[INFO] --- maven-remote-resources-plugin:1.2.1:process (default) @ apacheds-protocol-ldap
---
[INFO] 
[INFO] --- maven-resources-plugin:2.6:resources (default-resources) @ apacheds-protocol-ldap
---
[INFO] Using 'UTF-8' encoding to copy filtered resources.
[INFO] Copying 0 resource
[INFO] Copying 3 resources
[INFO] 
[INFO] --- maven-compiler-plugin:3.1:compile (default-compile) @ apacheds-protocol-ldap ---
[INFO] Changes detected - recompiling the module!
[INFO] Compiling 81 source files to <https://builds.apache.org/job/dir-apacheds-ubuntu-deploy/ws/trunk/protocol-ldap/target/classes>
[INFO] -------------------------------------------------------------
[WARNING] COMPILATION WARNING : 
[INFO] -------------------------------------------------------------
[WARNING] <https://builds.apache.org/job/dir-apacheds-ubuntu-deploy/ws/trunk/protocol-ldap/src/main/java/org/apache/directory/server/ldap/LdapServer.java>:
Some input files use unchecked or unsafe operations.
[WARNING] <https://builds.apache.org/job/dir-apacheds-ubuntu-deploy/ws/trunk/protocol-ldap/src/main/java/org/apache/directory/server/ldap/LdapServer.java>:
Recompile with -Xlint:unchecked for details.
[INFO] 2 warnings 
[INFO] -------------------------------------------------------------
[INFO] -------------------------------------------------------------
[ERROR] COMPILATION ERROR : 
[INFO] -------------------------------------------------------------
[ERROR] <https://builds.apache.org/job/dir-apacheds-ubuntu-deploy/ws/trunk/protocol-ldap/src/main/java/org/apache/directory/server/ldap/replication/SyncReplConfiguration.java>:[28,53]
cannot find symbol
  symbol:   class LdapConstants
  location: package org.apache.directory.api.ldap.model.constants
[ERROR] <https://builds.apache.org/job/dir-apacheds-ubuntu-deploy/ws/trunk/protocol-ldap/src/main/java/org/apache/directory/server/ldap/replication/SyncReplConfiguration.java>:[92,29]
cannot find symbol
  symbol:   variable LdapConstants
  location: class org.apache.directory.server.ldap.replication.SyncReplConfiguration
[INFO] 2 errors 
[INFO] -------------------------------------------------------------
[JENKINS] Archiving disabled
[INFO] ------------------------------------------------------------------------
[INFO] Reactor Summary:
[INFO] 
[INFO] ApacheDS .......................................... SUCCESS [12.050s]
[INFO] ApacheDS I18n ..................................... SUCCESS [1:00.746s]
[INFO] ApacheDS Core Constants ........................... SUCCESS [10.229s]
[INFO] ApacheDS Core API ................................. SUCCESS [2:11.147s]
[INFO] ApacheDS Core Shared .............................. SUCCESS [51.930s]
[INFO] ApacheDS Interceptors ............................. SUCCESS [5.786s]
[INFO] ApacheDS AdministrativePoint Interceptor .......... SUCCESS [48.646s]
[INFO] ApacheDS Authentication Interceptor ............... SUCCESS [28.785s]
[INFO] ApacheDS Interceptor to increment numeric attributes  SUCCESS [30.608s]
[INFO] ApacheDS Authorization Interceptor ................ SUCCESS [22.006s]
[INFO] ApacheDS ChangeLog Interceptor .................... SUCCESS [31.903s]
[INFO] ApacheDS Collective Attribute Interceptor ......... SUCCESS [20.085s]
[INFO] ApacheDS Event Interceptor ........................ SUCCESS [18.510s]
[INFO] ApacheDS Exception Interceptor .................... SUCCESS [8.747s]
[INFO] ApacheDS Journal Interceptor ...................... SUCCESS [9.063s]
[INFO] ApacheDS Normalization Interceptor ................ SUCCESS [27.181s]
[INFO] ApacheDS Operational Attribute Interceptor ........ SUCCESS [14.592s]
[INFO] ApacheDS Referral Interceptor ..................... SUCCESS [8.326s]
[INFO] ApacheDS Schema Interceptor ....................... SUCCESS [17.473s]
[INFO] ApacheDS Subtree Interceptor ...................... SUCCESS [29.625s]
[INFO] ApacheDS Triggers Interceptor ..................... SUCCESS [13.741s]
[INFO] ApacheDS Core ..................................... SUCCESS [47.272s]
[INFO] ApacheDS Core AVL ................................. SUCCESS [16.634s]
[INFO] ApacheDS Generalized (X) DBM Partition ............ SUCCESS [1:00.210s]
[INFO] ApacheDS LDIF Partition ........................... SUCCESS [15.714s]
[INFO] ApacheDS JDBM Partition ........................... SUCCESS [32.527s]
[INFO] ApacheDS Mavibot Partition ........................ SUCCESS [17.890s]
[INFO] ApacheDS Core Annotations ......................... SUCCESS [35.810s]
[INFO] ApacheDS Core JNDI ................................ SUCCESS [23.609s]
[INFO] ApacheDS Protocol Kerberos Codec .................. SUCCESS [20.192s]
[INFO] ApacheDS Interceptors for Kerberos ................ SUCCESS [1:54.375s]
[INFO] ApacheDS Protocol Dhcp ............................ SUCCESS [12.763s]
[INFO] ApacheDS Protocol Shared .......................... SUCCESS [1:12.453s]
[INFO] ApacheDS Protocol Dns ............................. SUCCESS [1:24.718s]
[INFO] ApacheDS Protocol Kerberos ........................ SUCCESS [15.483s]
[INFO] ApacheDS Protocol Ldap ............................ FAILURE [2.829s]
[INFO] ApacheDS Protocol Ntp ............................. SKIPPED
[INFO] Apacheds Server Annotations ....................... SKIPPED
[INFO] ApacheDS Server Config ............................ SKIPPED
[INFO] ApacheDS Server JNDI .............................. SKIPPED
[INFO] ApacheDS Test Framework ........................... SKIPPED
[INFO] ApacheDS All ...................................... SKIPPED
[INFO] ApacheDS Logger Interceptor ....................... SKIPPED
[INFO] ApacheDS Password Hashing Interceptor ............. SKIPPED
[INFO] ApacheDS Core Integration ......................... SKIPPED
[INFO] ApacheDS Protocol Kerberos Test ................... SKIPPED
[INFO] ApacheDS Server Integration ....................... SKIPPED
[INFO] ApacheDS DirectoryService-WebApp bridge ........... SKIPPED
[INFO] ApacheDS Jetty HTTP Server Integration ............ SKIPPED
[INFO] ApacheDS Service Builder .......................... SKIPPED
[INFO] Apache Directory LDAP Client API test ............. SKIPPED
[INFO] kerberos-client ................................... SKIPPED
[INFO] ApacheDS Service .................................. SKIPPED
[INFO] ApacheDS Wrapper .................................. SKIPPED
[INFO] ApacheDS Installers Maven Plugin .................. SKIPPED
[INFO] ApacheDS Installers ............................... SKIPPED
[INFO] ApacheDS OSGi Integration Tests ................... SKIPPED
[INFO] ------------------------------------------------------------------------
[INFO] BUILD FAILURE
[INFO] ------------------------------------------------------------------------
[INFO] Total time: 19:58.261s
[INFO] Finished at: Sun Jan 11 04:20:49 UTC 2015
[INFO] Final Memory: 63M/311M
[INFO] ------------------------------------------------------------------------
[JENKINS] Archiving disabled
[JENKINS] Archiving disabled
[JENKINS] Archiving disabled
[JENKINS] Archiving disabled
[JENKINS] Archiving disabled
[JENKINS] Archiving disabled
[JENKINS] Archiving disabled
[JENKINS] Archiving disabled
[JENKINS] Archiving disabled
[JENKINS] Archiving disabled
[JENKINS] Archiving disabled
[JENKINS] Archiving disabled
[JENKINS] Archiving disabled
[JENKINS] Archiving disabled
[JENKINS] Archiving disabled
[JENKINS] Archiving disabled
[JENKINS] Archiving disabled
[JENKINS] Archiving disabled
[JENKINS] Archiving disabled
[JENKINS] Archiving disabled
[JENKINS] Archiving disabled
[JENKINS] Archiving disabled
[JENKINS] Archiving disabled
[JENKINS] Archiving disabled
[JENKINS] Archiving disabled
[JENKINS] Archiving disabled
[JENKINS] Archiving disabled
[JENKINS] Archiving disabled
[JENKINS] Archiving disabled
[JENKINS] Archiving disabled
[JENKINS] Archiving disabled
[JENKINS] Archiving disabled
[JENKINS] Archiving disabled
[JENKINS] Archiving disabled
[JENKINS] Archiving disabled
[JENKINS] Archiving disabled
[JENKINS] Archiving disabled
[JENKINS] Archiving disabled
[JENKINS] Archiving disabled
[JENKINS] Archiving disabled
[JENKINS] Archiving disabled
[JENKINS] Archiving disabled
[JENKINS] Archiving disabled
[JENKINS] Archiving disabled
[JENKINS] Archiving disabled
[JENKINS] Archiving disabled
[JENKINS] Archiving disabled
[JENKINS] Archiving disabled
[JENKINS] Archiving disabled
[JENKINS] Archiving disabled
[JENKINS] Archiving disabled
[JENKINS] Archiving disabled
[JENKINS] Archiving disabled
[JENKINS] Archiving disabled
[JENKINS] Archiving disabled
[JENKINS] Archiving disabled
[JENKINS] Archiving disabled
Waiting for Jenkins to finish collecting data[ERROR] Failed to execute goal org.apache.maven.plugins:maven-compiler-plugin:3.1:compile
(default-compile) on project apacheds-protocol-ldap: Compilation failure: Compilation failure:
[ERROR] <https://builds.apache.org/job/dir-apacheds-ubuntu-deploy/ws/trunk/protocol-ldap/src/main/java/org/apache/directory/server/ldap/replication/SyncReplConfiguration.java>:[28,53]
cannot find symbol
[ERROR] symbol:   class LdapConstants
[ERROR] location: package org.apache.directory.api.ldap.model.constants
[ERROR] <https://builds.apache.org/job/dir-apacheds-ubuntu-deploy/ws/trunk/protocol-ldap/src/main/java/org/apache/directory/server/ldap/replication/SyncReplConfiguration.java>:[92,29]
cannot find symbol
[ERROR] symbol:   variable LdapConstants
[ERROR] location: class org.apache.directory.server.ldap.replication.SyncReplConfiguration
[ERROR] -> [Help 1]
[ERROR] 
[ERROR] To see the full stack trace of the errors, re-run Maven with the -e switch.
[ERROR] Re-run Maven using the -X switch to enable full debug logging.
[ERROR] 
[ERROR] For more information about the errors and possible solutions, please read the following
articles:
[ERROR] [Help 1] http://cwiki.apache.org/confluence/display/MAVEN/MojoFailureException
[ERROR] 
[ERROR] After correcting the problems, you can resume the build with the command
[ERROR]   mvn <goals> -rf :apacheds-protocol-ldap

channel stopped

Mime
View raw message