directory-notifications mailing list archives

Site index · List index
Message view « Date » · « Thread »
Top « Date » · « Thread »
From Apache Jenkins Server <jenk...@builds.apache.org>
Subject Build failed in Jenkins: dir-apacheds-ubuntu-deploy #1599
Date Sat, 31 Jan 2015 04:11:12 GMT
See <https://builds.apache.org/job/dir-apacheds-ubuntu-deploy/1599/>

------------------------------------------
[...truncated 4078 lines...]
Running org.apache.directory.server.core.jndi.UniqueMemberIT
Tests run: 8, Failures: 0, Errors: 0, Skipped: 0, Time elapsed: 1.387 sec - in org.apache.directory.server.core.jndi.UniqueMemberIT
Running org.apache.directory.server.core.jndi.SimpleBindJndiIT
Tests run: 9, Failures: 0, Errors: 0, Skipped: 0, Time elapsed: 1.253 sec - in org.apache.directory.server.core.jndi.SimpleBindJndiIT
Running org.apache.directory.server.core.jndi.DestroyContextIT
Tests run: 1, Failures: 0, Errors: 0, Skipped: 0, Time elapsed: 1.399 sec - in org.apache.directory.server.core.jndi.DestroyContextIT
Running org.apache.directory.server.core.jndi.ListIT
Tests run: 4, Failures: 0, Errors: 0, Skipped: 0, Time elapsed: 1.312 sec - in org.apache.directory.server.core.jndi.ListIT
Running org.apache.directory.server.core.jndi.CreateContextIT
Tests run: 8, Failures: 0, Errors: 0, Skipped: 0, Time elapsed: 1.485 sec - in org.apache.directory.server.core.jndi.CreateContextIT
Running org.apache.directory.server.core.jndi.RFC2713IT
Tests run: 1, Failures: 0, Errors: 0, Skipped: 0, Time elapsed: 1.227 sec - in org.apache.directory.server.core.jndi.RFC2713IT
Running org.apache.directory.server.core.jndi.DIRSERVER791IT
Tests run: 4, Failures: 0, Errors: 0, Skipped: 0, Time elapsed: 1.334 sec - in org.apache.directory.server.core.jndi.DIRSERVER791IT
Running org.apache.directory.server.core.jndi.referral.ModifyReferralIT
Tests run: 10, Failures: 0, Errors: 0, Skipped: 0, Time elapsed: 1.215 sec - in org.apache.directory.server.core.jndi.referral.ModifyReferralIT
Running org.apache.directory.server.core.jndi.referral.AddReferralIT
Tests run: 6, Failures: 0, Errors: 0, Skipped: 0, Time elapsed: 1.263 sec - in org.apache.directory.server.core.jndi.referral.AddReferralIT
Running org.apache.directory.server.core.jndi.referral.CompareReferralIT
Tests run: 10, Failures: 0, Errors: 0, Skipped: 0, Time elapsed: 1.204 sec - in org.apache.directory.server.core.jndi.referral.CompareReferralIT
Running org.apache.directory.server.core.jndi.referral.DeleteReferralIT
Tests run: 8, Failures: 0, Errors: 0, Skipped: 0, Time elapsed: 1.414 sec - in org.apache.directory.server.core.jndi.referral.DeleteReferralIT
Running org.apache.directory.server.core.jndi.referral.RenameReferralIT
Tests run: 9, Failures: 0, Errors: 0, Skipped: 0, Time elapsed: 1.255 sec - in org.apache.directory.server.core.jndi.referral.RenameReferralIT
Running org.apache.directory.server.core.jndi.referral.RenameReferralIgnoreIT
Tests run: 6, Failures: 0, Errors: 0, Skipped: 0, Time elapsed: 1.295 sec - in org.apache.directory.server.core.jndi.referral.RenameReferralIgnoreIT
Running org.apache.directory.server.core.jndi.referral.MoveReferralIT
Tests run: 14, Failures: 0, Errors: 0, Skipped: 0, Time elapsed: 1.284 sec - in org.apache.directory.server.core.jndi.referral.MoveReferralIT
Running org.apache.directory.server.core.jndi.referral.MoveAndRenameReferralIT
Tests run: 12, Failures: 0, Errors: 0, Skipped: 0, Time elapsed: 1.235 sec - in org.apache.directory.server.core.jndi.referral.MoveAndRenameReferralIT
Running org.apache.directory.server.core.jndi.referral.SearchReferralIT
Tests run: 10, Failures: 0, Errors: 0, Skipped: 0, Time elapsed: 1.286 sec - in org.apache.directory.server.core.jndi.referral.SearchReferralIT
Running org.apache.directory.server.core.jndi.DIRSERVER169IT
Tests run: 2, Failures: 0, Errors: 0, Skipped: 0, Time elapsed: 1.201 sec - in org.apache.directory.server.core.jndi.DIRSERVER169IT
Running org.apache.directory.server.core.jndi.ReferralIT
Tests run: 33, Failures: 0, Errors: 0, Skipped: 0, Time elapsed: 4.111 sec - in org.apache.directory.server.core.jndi.ReferralIT
Running org.apache.directory.server.core.schema.MetaSyntaxHandlerIT
Tests run: 18, Failures: 0, Errors: 0, Skipped: 12, Time elapsed: 1.514 sec - in org.apache.directory.server.core.schema.MetaSyntaxHandlerIT
Running org.apache.directory.server.core.schema.MetaObjectClassHandlerIT
Tests run: 27, Failures: 0, Errors: 0, Skipped: 12, Time elapsed: 1.413 sec - in org.apache.directory.server.core.schema.MetaObjectClassHandlerIT
Running org.apache.directory.server.core.schema.SchemaPersistenceIT
Tests run: 2, Failures: 0, Errors: 0, Skipped: 0, Time elapsed: 4.419 sec - in org.apache.directory.server.core.schema.SchemaPersistenceIT
Running org.apache.directory.server.core.schema.MetaSyntaxCheckerHandlerIT
Tests run: 20, Failures: 0, Errors: 0, Skipped: 12, Time elapsed: 1.344 sec - in org.apache.directory.server.core.schema.MetaSyntaxCheckerHandlerIT
Running org.apache.directory.server.core.schema.MetaNormalizerHandlerIT
Tests run: 20, Failures: 0, Errors: 0, Skipped: 12, Time elapsed: 1.21 sec - in org.apache.directory.server.core.schema.MetaNormalizerHandlerIT
Running org.apache.directory.server.core.schema.ObjectClassCreateIT
Tests run: 4, Failures: 0, Errors: 0, Skipped: 0, Time elapsed: 1.284 sec - in org.apache.directory.server.core.schema.ObjectClassCreateIT
Running org.apache.directory.server.core.schema.SubschemaSubentryIT
Tests run: 18, Failures: 0, Errors: 0, Skipped: 1, Time elapsed: 24.365 sec - in org.apache.directory.server.core.schema.SubschemaSubentryIT
Running org.apache.directory.server.core.schema.SchemaServiceIT
Tests run: 23, Failures: 0, Errors: 0, Skipped: 0, Time elapsed: 3.033 sec - in org.apache.directory.server.core.schema.SchemaServiceIT
Running org.apache.directory.server.core.schema.MetaSchemaHandlerIT
Tests run: 29, Failures: 0, Errors: 0, Skipped: 16, Time elapsed: 1.432 sec - in org.apache.directory.server.core.schema.MetaSchemaHandlerIT
Running org.apache.directory.server.core.schema.PartitionSchemaLoaderIT
Tests run: 1, Failures: 0, Errors: 0, Skipped: 0, Time elapsed: 0.385 sec - in org.apache.directory.server.core.schema.PartitionSchemaLoaderIT
Running org.apache.directory.server.core.schema.MetaComparatorHandlerIT
Tests run: 20, Failures: 0, Errors: 0, Skipped: 12, Time elapsed: 1.266 sec - in org.apache.directory.server.core.schema.MetaComparatorHandlerIT
Running org.apache.directory.server.core.schema.MetaAttributeTypeHandlerIT
Tests run: 19, Failures: 0, Errors: 0, Skipped: 11, Time elapsed: 1.333 sec - in org.apache.directory.server.core.schema.MetaAttributeTypeHandlerIT
Running org.apache.directory.server.core.schema.MetaMatchingRuleHandlerIT
Tests run: 14, Failures: 0, Errors: 0, Skipped: 9, Time elapsed: 1.305 sec - in org.apache.directory.server.core.schema.MetaMatchingRuleHandlerIT
Running org.apache.directory.server.core.authz.MoveRenameAuthorizationIT
Tests run: 5, Failures: 0, Errors: 0, Skipped: 0, Time elapsed: 9.552 sec - in org.apache.directory.server.core.authz.MoveRenameAuthorizationIT
Running org.apache.directory.server.core.authz.CompareAuthorizationIT
Tests run: 5, Failures: 0, Errors: 0, Skipped: 0, Time elapsed: 2.412 sec - in org.apache.directory.server.core.authz.CompareAuthorizationIT
Running org.apache.directory.server.core.authz.support.MaxImmSubFilterIT
Tests run: 5, Failures: 0, Errors: 0, Skipped: 1, Time elapsed: 1.095 sec - in org.apache.directory.server.core.authz.support.MaxImmSubFilterIT
Running org.apache.directory.server.core.authz.GeneralAuthorizationIT
Tests run: 1, Failures: 0, Errors: 0, Skipped: 0, Time elapsed: 1.128 sec - in org.apache.directory.server.core.authz.GeneralAuthorizationIT
Running org.apache.directory.server.core.authz.LookupAuthorizationIT
Tests run: 1, Failures: 0, Errors: 0, Skipped: 0, Time elapsed: 1.393 sec - in org.apache.directory.server.core.authz.LookupAuthorizationIT
Running org.apache.directory.server.core.authz.SearchAuthorizationIT
Tests run: 16, Failures: 0, Errors: 0, Skipped: 1, Time elapsed: 8.633 sec - in org.apache.directory.server.core.authz.SearchAuthorizationIT
Running org.apache.directory.server.core.authz.AdministratorsGroupIT
Tests run: 2, Failures: 0, Errors: 0, Skipped: 0, Time elapsed: 3.641 sec - in org.apache.directory.server.core.authz.AdministratorsGroupIT
Running org.apache.directory.server.core.authz.AddAuthorizationIT
Tests run: 4, Failures: 0, Errors: 0, Skipped: 0, Time elapsed: 2.5 sec - in org.apache.directory.server.core.authz.AddAuthorizationIT
Running org.apache.directory.server.core.authz.AuthorizationServiceAsNonAdminIT
Tests run: 4, Failures: 0, Errors: 0, Skipped: 0, Time elapsed: 1.26 sec - in org.apache.directory.server.core.authz.AuthorizationServiceAsNonAdminIT
Running org.apache.directory.server.core.authz.AuthzAuthnIT
Tests run: 3, Failures: 0, Errors: 0, Skipped: 0, Time elapsed: 1.282 sec - in org.apache.directory.server.core.authz.AuthzAuthnIT
Running org.apache.directory.server.core.authz.DeleteAuthorizationIT
Tests run: 4, Failures: 0, Errors: 0, Skipped: 0, Time elapsed: 2.9 sec - in org.apache.directory.server.core.authz.DeleteAuthorizationIT
Running org.apache.directory.server.core.authz.ModifyAuthorizationIT
Tests run: 7, Failures: 0, Errors: 0, Skipped: 0, Time elapsed: 7.649 sec - in org.apache.directory.server.core.authz.ModifyAuthorizationIT
Running org.apache.directory.server.core.authz.AuthorizationServiceAsAdminIT
Tests run: 4, Failures: 0, Errors: 0, Skipped: 0, Time elapsed: 1.16 sec - in org.apache.directory.server.core.authz.AuthorizationServiceAsAdminIT
Running org.apache.directory.server.core.authn.SimpleAuthenticationIT
Tests run: 12, Failures: 0, Errors: 0, Skipped: 0, Time elapsed: 1.977 sec - in org.apache.directory.server.core.authn.SimpleAuthenticationIT
Running org.apache.directory.server.core.collective.CollectiveAttributeServiceIT
Tests run: 6, Failures: 0, Errors: 0, Skipped: 1, Time elapsed: 1.792 sec - in org.apache.directory.server.core.collective.CollectiveAttributeServiceIT
Running org.apache.directory.server.core.event.EventServiceIT
Tests run: 2, Failures: 0, Errors: 0, Skipped: 0, Time elapsed: 7.251 sec - in org.apache.directory.server.core.event.EventServiceIT
Running org.apache.directory.server.core.operations.move.MoveIT
Tests run: 2, Failures: 0, Errors: 0, Skipped: 0, Time elapsed: 1.362 sec - in org.apache.directory.server.core.operations.move.MoveIT
Running org.apache.directory.server.core.operations.exists.ExistsIT
Tests run: 2, Failures: 0, Errors: 0, Skipped: 0, Time elapsed: 1.14 sec - in org.apache.directory.server.core.operations.exists.ExistsIT
Running org.apache.directory.server.core.operations.getRootDse.GetRootDseIT
Tests run: 11, Failures: 0, Errors: 0, Skipped: 0, Time elapsed: 1.124 sec - in org.apache.directory.server.core.operations.getRootDse.GetRootDseIT
Running org.apache.directory.server.core.operations.rename.RenameIT
Tests run: 1, Failures: 0, Errors: 0, Skipped: 0, Time elapsed: 1.296 sec - in org.apache.directory.server.core.operations.rename.RenameIT
Running org.apache.directory.server.core.operations.add.PasswordHashingInterceptorTest
Killed

Results :

Tests run: 520, Failures: 0, Errors: 0, Skipped: 103

[JENKINS] Recording test results
[JENKINS] Archiving disabled
[INFO] ------------------------------------------------------------------------
[INFO] Reactor Summary:
[INFO] 
[INFO] ApacheDS .......................................... SUCCESS [5.355s]
[INFO] ApacheDS I18n ..................................... SUCCESS [11.646s]
[INFO] ApacheDS Core Constants ........................... SUCCESS [5.727s]
[INFO] ApacheDS Core API ................................. SUCCESS [25.063s]
[INFO] ApacheDS Core Shared .............................. SUCCESS [5.735s]
[INFO] ApacheDS Interceptors ............................. SUCCESS [1.539s]
[INFO] ApacheDS AdministrativePoint Interceptor .......... SUCCESS [5.221s]
[INFO] ApacheDS Authentication Interceptor ............... SUCCESS [7.919s]
[INFO] ApacheDS Interceptor to increment numeric attributes  SUCCESS [4.833s]
[INFO] ApacheDS Authorization Interceptor ................ SUCCESS [9.552s]
[INFO] ApacheDS ChangeLog Interceptor .................... SUCCESS [7.992s]
[INFO] ApacheDS Collective Attribute Interceptor ......... SUCCESS [4.708s]
[INFO] ApacheDS Event Interceptor ........................ SUCCESS [4.905s]
[INFO] ApacheDS Exception Interceptor .................... SUCCESS [6.564s]
[INFO] ApacheDS Journal Interceptor ...................... SUCCESS [5.841s]
[INFO] ApacheDS Normalization Interceptor ................ SUCCESS [7.324s]
[INFO] ApacheDS Operational Attribute Interceptor ........ SUCCESS [4.563s]
[INFO] ApacheDS Referral Interceptor ..................... SUCCESS [4.469s]
[INFO] ApacheDS Schema Interceptor ....................... SUCCESS [7.571s]
[INFO] ApacheDS Subtree Interceptor ...................... SUCCESS [10.105s]
[INFO] ApacheDS Triggers Interceptor ..................... SUCCESS [5.761s]
[INFO] ApacheDS Core ..................................... SUCCESS [8.971s]
[INFO] ApacheDS Core AVL ................................. SUCCESS [11.883s]
[INFO] ApacheDS Generalized (X) DBM Partition ............ SUCCESS [15.627s]
[INFO] ApacheDS LDIF Partition ........................... SUCCESS [8.270s]
[INFO] ApacheDS JDBM Partition ........................... SUCCESS [19.599s]
[INFO] ApacheDS Mavibot Partition ........................ SUCCESS [12.003s]
[INFO] ApacheDS Core Annotations ......................... SUCCESS [20.334s]
[INFO] ApacheDS Core JNDI ................................ SUCCESS [6.498s]
[INFO] ApacheDS Protocol Kerberos Codec .................. SUCCESS [21.034s]
[INFO] ApacheDS Interceptors for Kerberos ................ SUCCESS [5.523s]
[INFO] ApacheDS Protocol Dhcp ............................ SUCCESS [4.734s]
[INFO] ApacheDS Protocol Shared .......................... SUCCESS [5.052s]
[INFO] ApacheDS Protocol Dns ............................. SUCCESS [6.881s]
[INFO] ApacheDS Protocol Kerberos ........................ SUCCESS [8.283s]
[INFO] ApacheDS Protocol Ldap ............................ SUCCESS [17.728s]
[INFO] ApacheDS Protocol Ntp ............................. SUCCESS [6.841s]
[INFO] Apacheds Server Annotations ....................... SUCCESS [19.776s]
[INFO] ApacheDS Server Config ............................ SUCCESS [12.129s]
[INFO] ApacheDS Server JNDI .............................. SUCCESS [5.335s]
[INFO] ApacheDS Test Framework ........................... SUCCESS [30.125s]
[INFO] ApacheDS All ...................................... SUCCESS [13.545s]
[INFO] ApacheDS Logger Interceptor ....................... SUCCESS [8.109s]
[INFO] ApacheDS Password Hashing Interceptor ............. SUCCESS [4.871s]
[INFO] ApacheDS Core Integration ......................... FAILURE [2:39.459s]
[INFO] ApacheDS Protocol Kerberos Test ................... SKIPPED
[INFO] ApacheDS Server Integration ....................... SKIPPED
[INFO] ApacheDS DirectoryService-WebApp bridge ........... SKIPPED
[INFO] ApacheDS Jetty HTTP Server Integration ............ SKIPPED
[INFO] ApacheDS Service Builder .......................... SKIPPED
[INFO] Apache Directory LDAP Client API test ............. SKIPPED
[INFO] kerberos-client ................................... SKIPPED
[INFO] ApacheDS Service .................................. SKIPPED
[INFO] ApacheDS Wrapper .................................. SKIPPED
[INFO] ApacheDS Installers Maven Plugin .................. SKIPPED
[INFO] ApacheDS Installers ............................... SKIPPED
[INFO] ApacheDS OSGi Integration Tests ................... SKIPPED
[INFO] ------------------------------------------------------------------------
[INFO] BUILD FAILURE
[INFO] ------------------------------------------------------------------------
[INFO] Total time: 10:06.712s
[INFO] Finished at: Sat Jan 31 04:10:58 UTC 2015
[INFO] Final Memory: 74M/354M
[INFO] ------------------------------------------------------------------------
[JENKINS] Archiving disabled
[JENKINS] Archiving disabled
[JENKINS] Archiving disabled
[JENKINS] Archiving disabled
[JENKINS] Archiving disabled
[JENKINS] Archiving disabled
[JENKINS] Archiving disabled
[JENKINS] Archiving disabled
[JENKINS] Archiving disabled
[JENKINS] Archiving disabled
[JENKINS] Archiving disabled
[JENKINS] Archiving disabled
[JENKINS] Archiving disabled
[JENKINS] Archiving disabled
[JENKINS] Archiving disabled
[JENKINS] Archiving disabled
[JENKINS] Archiving disabled
[JENKINS] Archiving disabled
[JENKINS] Archiving disabled
[JENKINS] Archiving disabled
[JENKINS] Archiving disabled
[JENKINS] Archiving disabled
[JENKINS] Archiving disabled
[JENKINS] Archiving disabled
[JENKINS] Archiving disabled
[JENKINS] Archiving disabled
[JENKINS] Archiving disabled
[JENKINS] Archiving disabled
[JENKINS] Archiving disabled
[JENKINS] Archiving disabled
[JENKINS] Archiving disabled
[JENKINS] Archiving disabled
[JENKINS] Archiving disabled
[JENKINS] Archiving disabled
[JENKINS] Archiving disabled
[JENKINS] Archiving disabled
[JENKINS] Archiving disabled
[JENKINS] Archiving disabled
[JENKINS] Archiving disabled
[JENKINS] Archiving disabled
[JENKINS] Archiving disabled
[JENKINS] Archiving disabled
[JENKINS] Archiving disabled
[JENKINS] Archiving disabled
[JENKINS] Archiving disabled
[JENKINS] Archiving disabled
[JENKINS] Archiving disabled
[JENKINS] Archiving disabled
[JENKINS] Archiving disabled
[JENKINS] Archiving disabled
[JENKINS] Archiving disabled
[JENKINS] Archiving disabled
[JENKINS] Archiving disabled
[JENKINS] Archiving disabled
[JENKINS] Archiving disabled
[JENKINS] Archiving disabled
[JENKINS] Archiving disabled
Waiting for Jenkins to finish collecting data[ERROR] Failed to execute goal org.apache.maven.plugins:maven-surefire-plugin:2.18.1:test
(default-test) on project apacheds-core-integ: Execution default-test of goal org.apache.maven.plugins:maven-surefire-plugin:2.18.1:test
failed: The forked VM terminated without properly saying goodbye. VM crash or System.exit
called?
[ERROR] Command was /bin/sh -c cd <https://builds.apache.org/job/dir-apacheds-ubuntu-deploy/ws/trunk/core-integ>
&& /home/jenkins/tools/java/jdk1.7.0_25-32/jre/bin/java -Xmx1024m -jar <https://builds.apache.org/job/dir-apacheds-ubuntu-deploy/ws/trunk/core-integ/target/surefire/surefirebooter8926822045398217823.jar>
<https://builds.apache.org/job/dir-apacheds-ubuntu-deploy/ws/trunk/core-integ/target/surefire/surefire7390596544610813130tmp>
<https://builds.apache.org/job/dir-apacheds-ubuntu-deploy/ws/trunk/core-integ/target/surefire/surefire_252778006204649065387tmp>
[ERROR] -> [Help 1]
[ERROR] 
[ERROR] To see the full stack trace of the errors, re-run Maven with the -e switch.
[ERROR] Re-run Maven using the -X switch to enable full debug logging.
[ERROR] 
[ERROR] For more information about the errors and possible solutions, please read the following
articles:
[ERROR] [Help 1] http://cwiki.apache.org/confluence/display/MAVEN/PluginExecutionException
[ERROR] 
[ERROR] After correcting the problems, you can resume the build with the command
[ERROR]   mvn <goals> -rf :apacheds-core-integ

channel stopped

Mime
View raw message