directory-notifications mailing list archives

Site index · List index
Message view « Date » · « Thread »
Top « Date » · « Thread »
From Apache Jenkins Server <jenk...@builds.apache.org>
Subject Build failed in Jenkins: dir-shared-ubuntu-deploy #1508
Date Fri, 07 Nov 2014 03:00:19 GMT
See <https://builds.apache.org/job/dir-shared-ubuntu-deploy/1508/changes>

Changes:

[elecharny] Get rid of mvn site errors, due to a non-UTF-8 chars being used in a test

[elecharny] Default the reverseOrder to false, as requested by the RFC 2981

[elecharny] Allowed a grammar end when we don't have a reverseOrder part (it default to false
in this case)

[elecharny] [maven-release-plugin] prepare for next development iteration

[elecharny] [maven-release-plugin] prepare release 1.0.0-M25

[elecharny] Removed the MINA SNAPSHOT dependency

[elecharny] Refer to Project 33

------------------------------------------
Started by timer
Building remotely on H10 (Ubuntu ubuntu) in workspace <https://builds.apache.org/job/dir-shared-ubuntu-deploy/ws/>
Updating https://svn.apache.org/repos/asf/directory/shared/trunk at revision '2014-11-07T03:00:05.087
+0000'
U         util/pom.xml
U         distribution/pom.xml
U         dsml/engine/pom.xml
U         dsml/pom.xml
U         dsml/parser/pom.xml
U         i18n/pom.xml
U         ldap/codec/core/src/main/java/org/apache/directory/api/ldap/codec/controls/sort/SortRequestGrammar.java
U         ldap/codec/core/pom.xml
U         ldap/codec/standalone/pom.xml
U         ldap/codec/pom.xml
U         ldap/client/all/pom.xml
U         ldap/client/api/pom.xml
U         ldap/client/pom.xml
U         ldap/model/src/main/java/org/apache/directory/api/ldap/model/message/controls/SortKey.java
U         ldap/model/pom.xml
U         ldap/schema/converter/pom.xml
U         ldap/schema/data/pom.xml
U         ldap/schema/pom.xml
U         ldap/extras/pom.xml
U         ldap/extras/aci/pom.xml
U         ldap/extras/codec/pom.xml
U         ldap/extras/util/pom.xml
U         ldap/extras/sp/pom.xml
U         ldap/extras/trigger/pom.xml
U         ldap/extras/codec-api/pom.xml
U         ldap/net/pom.xml
U         ldap/net/mina/pom.xml
U         ldap/pom.xml
U         asn1/ber/pom.xml
U         asn1/api/pom.xml
U         asn1/pom.xml
U         integ/src/test/java/org/apache/directory/api/ldap/model/name/SchemaAwareRdnTest.java
U         integ/pom.xml
U         all/pom.xml
U         pom.xml
At revision 1637290
Parsing POMs
Failed to transfer Could not find artifact org.apache.directory.project:project:pom:33 in
central (http://repo.maven.apache.org/maven2)
ERROR: Failed to parse POMs
java.io.IOException: remote file operation failed: <https://builds.apache.org/job/dir-shared-ubuntu-deploy/ws/trunk>
at hudson.remoting.Channel@6997bb3f:H10
	at hudson.FilePath.act(FilePath.java:916)
	at hudson.FilePath.act(FilePath.java:893)
	at hudson.maven.MavenModuleSetBuild$MavenModuleSetBuildExecution.parsePoms(MavenModuleSetBuild.java:953)
	at hudson.maven.MavenModuleSetBuild$MavenModuleSetBuildExecution.doRun(MavenModuleSetBuild.java:681)
	at hudson.model.AbstractBuild$AbstractBuildExecution.run(AbstractBuild.java:529)
	at hudson.model.Run.execute(Run.java:1706)
	at hudson.maven.MavenModuleSetBuild.run(MavenModuleSetBuild.java:529)
	at hudson.model.ResourceController.execute(ResourceController.java:88)
	at hudson.model.Executor.run(Executor.java:232)
Caused by: hudson.remoting.ProxyException: hudson.maven.MavenModuleSetBuild$MavenExecutionException:
org.apache.maven.project.ProjectBuildingException: Some problems were encountered while processing
the POMs:
[FATAL] Non-resolvable parent POM: Could not find artifact org.apache.directory.project:project:pom:33
in central (http://repo.maven.apache.org/maven2) and 'parent.relativePath' points at no local
POM @ line 21, column 11

	at hudson.maven.MavenModuleSetBuild$PomParser.invoke(MavenModuleSetBuild.java:1357)
	at hudson.maven.MavenModuleSetBuild$PomParser.invoke(MavenModuleSetBuild.java:1091)
	at hudson.FilePath$FileCallableWrapper.call(FilePath.java:2474)
	at hudson.remoting.UserRequest.perform(UserRequest.java:118)
	at hudson.remoting.UserRequest.perform(UserRequest.java:48)
	at hudson.remoting.Request$2.run(Request.java:328)
	at hudson.remoting.InterceptingExecutorService$1.call(InterceptingExecutorService.java:72)
	at java.util.concurrent.FutureTask.run(FutureTask.java:262)
	at java.util.concurrent.ThreadPoolExecutor.runWorker(ThreadPoolExecutor.java:1145)
	at java.util.concurrent.ThreadPoolExecutor$Worker.run(ThreadPoolExecutor.java:615)
	at java.lang.Thread.run(Thread.java:745)
Caused by: hudson.remoting.ProxyException: org.apache.maven.project.ProjectBuildingException:
Some problems were encountered while processing the POMs:
[FATAL] Non-resolvable parent POM: Could not find artifact org.apache.directory.project:project:pom:33
in central (http://repo.maven.apache.org/maven2) and 'parent.relativePath' points at no local
POM @ line 21, column 11

	at org.apache.maven.project.DefaultProjectBuilder.build(DefaultProjectBuilder.java:364)
	at hudson.maven.MavenEmbedder.buildProjects(MavenEmbedder.java:361)
	at hudson.maven.MavenEmbedder.readProjects(MavenEmbedder.java:331)
	at hudson.maven.MavenModuleSetBuild$PomParser.invoke(MavenModuleSetBuild.java:1294)
	... 10 more

Mime
View raw message