directory-notifications mailing list archives

Site index · List index
Message view « Date » · « Thread »
Top « Date » · « Thread »
From Apache Jenkins Server <jenk...@builds.apache.org>
Subject Build failed in Jenkins: dir-apacheds-ubuntu-deploy #1504
Date Sat, 08 Nov 2014 04:35:10 GMT
See <https://builds.apache.org/job/dir-apacheds-ubuntu-deploy/1504/changes>

Changes:

[lucastheisen] moved testRebindNoPool to LdapConnectionTest as implied by the name

[elecharny] Fixed the failing test when using Java 8 (DIRSERVER-2015)

[elecharny] Using a Validating LdapConnection pool configuration

[elecharny] Using a Validating LdapConnection pool configuration to make some test happy (a
connection was get from the pool, and rebound to the wrong users before being put back in
the pool)

------------------------------------------
[...truncated 8470 lines...]
Uploaded: https://repository.apache.org/content/repositories/snapshots/org/apache/directory/server/apacheds-http-integration/2.0.0-M18-SNAPSHOT/apacheds-http-integration-2.0.0-M18-20141108.043156-82-sources.jar
(12 KB at 12.3 KB/sec)
Uploading: https://repository.apache.org/content/repositories/snapshots/org/apache/directory/server/apacheds-http-integration/2.0.0-M18-SNAPSHOT/maven-metadata.xml
Uploaded: https://repository.apache.org/content/repositories/snapshots/org/apache/directory/server/apacheds-http-integration/2.0.0-M18-SNAPSHOT/maven-metadata.xml
(2 KB at 1.5 KB/sec)
[INFO] 
[INFO] --- maven-bundle-plugin:2.5.0:deploy (default-deploy) @ apacheds-http-integration ---
[INFO] Remote OBR update disabled (enable with -DremoteOBR)
[JENKINS] Archiving disabled
[INFO]                                                                         
[INFO] ------------------------------------------------------------------------
[INFO] Building ApacheDS Service Builder 2.0.0-M18-SNAPSHOT
[INFO] ------------------------------------------------------------------------
[INFO] 
[INFO] --- maven-clean-plugin:2.4.1:clean (default-clean) @ apacheds-service-builder ---
[INFO] 
[INFO] --- maven-remote-resources-plugin:1.2.1:process (default) @ apacheds-service-builder
---
[INFO] 
[INFO] --- maven-resources-plugin:2.6:resources (default-resources) @ apacheds-service-builder
---
[INFO] Using 'UTF-8' encoding to copy filtered resources.
[INFO] skip non existing resourceDirectory <https://builds.apache.org/job/dir-apacheds-ubuntu-deploy/ws/trunk/service-builder/src/main/resources>
[INFO] Copying 3 resources
[INFO] 
[INFO] --- maven-compiler-plugin:3.1:compile (default-compile) @ apacheds-service-builder
---
[INFO] Changes detected - recompiling the module!
[INFO] Compiling 1 source file to <https://builds.apache.org/job/dir-apacheds-ubuntu-deploy/ws/trunk/service-builder/target/classes>
[INFO] 
[INFO] --- maven-resources-plugin:2.6:testResources (default-testResources) @ apacheds-service-builder
---
[INFO] Using 'UTF-8' encoding to copy filtered resources.
[INFO] skip non existing resourceDirectory <https://builds.apache.org/job/dir-apacheds-ubuntu-deploy/ws/trunk/service-builder/src/test/resources>
[INFO] Copying 3 resources
[INFO] 
[INFO] --- maven-compiler-plugin:3.1:testCompile (default-testCompile) @ apacheds-service-builder
---
[INFO] No sources to compile
[INFO] 
[INFO] --- maven-surefire-plugin:2.17:test (default-test) @ apacheds-service-builder ---
[JENKINS] Recording test results
[INFO] 
[INFO] --- maven-bundle-plugin:2.5.0:bundle (default-bundle) @ apacheds-service-builder ---
[INFO] 
[INFO] --- maven-site-plugin:3.3:attach-descriptor (attach-descriptor) @ apacheds-service-builder
---
[INFO] 
[INFO] --- tools-maven-plugin:1.4:verify-legal-files (verify-legal-files) @ apacheds-service-builder
---
[INFO] Checking legal files in: apacheds-service-builder-2.0.0-M18-SNAPSHOT.jar
[INFO] 
[INFO] --- maven-install-plugin:2.5.1:install (default-install) @ apacheds-service-builder
---
[INFO] Installing <https://builds.apache.org/job/dir-apacheds-ubuntu-deploy/ws/trunk/service-builder/target/apacheds-service-builder-2.0.0-M18-SNAPSHOT.jar>
to /jenkins/maven-repositories/0/org/apache/directory/server/apacheds-service-builder/2.0.0-M18-SNAPSHOT/apacheds-service-builder-2.0.0-M18-SNAPSHOT.jar
[INFO] Installing <https://builds.apache.org/job/dir-apacheds-ubuntu-deploy/ws/trunk/service-builder/pom.xml>
to /jenkins/maven-repositories/0/org/apache/directory/server/apacheds-service-builder/2.0.0-M18-SNAPSHOT/apacheds-service-builder-2.0.0-M18-SNAPSHOT.pom
[INFO] 
[INFO] --- maven-bundle-plugin:2.5.0:install (default-install) @ apacheds-service-builder
---
[INFO] Installing org/apache/directory/server/apacheds-service-builder/2.0.0-M18-SNAPSHOT/apacheds-service-builder-2.0.0-M18-SNAPSHOT.jar
[INFO] Writing OBR metadata
[INFO] 
[INFO] --- maven-deploy-plugin:2.8.1:deploy (default-deploy) @ apacheds-service-builder ---
Downloading: https://repository.apache.org/content/repositories/snapshots/org/apache/directory/server/apacheds-service-builder/2.0.0-M18-SNAPSHOT/maven-metadata.xml
Downloaded: https://repository.apache.org/content/repositories/snapshots/org/apache/directory/server/apacheds-service-builder/2.0.0-M18-SNAPSHOT/maven-metadata.xml
(816 B at 0.2 KB/sec)
Uploading: https://repository.apache.org/content/repositories/snapshots/org/apache/directory/server/apacheds-service-builder/2.0.0-M18-SNAPSHOT/apacheds-service-builder-2.0.0-M18-20141108.043214-82.jar
Uploaded: https://repository.apache.org/content/repositories/snapshots/org/apache/directory/server/apacheds-service-builder/2.0.0-M18-SNAPSHOT/apacheds-service-builder-2.0.0-M18-20141108.043214-82.jar
(27 KB at 42.2 KB/sec)
Uploading: https://repository.apache.org/content/repositories/snapshots/org/apache/directory/server/apacheds-service-builder/2.0.0-M18-SNAPSHOT/apacheds-service-builder-2.0.0-M18-20141108.043214-82.pom
Uploaded: https://repository.apache.org/content/repositories/snapshots/org/apache/directory/server/apacheds-service-builder/2.0.0-M18-SNAPSHOT/apacheds-service-builder-2.0.0-M18-20141108.043214-82.pom
(6 KB at 6.5 KB/sec)
Downloading: https://repository.apache.org/content/repositories/snapshots/org/apache/directory/server/apacheds-service-builder/maven-metadata.xml
Downloaded: https://repository.apache.org/content/repositories/snapshots/org/apache/directory/server/apacheds-service-builder/maven-metadata.xml
(419 B at 1.1 KB/sec)
Uploading: https://repository.apache.org/content/repositories/snapshots/org/apache/directory/server/apacheds-service-builder/2.0.0-M18-SNAPSHOT/maven-metadata.xml
Uploaded: https://repository.apache.org/content/repositories/snapshots/org/apache/directory/server/apacheds-service-builder/2.0.0-M18-SNAPSHOT/maven-metadata.xml
(816 B at 1.4 KB/sec)
Uploading: https://repository.apache.org/content/repositories/snapshots/org/apache/directory/server/apacheds-service-builder/maven-metadata.xml
Uploaded: https://repository.apache.org/content/repositories/snapshots/org/apache/directory/server/apacheds-service-builder/maven-metadata.xml
(419 B at 0.5 KB/sec)
[INFO] 
[INFO] --- maven-bundle-plugin:2.5.0:deploy (default-deploy) @ apacheds-service-builder ---
[INFO] Remote OBR update disabled (enable with -DremoteOBR)
[JENKINS] Archiving disabled
[INFO]                                                                         
[INFO] ------------------------------------------------------------------------
[INFO] Building Apache Directory LDAP Client API test 2.0.0-M18-SNAPSHOT
[INFO] ------------------------------------------------------------------------
[INFO] 
[INFO] --- maven-clean-plugin:2.4.1:clean (default-clean) @ ldap-client-test ---
[INFO] 
[INFO] --- maven-remote-resources-plugin:1.2.1:process (default) @ ldap-client-test ---
[INFO] 
[INFO] --- maven-resources-plugin:2.6:resources (default-resources) @ ldap-client-test ---
[INFO] Using 'UTF-8' encoding to copy filtered resources.
[INFO] Copying 0 resource
[INFO] Copying 3 resources
[INFO] 
[INFO] --- maven-compiler-plugin:3.1:compile (default-compile) @ ldap-client-test ---
[INFO] Changes detected - recompiling the module!
[INFO] Compiling 1 source file to <https://builds.apache.org/job/dir-apacheds-ubuntu-deploy/ws/trunk/ldap-client-test/target/classes>
[INFO] 
[INFO] --- maven-resources-plugin:2.6:testResources (default-testResources) @ ldap-client-test
---
[INFO] Using 'UTF-8' encoding to copy filtered resources.
[INFO] Copying 2 resources
[INFO] Copying 3 resources
[INFO] 
[INFO] --- maven-compiler-plugin:3.1:testCompile (default-testCompile) @ ldap-client-test
---
[INFO] Changes detected - recompiling the module!
[INFO] Compiling 23 source files to <https://builds.apache.org/job/dir-apacheds-ubuntu-deploy/ws/trunk/ldap-client-test/target/test-classes>
[INFO] -------------------------------------------------------------
[ERROR] COMPILATION ERROR : 
[INFO] -------------------------------------------------------------
[ERROR] <https://builds.apache.org/job/dir-apacheds-ubuntu-deploy/ws/trunk/ldap-client-test/src/test/java/org/apache/directory/shared/client/api/LdapConnectionTest.java>:[113,6]
cannot find symbol
  symbol:   class Ignore
  location: class org.apache.directory.shared.client.api.LdapConnectionTest
[ERROR] <https://builds.apache.org/job/dir-apacheds-ubuntu-deploy/ws/trunk/ldap-client-test/src/test/java/org/apache/directory/shared/client/api/LdapConnectionTest.java>:[116,64]
cannot find symbol
  symbol:   variable DEFAULT_HOST
  location: class org.apache.directory.shared.client.api.LdapConnectionTest
[INFO] 2 errors 
[INFO] -------------------------------------------------------------
[JENKINS] Archiving disabled
[INFO] ------------------------------------------------------------------------
[INFO] Reactor Summary:
[INFO] 
[INFO] ApacheDS .......................................... SUCCESS [25.952s]
[INFO] ApacheDS I18n ..................................... SUCCESS [14.741s]
[INFO] ApacheDS Core Constants ........................... SUCCESS [8.043s]
[INFO] ApacheDS Core API ................................. SUCCESS [2:14.478s]
[INFO] ApacheDS Core Shared .............................. SUCCESS [18.092s]
[INFO] ApacheDS Interceptors ............................. SUCCESS [6.194s]
[INFO] ApacheDS AdministrativePoint Interceptor .......... SUCCESS [17.639s]
[INFO] ApacheDS Authentication Interceptor ............... SUCCESS [17.875s]
[INFO] ApacheDS Interceptor to increment numeric attributes  SUCCESS [11.751s]
[INFO] ApacheDS Authorization Interceptor ................ SUCCESS [21.289s]
[INFO] ApacheDS ChangeLog Interceptor .................... SUCCESS [17.428s]
[INFO] ApacheDS Collective Attribute Interceptor ......... SUCCESS [11.800s]
[INFO] ApacheDS Event Interceptor ........................ SUCCESS [12.535s]
[INFO] ApacheDS Exception Interceptor .................... SUCCESS [14.835s]
[INFO] ApacheDS Journal Interceptor ...................... SUCCESS [11.744s]
[INFO] ApacheDS Normalization Interceptor ................ SUCCESS [15.068s]
[INFO] ApacheDS Operational Attribute Interceptor ........ SUCCESS [14.752s]
[INFO] ApacheDS Referral Interceptor ..................... SUCCESS [17.114s]
[INFO] ApacheDS Schema Interceptor ....................... SUCCESS [17.574s]
[INFO] ApacheDS Subtree Interceptor ...................... SUCCESS [17.822s]
[INFO] ApacheDS Triggers Interceptor ..................... SUCCESS [12.596s]
[INFO] ApacheDS Core ..................................... SUCCESS [14.570s]
[INFO] ApacheDS Core AVL ................................. SUCCESS [25.118s]
[INFO] ApacheDS Generalized (X) DBM Partition ............ SUCCESS [30.145s]
[INFO] ApacheDS LDIF Partition ........................... SUCCESS [20.882s]
[INFO] ApacheDS JDBM Partition ........................... SUCCESS [36.308s]
[INFO] ApacheDS Mavibot Partition ........................ SUCCESS [20.904s]
[INFO] ApacheDS Core Annotations ......................... SUCCESS [29.873s]
[INFO] ApacheDS Core JNDI ................................ SUCCESS [17.436s]
[INFO] ApacheDS Protocol Kerberos Codec .................. SUCCESS [59.530s]
[INFO] ApacheDS Interceptors for Kerberos ................ SUCCESS [17.549s]
[INFO] ApacheDS Protocol Dhcp ............................ SUCCESS [17.691s]
[INFO] ApacheDS Protocol Shared .......................... SUCCESS [12.443s]
[INFO] ApacheDS Protocol Dns ............................. SUCCESS [26.987s]
[INFO] ApacheDS Protocol Kerberos ........................ SUCCESS [24.005s]
[INFO] ApacheDS Protocol Ldap ............................ SUCCESS [32.199s]
[INFO] ApacheDS Protocol Ntp ............................. SUCCESS [18.194s]
[INFO] Apacheds Server Annotations ....................... SUCCESS [25.892s]
[INFO] ApacheDS Server Config ............................ SUCCESS [21.575s]
[INFO] ApacheDS Server JNDI .............................. SUCCESS [14.865s]
[INFO] ApacheDS Test Framework ........................... SUCCESS [37.224s]
[INFO] ApacheDS All ...................................... SUCCESS [15.744s]
[INFO] ApacheDS Logger Interceptor ....................... SUCCESS [15.364s]
[INFO] ApacheDS Password Hashing Interceptor ............. SUCCESS [17.120s]
[INFO] ApacheDS Core Integration ......................... SUCCESS [4:00.027s]
[INFO] ApacheDS Protocol Kerberos Test ................... SUCCESS [35.591s]
[INFO] ApacheDS Server Integration ....................... SUCCESS [4:51.019s]
[INFO] ApacheDS DirectoryService-WebApp bridge ........... SUCCESS [12.213s]
[INFO] ApacheDS Jetty HTTP Server Integration ............ SUCCESS [17.241s]
[INFO] ApacheDS Service Builder .......................... SUCCESS [15.018s]
[INFO] Apache Directory LDAP Client API test ............. FAILURE [5.813s]
[INFO] kerberos-client ................................... SKIPPED
[INFO] ApacheDS Service .................................. SKIPPED
[INFO] ApacheDS Wrapper .................................. SKIPPED
[INFO] ApacheDS Installers Maven Plugin .................. SKIPPED
[INFO] ApacheDS Installers ............................... SKIPPED
[INFO] ApacheDS Mavibot bulkloader ....................... SKIPPED
[INFO] ------------------------------------------------------------------------
[INFO] BUILD FAILURE
[INFO] ------------------------------------------------------------------------
[INFO] Total time: 30:04.350s
[INFO] Finished at: Sat Nov 08 04:32:31 UTC 2014
[INFO] Final Memory: 68M/233M
[INFO] ------------------------------------------------------------------------
[JENKINS] Archiving disabled
[JENKINS] Archiving disabled
[JENKINS] Archiving disabled
[JENKINS] Archiving disabled
[JENKINS] Archiving disabled
[JENKINS] Archiving disabled
[JENKINS] Archiving disabled
[JENKINS] Archiving disabled
[JENKINS] Archiving disabled
[JENKINS] Archiving disabled
[JENKINS] Archiving disabled
[JENKINS] Archiving disabled
[JENKINS] Archiving disabled
[JENKINS] Archiving disabled
[JENKINS] Archiving disabled
[JENKINS] Archiving disabled
[JENKINS] Archiving disabled
[JENKINS] Archiving disabled
[JENKINS] Archiving disabled
[JENKINS] Archiving disabled
[JENKINS] Archiving disabled
[JENKINS] Archiving disabled
[JENKINS] Archiving disabled
[JENKINS] Archiving disabled
[JENKINS] Archiving disabled
[JENKINS] Archiving disabled
[JENKINS] Archiving disabled
[JENKINS] Archiving disabled
[JENKINS] Archiving disabled
[JENKINS] Archiving disabled
[JENKINS] Archiving disabled
[JENKINS] Archiving disabled
[JENKINS] Archiving disabled
[JENKINS] Archiving disabled
[JENKINS] Archiving disabled
[JENKINS] Archiving disabled
[JENKINS] Archiving disabled
[JENKINS] Archiving disabled
[JENKINS] Archiving disabled
[JENKINS] Archiving disabled
[JENKINS] Archiving disabled
[JENKINS] Archiving disabled
[JENKINS] Archiving disabled
[JENKINS] Archiving disabled
[JENKINS] Archiving disabled
[JENKINS] Archiving disabled
[JENKINS] Archiving disabled
[JENKINS] Archiving disabled
[JENKINS] Archiving disabled
[JENKINS] Archiving disabled
[JENKINS] Archiving disabled
[JENKINS] Archiving disabled
[JENKINS] Archiving disabled
[JENKINS] Archiving disabled
[JENKINS] Archiving disabled
[JENKINS] Archiving disabled
[JENKINS] Archiving disabled
Waiting for Jenkins to finish collecting data
[ERROR] Failed to execute goal org.apache.maven.plugins:maven-compiler-plugin:3.1:testCompile
(default-testCompile) on project ldap-client-test: Compilation failure: Compilation failure:
[ERROR] <https://builds.apache.org/job/dir-apacheds-ubuntu-deploy/ws/trunk/ldap-client-test/src/test/java/org/apache/directory/shared/client/api/LdapConnectionTest.java>:[113,6]
cannot find symbol
[ERROR] symbol:   class Ignore
[ERROR] location: class org.apache.directory.shared.client.api.LdapConnectionTest
[ERROR] <https://builds.apache.org/job/dir-apacheds-ubuntu-deploy/ws/trunk/ldap-client-test/src/test/java/org/apache/directory/shared/client/api/LdapConnectionTest.java>:[116,64]
cannot find symbol
[ERROR] symbol:   variable DEFAULT_HOST
[ERROR] location: class org.apache.directory.shared.client.api.LdapConnectionTest
[ERROR] -> [Help 1]
[ERROR] 
[ERROR] To see the full stack trace of the errors, re-run Maven with the -e switch.
[ERROR] Re-run Maven using the -X switch to enable full debug logging.
[ERROR] 
[ERROR] For more information about the errors and possible solutions, please read the following
articles:
[ERROR] [Help 1] http://cwiki.apache.org/confluence/display/MAVEN/MojoFailureException
[ERROR] 
[ERROR] After correcting the problems, you can resume the build with the command
[ERROR]   mvn <goals> -rf :ldap-client-test
channel stopped

Mime
View raw message