directory-notifications mailing list archives

Site index · List index
Message view « Date » · « Thread »
Top « Date » · « Thread »
From Apache Jenkins Server <jenk...@builds.apache.org>
Subject Build failed in Jenkins: dir-apacheds-ubuntu-deploy #1506
Date Mon, 10 Nov 2014 04:21:02 GMT
See <https://builds.apache.org/job/dir-apacheds-ubuntu-deploy/1506/>

------------------------------------------
[...truncated 8208 lines...]
Uploaded: https://repository.apache.org/content/repositories/snapshots/org/apache/directory/server/apacheds-http-integration/2.0.0-M18-SNAPSHOT/apacheds-http-integration-2.0.0-M18-20141110.041952-84-sources.jar
(12 KB at 30.1 KB/sec)
Uploading: https://repository.apache.org/content/repositories/snapshots/org/apache/directory/server/apacheds-http-integration/2.0.0-M18-SNAPSHOT/maven-metadata.xml
Uploaded: https://repository.apache.org/content/repositories/snapshots/org/apache/directory/server/apacheds-http-integration/2.0.0-M18-SNAPSHOT/maven-metadata.xml
(2 KB at 3.1 KB/sec)
[INFO] 
[INFO] --- maven-bundle-plugin:2.5.0:deploy (default-deploy) @ apacheds-http-integration ---
[INFO] Remote OBR update disabled (enable with -DremoteOBR)
[JENKINS] Archiving disabled
[INFO]                                                                         
[INFO] ------------------------------------------------------------------------
[INFO] Building ApacheDS Service Builder 2.0.0-M18-SNAPSHOT
[INFO] ------------------------------------------------------------------------
[INFO] 
[INFO] --- maven-clean-plugin:2.4.1:clean (default-clean) @ apacheds-service-builder ---
[INFO] 
[INFO] --- maven-remote-resources-plugin:1.2.1:process (default) @ apacheds-service-builder
---
[INFO] 
[INFO] --- maven-resources-plugin:2.6:resources (default-resources) @ apacheds-service-builder
---
[INFO] Using 'UTF-8' encoding to copy filtered resources.
[INFO] skip non existing resourceDirectory <https://builds.apache.org/job/dir-apacheds-ubuntu-deploy/ws/trunk/service-builder/src/main/resources>
[INFO] Copying 3 resources
[INFO] 
[INFO] --- maven-compiler-plugin:3.1:compile (default-compile) @ apacheds-service-builder
---
[INFO] Changes detected - recompiling the module!
[INFO] Compiling 1 source file to <https://builds.apache.org/job/dir-apacheds-ubuntu-deploy/ws/trunk/service-builder/target/classes>
[INFO] 
[INFO] --- maven-resources-plugin:2.6:testResources (default-testResources) @ apacheds-service-builder
---
[INFO] Using 'UTF-8' encoding to copy filtered resources.
[INFO] skip non existing resourceDirectory <https://builds.apache.org/job/dir-apacheds-ubuntu-deploy/ws/trunk/service-builder/src/test/resources>
[INFO] Copying 3 resources
[INFO] 
[INFO] --- maven-compiler-plugin:3.1:testCompile (default-testCompile) @ apacheds-service-builder
---
[INFO] No sources to compile
[INFO] 
[INFO] --- maven-surefire-plugin:2.17:test (default-test) @ apacheds-service-builder ---
[JENKINS] Recording test results[INFO] 
[INFO] --- maven-bundle-plugin:2.5.0:bundle (default-bundle) @ apacheds-service-builder ---

[INFO] 
[INFO] --- maven-site-plugin:3.3:attach-descriptor (attach-descriptor) @ apacheds-service-builder
---
[INFO] 
[INFO] --- tools-maven-plugin:1.4:verify-legal-files (verify-legal-files) @ apacheds-service-builder
---
[INFO] Checking legal files in: apacheds-service-builder-2.0.0-M18-SNAPSHOT.jar
[INFO] 
[INFO] --- maven-install-plugin:2.5.1:install (default-install) @ apacheds-service-builder
---
[INFO] Installing <https://builds.apache.org/job/dir-apacheds-ubuntu-deploy/ws/trunk/service-builder/target/apacheds-service-builder-2.0.0-M18-SNAPSHOT.jar>
to /home/jenkins/jenkins-slave/maven-repositories/1/org/apache/directory/server/apacheds-service-builder/2.0.0-M18-SNAPSHOT/apacheds-service-builder-2.0.0-M18-SNAPSHOT.jar
[INFO] Installing <https://builds.apache.org/job/dir-apacheds-ubuntu-deploy/ws/trunk/service-builder/pom.xml>
to /home/jenkins/jenkins-slave/maven-repositories/1/org/apache/directory/server/apacheds-service-builder/2.0.0-M18-SNAPSHOT/apacheds-service-builder-2.0.0-M18-SNAPSHOT.pom
[INFO] 
[INFO] --- maven-bundle-plugin:2.5.0:install (default-install) @ apacheds-service-builder
---
[INFO] Installing org/apache/directory/server/apacheds-service-builder/2.0.0-M18-SNAPSHOT/apacheds-service-builder-2.0.0-M18-SNAPSHOT.jar
[INFO] Writing OBR metadata
[INFO] 
[INFO] --- maven-deploy-plugin:2.8.1:deploy (default-deploy) @ apacheds-service-builder ---
Downloading: https://repository.apache.org/content/repositories/snapshots/org/apache/directory/server/apacheds-service-builder/2.0.0-M18-SNAPSHOT/maven-metadata.xml
Downloaded: https://repository.apache.org/content/repositories/snapshots/org/apache/directory/server/apacheds-service-builder/2.0.0-M18-SNAPSHOT/maven-metadata.xml
(816 B at 2.3 KB/sec)
Uploading: https://repository.apache.org/content/repositories/snapshots/org/apache/directory/server/apacheds-service-builder/2.0.0-M18-SNAPSHOT/apacheds-service-builder-2.0.0-M18-20141110.042004-84.jar
Uploaded: https://repository.apache.org/content/repositories/snapshots/org/apache/directory/server/apacheds-service-builder/2.0.0-M18-SNAPSHOT/apacheds-service-builder-2.0.0-M18-20141110.042004-84.jar
(27 KB at 83.9 KB/sec)
Uploading: https://repository.apache.org/content/repositories/snapshots/org/apache/directory/server/apacheds-service-builder/2.0.0-M18-SNAPSHOT/apacheds-service-builder-2.0.0-M18-20141110.042004-84.pom
Uploaded: https://repository.apache.org/content/repositories/snapshots/org/apache/directory/server/apacheds-service-builder/2.0.0-M18-SNAPSHOT/apacheds-service-builder-2.0.0-M18-20141110.042004-84.pom
(6 KB at 14.8 KB/sec)
Downloading: https://repository.apache.org/content/repositories/snapshots/org/apache/directory/server/apacheds-service-builder/maven-metadata.xml
Downloaded: https://repository.apache.org/content/repositories/snapshots/org/apache/directory/server/apacheds-service-builder/maven-metadata.xml
(419 B at 2.7 KB/sec)
Uploading: https://repository.apache.org/content/repositories/snapshots/org/apache/directory/server/apacheds-service-builder/2.0.0-M18-SNAPSHOT/maven-metadata.xml
Uploaded: https://repository.apache.org/content/repositories/snapshots/org/apache/directory/server/apacheds-service-builder/2.0.0-M18-SNAPSHOT/maven-metadata.xml
(816 B at 2.8 KB/sec)
Uploading: https://repository.apache.org/content/repositories/snapshots/org/apache/directory/server/apacheds-service-builder/maven-metadata.xml
Uploaded: https://repository.apache.org/content/repositories/snapshots/org/apache/directory/server/apacheds-service-builder/maven-metadata.xml
(419 B at 1.2 KB/sec)
[INFO] 
[INFO] --- maven-bundle-plugin:2.5.0:deploy (default-deploy) @ apacheds-service-builder ---
[INFO] Remote OBR update disabled (enable with -DremoteOBR)
[JENKINS] Archiving disabled
[INFO]                                                                         
[INFO] ------------------------------------------------------------------------
[INFO] Building Apache Directory LDAP Client API test 2.0.0-M18-SNAPSHOT
[INFO] ------------------------------------------------------------------------
[INFO] 
[INFO] --- maven-clean-plugin:2.4.1:clean (default-clean) @ ldap-client-test ---
[INFO] 
[INFO] --- maven-remote-resources-plugin:1.2.1:process (default) @ ldap-client-test ---
[INFO] 
[INFO] --- maven-resources-plugin:2.6:resources (default-resources) @ ldap-client-test ---
[INFO] Using 'UTF-8' encoding to copy filtered resources.
[INFO] Copying 0 resource
[INFO] Copying 3 resources
[INFO] 
[INFO] --- maven-compiler-plugin:3.1:compile (default-compile) @ ldap-client-test ---
[INFO] Changes detected - recompiling the module!
[INFO] Compiling 1 source file to <https://builds.apache.org/job/dir-apacheds-ubuntu-deploy/ws/trunk/ldap-client-test/target/classes>
[INFO] 
[INFO] --- maven-resources-plugin:2.6:testResources (default-testResources) @ ldap-client-test
---
[INFO] Using 'UTF-8' encoding to copy filtered resources.
[INFO] Copying 2 resources
[INFO] Copying 3 resources
[INFO] 
[INFO] --- maven-compiler-plugin:3.1:testCompile (default-testCompile) @ ldap-client-test
---
[INFO] Changes detected - recompiling the module!
[INFO] Compiling 23 source files to <https://builds.apache.org/job/dir-apacheds-ubuntu-deploy/ws/trunk/ldap-client-test/target/test-classes>
[INFO] -------------------------------------------------------------
[ERROR] COMPILATION ERROR : 
[INFO] -------------------------------------------------------------
[ERROR] <https://builds.apache.org/job/dir-apacheds-ubuntu-deploy/ws/trunk/ldap-client-test/src/test/java/org/apache/directory/shared/client/api/LdapConnectionTest.java>:[113,6]
cannot find symbol
  symbol:   class Ignore
  location: class org.apache.directory.shared.client.api.LdapConnectionTest
[ERROR] <https://builds.apache.org/job/dir-apacheds-ubuntu-deploy/ws/trunk/ldap-client-test/src/test/java/org/apache/directory/shared/client/api/LdapConnectionTest.java>:[116,64]
cannot find symbol
  symbol:   variable DEFAULT_HOST
  location: class org.apache.directory.shared.client.api.LdapConnectionTest
[INFO] 2 errors 
[INFO] -------------------------------------------------------------
[JENKINS] Archiving disabled
[INFO] ------------------------------------------------------------------------
[INFO] Reactor Summary:
[INFO] 
[INFO] ApacheDS .......................................... SUCCESS [8.674s]
[INFO] ApacheDS I18n ..................................... SUCCESS [12.228s]
[INFO] ApacheDS Core Constants ........................... SUCCESS [8.584s]
[INFO] ApacheDS Core API ................................. SUCCESS [51.234s]
[INFO] ApacheDS Core Shared .............................. SUCCESS [12.073s]
[INFO] ApacheDS Interceptors ............................. SUCCESS [5.066s]
[INFO] ApacheDS AdministrativePoint Interceptor .......... SUCCESS [8.775s]
[INFO] ApacheDS Authentication Interceptor ............... SUCCESS [10.965s]
[INFO] ApacheDS Interceptor to increment numeric attributes  SUCCESS [9.120s]
[INFO] ApacheDS Authorization Interceptor ................ SUCCESS [15.068s]
[INFO] ApacheDS ChangeLog Interceptor .................... SUCCESS [11.388s]
[INFO] ApacheDS Collective Attribute Interceptor ......... SUCCESS [11.396s]
[INFO] ApacheDS Event Interceptor ........................ SUCCESS [8.152s]
[INFO] ApacheDS Exception Interceptor .................... SUCCESS [8.566s]
[INFO] ApacheDS Journal Interceptor ...................... SUCCESS [8.617s]
[INFO] ApacheDS Normalization Interceptor ................ SUCCESS [11.023s]
[INFO] ApacheDS Operational Attribute Interceptor ........ SUCCESS [8.309s]
[INFO] ApacheDS Referral Interceptor ..................... SUCCESS [8.301s]
[INFO] ApacheDS Schema Interceptor ....................... SUCCESS [11.855s]
[INFO] ApacheDS Subtree Interceptor ...................... SUCCESS [11.635s]
[INFO] ApacheDS Triggers Interceptor ..................... SUCCESS [7.891s]
[INFO] ApacheDS Core ..................................... SUCCESS [12.005s]
[INFO] ApacheDS Core AVL ................................. SUCCESS [17.201s]
[INFO] ApacheDS Generalized (X) DBM Partition ............ SUCCESS [20.075s]
[INFO] ApacheDS LDIF Partition ........................... SUCCESS [14.214s]
[INFO] ApacheDS JDBM Partition ........................... SUCCESS [20.932s]
[INFO] ApacheDS Mavibot Partition ........................ SUCCESS [13.763s]
[INFO] ApacheDS Core Annotations ......................... SUCCESS [20.510s]
[INFO] ApacheDS Core JNDI ................................ SUCCESS [11.645s]
[INFO] ApacheDS Protocol Kerberos Codec .................. SUCCESS [20.421s]
[INFO] ApacheDS Interceptors for Kerberos ................ SUCCESS [8.426s]
[INFO] ApacheDS Protocol Dhcp ............................ SUCCESS [14.594s]
[INFO] ApacheDS Protocol Shared .......................... SUCCESS [9.205s]
[INFO] ApacheDS Protocol Dns ............................. SUCCESS [12.585s]
[INFO] ApacheDS Protocol Kerberos ........................ SUCCESS [14.354s]
[INFO] ApacheDS Protocol Ldap ............................ SUCCESS [23.243s]
[INFO] ApacheDS Protocol Ntp ............................. SUCCESS [11.346s]
[INFO] Apacheds Server Annotations ....................... SUCCESS [20.311s]
[INFO] ApacheDS Server Config ............................ SUCCESS [14.721s]
[INFO] ApacheDS Server JNDI .............................. SUCCESS [10.675s]
[INFO] ApacheDS Test Framework ........................... SUCCESS [32.619s]
[INFO] ApacheDS All ...................................... SUCCESS [9.373s]
[INFO] ApacheDS Logger Interceptor ....................... SUCCESS [9.408s]
[INFO] ApacheDS Password Hashing Interceptor ............. SUCCESS [8.039s]
[INFO] ApacheDS Core Integration ......................... SUCCESS [3:26.244s]
[INFO] ApacheDS Protocol Kerberos Test ................... SUCCESS [18.695s]
[INFO] ApacheDS Server Integration ....................... SUCCESS [4:14.786s]
[INFO] ApacheDS DirectoryService-WebApp bridge ........... SUCCESS [8.534s]
[INFO] ApacheDS Jetty HTTP Server Integration ............ SUCCESS [11.666s]
[INFO] ApacheDS Service Builder .......................... SUCCESS [10.893s]
[INFO] Apache Directory LDAP Client API test ............. FAILURE [2.996s]
[INFO] kerberos-client ................................... SKIPPED
[INFO] ApacheDS Service .................................. SKIPPED
[INFO] ApacheDS Wrapper .................................. SKIPPED
[INFO] ApacheDS Installers Maven Plugin .................. SKIPPED
[INFO] ApacheDS Installers ............................... SKIPPED
[INFO] ApacheDS Mavibot bulkloader ....................... SKIPPED
[INFO] ------------------------------------------------------------------------
[INFO] BUILD FAILURE
[INFO] ------------------------------------------------------------------------
[INFO] Total time: 19:17.244s
[INFO] Finished at: Mon Nov 10 04:20:10 UTC 2014
[INFO] Final Memory: 68M/309M
[INFO] ------------------------------------------------------------------------
[JENKINS] Archiving disabled
[JENKINS] Archiving disabled
[JENKINS] Archiving disabled
[JENKINS] Archiving disabled
[JENKINS] Archiving disabled
[JENKINS] Archiving disabled
[JENKINS] Archiving disabled
[JENKINS] Archiving disabled
[JENKINS] Archiving disabled
[JENKINS] Archiving disabled
[JENKINS] Archiving disabled
[JENKINS] Archiving disabled
[JENKINS] Archiving disabled
[JENKINS] Archiving disabled
[JENKINS] Archiving disabled
[JENKINS] Archiving disabled
[JENKINS] Archiving disabled
[JENKINS] Archiving disabled
[JENKINS] Archiving disabled
[JENKINS] Archiving disabled
[JENKINS] Archiving disabled
[JENKINS] Archiving disabled
[JENKINS] Archiving disabled
[JENKINS] Archiving disabled
[JENKINS] Archiving disabled
[JENKINS] Archiving disabled
[JENKINS] Archiving disabled
[JENKINS] Archiving disabled
[JENKINS] Archiving disabled
[JENKINS] Archiving disabled
[JENKINS] Archiving disabled
[JENKINS] Archiving disabled
[JENKINS] Archiving disabled
[JENKINS] Archiving disabled
[JENKINS] Archiving disabled
[JENKINS] Archiving disabled
[JENKINS] Archiving disabled
[JENKINS] Archiving disabled
[JENKINS] Archiving disabled
[JENKINS] Archiving disabled
[JENKINS] Archiving disabled
[JENKINS] Archiving disabled
[JENKINS] Archiving disabled
[JENKINS] Archiving disabled
[JENKINS] Archiving disabled
[JENKINS] Archiving disabled
[JENKINS] Archiving disabled
[JENKINS] Archiving disabled
[JENKINS] Archiving disabled
[JENKINS] Archiving disabled
[JENKINS] Archiving disabled
[JENKINS] Archiving disabled
[JENKINS] Archiving disabled
[JENKINS] Archiving disabled
[JENKINS] Archiving disabled
[JENKINS] Archiving disabled
[JENKINS] Archiving disabled
Waiting for Jenkins to finish collecting data[ERROR] Failed to execute goal org.apache.maven.plugins:maven-compiler-plugin:3.1:testCompile
(default-testCompile) on project ldap-client-test: Compilation failure: Compilation failure:
[ERROR] <https://builds.apache.org/job/dir-apacheds-ubuntu-deploy/ws/trunk/ldap-client-test/src/test/java/org/apache/directory/shared/client/api/LdapConnectionTest.java>:[113,6]
cannot find symbol
[ERROR] symbol:   class Ignore
[ERROR] location: class org.apache.directory.shared.client.api.LdapConnectionTest
[ERROR] <https://builds.apache.org/job/dir-apacheds-ubuntu-deploy/ws/trunk/ldap-client-test/src/test/java/org/apache/directory/shared/client/api/LdapConnectionTest.java>:[116,64]
cannot find symbol
[ERROR] symbol:   variable DEFAULT_HOST
[ERROR] location: class org.apache.directory.shared.client.api.LdapConnectionTest
[ERROR] -> [Help 1]
[ERROR] 
[ERROR] To see the full stack trace of the errors, re-run Maven with the -e switch.
[ERROR] Re-run Maven using the -X switch to enable full debug logging.
[ERROR] 
[ERROR] For more information about the errors and possible solutions, please read the following
articles:
[ERROR] [Help 1] http://cwiki.apache.org/confluence/display/MAVEN/MojoFailureException
[ERROR] 
[ERROR] After correcting the problems, you can resume the build with the command
[ERROR]   mvn <goals> -rf :ldap-client-test

channel stopped

Mime
View raw message