directory-notifications mailing list archives

Site index · List index
Message view « Date » · « Thread »
Top « Date » · « Thread »
From Apache Jenkins Server <jenk...@builds.apache.org>
Subject Build failed in Jenkins: dir-apacheds-ubuntu-deploy #1510
Date Fri, 14 Nov 2014 04:05:28 GMT
See <https://builds.apache.org/job/dir-apacheds-ubuntu-deploy/1510/changes>

Changes:

[elecharny] [maven-release-plugin] prepare for next development iteration

[elecharny] [maven-release-plugin] prepare release 2.0.0-M18

[elecharny] [maven-release-plugin] rollback the release of 2.0.0-M18

[elecharny] [maven-release-plugin] prepare release 2.0.0-M18

[elecharny] [maven-release-plugin] rollback the release of 2.0.0-M18

[elecharny] [maven-release-plugin] prepare for next development iteration

[elecharny] [maven-release-plugin] prepare release 2.0.0-M18

[elecharny] [maven-release-plugin] rollback the release of 2.0.0-M18

[elecharny] Fixed a race condition in the Bind handling

[elecharny] o Declare the host name otherwise we can't connect with Java8, as it tries to
solve localhost to a local address which is not 127.0.0.1
o Test the JDK version, des-cbc-crc and dec-cbc-md5 are disabled by default in JDK 8.

[elecharny] Fixed a bug in the construction of cursorList

------------------------------------------
[...truncated 371 lines...]
Downloading: http://repo.maven.apache.org/maven2/org/apache/directory/api/api-util/1.0.0-M25/api-util-1.0.0-M25.jar
Downloaded: http://repo.maven.apache.org/maven2/org/apache/directory/api/api-ldap-extras-aci/1.0.0-M25/api-ldap-extras-aci-1.0.0-M25.jar
(100 KB at 967.0 KB/sec)
Downloaded: http://repo.maven.apache.org/maven2/org/apache/directory/api/api-util/1.0.0-M25/api-util-1.0.0-M25.jar
(81 KB at 738.4 KB/sec)
Downloaded: http://repo.maven.apache.org/maven2/org/apache/directory/api/api-ldap-codec-core/1.0.0-M25/api-ldap-codec-core-1.0.0-M25.jar
(342 KB at 1330.4 KB/sec)
Downloaded: http://repo.maven.apache.org/maven2/org/apache/directory/api/api-ldap-schema-data/1.0.0-M25/api-ldap-schema-data-1.0.0-M25.jar
(661 KB at 2871.3 KB/sec)
Downloaded: http://repo.maven.apache.org/maven2/org/apache/directory/api/api-ldap-model/1.0.0-M25/api-ldap-model-1.0.0-M25.jar
(889 KB at 2568.7 KB/sec)
[INFO] 
[INFO] --- maven-clean-plugin:2.4.1:clean (default-clean) @ apacheds-core-api ---
[INFO] Deleting <https://builds.apache.org/job/dir-apacheds-ubuntu-deploy/ws/trunk/core-api/target>
[INFO] 
[INFO] --- maven-remote-resources-plugin:1.2.1:process (default) @ apacheds-core-api ---
[INFO] 
[INFO] --- maven-resources-plugin:2.6:resources (default-resources) @ apacheds-core-api ---
[INFO] Using 'UTF-8' encoding to copy filtered resources.
[INFO] Copying 1 resource
[INFO] Copying 3 resources
[INFO] 
[INFO] --- maven-compiler-plugin:3.1:compile (default-compile) @ apacheds-core-api ---
[INFO] Changes detected - recompiling the module!
[INFO] Compiling 130 source files to <https://builds.apache.org/job/dir-apacheds-ubuntu-deploy/ws/trunk/core-api/target/classes>
[WARNING] <https://builds.apache.org/job/dir-apacheds-ubuntu-deploy/ws/trunk/core-api/src/main/java/org/apache/directory/server/core/api/schema/registries/synchronizers/AbstractRegistrySynchronizer.java>:
Some input files use unchecked or unsafe operations.
[WARNING] <https://builds.apache.org/job/dir-apacheds-ubuntu-deploy/ws/trunk/core-api/src/main/java/org/apache/directory/server/core/api/schema/registries/synchronizers/AbstractRegistrySynchronizer.java>:
Recompile with -Xlint:unchecked for details.
[INFO] 
[INFO] --- maven-resources-plugin:2.6:testResources (default-testResources) @ apacheds-core-api
---
[INFO] Using 'UTF-8' encoding to copy filtered resources.
[INFO] Copying 1 resource
[INFO] Copying 3 resources
[INFO] 
[INFO] --- maven-compiler-plugin:3.1:testCompile (default-testCompile) @ apacheds-core-api
---
[INFO] Changes detected - recompiling the module!
[INFO] Compiling 11 source files to <https://builds.apache.org/job/dir-apacheds-ubuntu-deploy/ws/trunk/core-api/target/test-classes>
[WARNING] <https://builds.apache.org/job/dir-apacheds-ubuntu-deploy/ws/trunk/core-api/src/test/java/org/apache/directory/server/core/api/MockDirectoryService.java>:
<https://builds.apache.org/job/dir-apacheds-ubuntu-deploy/ws/trunk/core-api/src/test/java/org/apache/directory/server/core/api/MockDirectoryService.java>
uses unchecked or unsafe operations.
[WARNING] <https://builds.apache.org/job/dir-apacheds-ubuntu-deploy/ws/trunk/core-api/src/test/java/org/apache/directory/server/core/api/MockDirectoryService.java>:
Recompile with -Xlint:unchecked for details.
[INFO] 
[INFO] --- maven-surefire-plugin:2.17:test (default-test) @ apacheds-core-api ---
[INFO] Surefire report directory: <https://builds.apache.org/job/dir-apacheds-ubuntu-deploy/ws/trunk/core-api/target/surefire-reports>

-------------------------------------------------------
 T E S T S
-------------------------------------------------------
Running org.apache.directory.server.core.api.changelog.TagTest
Tests run: 8, Failures: 0, Errors: 0, Skipped: 0, Time elapsed: 0.047 sec - in org.apache.directory.server.core.api.changelog.TagTest
Running org.apache.directory.server.core.api.entry.SchemaAwareModificationTest
Tests run: 7, Failures: 0, Errors: 0, Skipped: 0, Time elapsed: 1.248 sec - in org.apache.directory.server.core.api.entry.SchemaAwareModificationTest
Running org.apache.directory.server.core.api.entry.SchemaAwareEntryTest
Tests run: 81, Failures: 0, Errors: 0, Skipped: 0, Time elapsed: 0.62 sec - in org.apache.directory.server.core.api.entry.SchemaAwareEntryTest
Running org.apache.directory.server.core.api.entry.ClonedServerEntryTest
Tests run: 8, Failures: 0, Errors: 0, Skipped: 0, Time elapsed: 0.001 sec - in org.apache.directory.server.core.api.entry.ClonedServerEntryTest
Running org.apache.directory.server.core.api.sp.StoredProcUtilsTest
Tests run: 1, Failures: 0, Errors: 0, Skipped: 0, Time elapsed: 0 sec - in org.apache.directory.server.core.api.sp.StoredProcUtilsTest

Results :

Tests run: 105, Failures: 0, Errors: 0, Skipped: 0

[JENKINS] Recording test results
[INFO] 
[INFO] --- maven-bundle-plugin:2.5.0:bundle (default-bundle) @ apacheds-core-api ---
[INFO] 
[INFO] --- maven-site-plugin:3.3:attach-descriptor (attach-descriptor) @ apacheds-core-api
---
[INFO] 
[INFO] --- maven-jar-plugin:2.5:test-jar (attach-tests) @ apacheds-core-api ---
[INFO] Building jar: <https://builds.apache.org/job/dir-apacheds-ubuntu-deploy/ws/trunk/core-api/target/apacheds-core-api-2.0.0-M19-SNAPSHOT-tests.jar>
[INFO] 
[INFO] --- tools-maven-plugin:1.4:verify-legal-files (verify-legal-files) @ apacheds-core-api
---
[INFO] Checking legal files in: apacheds-core-api-2.0.0-M19-SNAPSHOT.jar
[INFO] Checking legal files in: apacheds-core-api-2.0.0-M19-SNAPSHOT-tests.jar
[WARNING] Failed to getClass for org.apache.maven.plugin.source.SourceJarMojo
[INFO] 
[INFO] --- maven-source-plugin:2.2.1:jar (attach-sources) @ apacheds-core-api ---
[INFO] Building jar: <https://builds.apache.org/job/dir-apacheds-ubuntu-deploy/ws/trunk/core-api/target/apacheds-core-api-2.0.0-M19-SNAPSHOT-sources.jar>
[INFO] 
[INFO] --- maven-install-plugin:2.5.1:install (default-install) @ apacheds-core-api ---
[INFO] Installing <https://builds.apache.org/job/dir-apacheds-ubuntu-deploy/ws/trunk/core-api/target/apacheds-core-api-2.0.0-M19-SNAPSHOT.jar>
to /home/jenkins/jenkins-slave/maven-repositories/0/org/apache/directory/server/apacheds-core-api/2.0.0-M19-SNAPSHOT/apacheds-core-api-2.0.0-M19-SNAPSHOT.jar
[INFO] Installing <https://builds.apache.org/job/dir-apacheds-ubuntu-deploy/ws/trunk/core-api/pom.xml>
to /home/jenkins/jenkins-slave/maven-repositories/0/org/apache/directory/server/apacheds-core-api/2.0.0-M19-SNAPSHOT/apacheds-core-api-2.0.0-M19-SNAPSHOT.pom
[INFO] Installing <https://builds.apache.org/job/dir-apacheds-ubuntu-deploy/ws/trunk/core-api/target/apacheds-core-api-2.0.0-M19-SNAPSHOT-tests.jar>
to /home/jenkins/jenkins-slave/maven-repositories/0/org/apache/directory/server/apacheds-core-api/2.0.0-M19-SNAPSHOT/apacheds-core-api-2.0.0-M19-SNAPSHOT-tests.jar
[INFO] Installing <https://builds.apache.org/job/dir-apacheds-ubuntu-deploy/ws/trunk/core-api/target/apacheds-core-api-2.0.0-M19-SNAPSHOT-sources.jar>
to /home/jenkins/jenkins-slave/maven-repositories/0/org/apache/directory/server/apacheds-core-api/2.0.0-M19-SNAPSHOT/apacheds-core-api-2.0.0-M19-SNAPSHOT-sources.jar
[INFO] 
[INFO] --- maven-bundle-plugin:2.5.0:install (default-install) @ apacheds-core-api ---
[INFO] Installing org/apache/directory/server/apacheds-core-api/2.0.0-M19-SNAPSHOT/apacheds-core-api-2.0.0-M19-SNAPSHOT.jar
[INFO] Writing OBR metadata
[INFO] 
[INFO] --- maven-deploy-plugin:2.8.1:deploy (default-deploy) @ apacheds-core-api ---
Downloading: https://repository.apache.org/content/repositories/snapshots/org/apache/directory/server/apacheds-core-api/2.0.0-M19-SNAPSHOT/maven-metadata.xml
Downloaded: https://repository.apache.org/content/repositories/snapshots/org/apache/directory/server/apacheds-core-api/2.0.0-M19-SNAPSHOT/maven-metadata.xml
(2 KB at 3.8 KB/sec)
Uploading: https://repository.apache.org/content/repositories/snapshots/org/apache/directory/server/apacheds-core-api/2.0.0-M19-SNAPSHOT/apacheds-core-api-2.0.0-M19-20141114.040428-2.jar
Uploaded: https://repository.apache.org/content/repositories/snapshots/org/apache/directory/server/apacheds-core-api/2.0.0-M19-SNAPSHOT/apacheds-core-api-2.0.0-M19-20141114.040428-2.jar
(255 KB at 544.6 KB/sec)
Uploading: https://repository.apache.org/content/repositories/snapshots/org/apache/directory/server/apacheds-core-api/2.0.0-M19-SNAPSHOT/apacheds-core-api-2.0.0-M19-20141114.040428-2.pom
Uploaded: https://repository.apache.org/content/repositories/snapshots/org/apache/directory/server/apacheds-core-api/2.0.0-M19-SNAPSHOT/apacheds-core-api-2.0.0-M19-20141114.040428-2.pom
(6 KB at 13.6 KB/sec)
Downloading: https://repository.apache.org/content/repositories/snapshots/org/apache/directory/server/apacheds-core-api/maven-metadata.xml
Downloaded: https://repository.apache.org/content/repositories/snapshots/org/apache/directory/server/apacheds-core-api/maven-metadata.xml
(456 B at 1.6 KB/sec)
Uploading: https://repository.apache.org/content/repositories/snapshots/org/apache/directory/server/apacheds-core-api/2.0.0-M19-SNAPSHOT/maven-metadata.xml
Uploaded: https://repository.apache.org/content/repositories/snapshots/org/apache/directory/server/apacheds-core-api/2.0.0-M19-SNAPSHOT/maven-metadata.xml
(2 KB at 4.1 KB/sec)
Uploading: https://repository.apache.org/content/repositories/snapshots/org/apache/directory/server/apacheds-core-api/maven-metadata.xml
Uploaded: https://repository.apache.org/content/repositories/snapshots/org/apache/directory/server/apacheds-core-api/maven-metadata.xml
(456 B at 1.2 KB/sec)
Uploading: https://repository.apache.org/content/repositories/snapshots/org/apache/directory/server/apacheds-core-api/2.0.0-M19-SNAPSHOT/apacheds-core-api-2.0.0-M19-20141114.040428-2-tests.jar
Uploaded: https://repository.apache.org/content/repositories/snapshots/org/apache/directory/server/apacheds-core-api/2.0.0-M19-SNAPSHOT/apacheds-core-api-2.0.0-M19-20141114.040428-2-tests.jar
(58 KB at 135.2 KB/sec)
Uploading: https://repository.apache.org/content/repositories/snapshots/org/apache/directory/server/apacheds-core-api/2.0.0-M19-SNAPSHOT/maven-metadata.xml
Uploaded: https://repository.apache.org/content/repositories/snapshots/org/apache/directory/server/apacheds-core-api/2.0.0-M19-SNAPSHOT/maven-metadata.xml
(2 KB at 3.6 KB/sec)
Uploading: https://repository.apache.org/content/repositories/snapshots/org/apache/directory/server/apacheds-core-api/2.0.0-M19-SNAPSHOT/apacheds-core-api-2.0.0-M19-20141114.040428-2-sources.jar
Uploaded: https://repository.apache.org/content/repositories/snapshots/org/apache/directory/server/apacheds-core-api/2.0.0-M19-SNAPSHOT/apacheds-core-api-2.0.0-M19-20141114.040428-2-sources.jar
(251 KB at 446.2 KB/sec)
Uploading: https://repository.apache.org/content/repositories/snapshots/org/apache/directory/server/apacheds-core-api/2.0.0-M19-SNAPSHOT/maven-metadata.xml
Uploaded: https://repository.apache.org/content/repositories/snapshots/org/apache/directory/server/apacheds-core-api/2.0.0-M19-SNAPSHOT/maven-metadata.xml
(2 KB at 3.7 KB/sec)
[INFO] 
[INFO] --- maven-bundle-plugin:2.5.0:deploy (default-deploy) @ apacheds-core-api ---
[INFO] Remote OBR update disabled (enable with -DremoteOBR)
[JENKINS] Archiving disabled
[INFO]                                                                         
[INFO] ------------------------------------------------------------------------
[INFO] Building ApacheDS Core Shared 2.0.0-M19-SNAPSHOT
[INFO] ------------------------------------------------------------------------
Downloading: http://repo.maven.apache.org/maven2/org/apache/directory/mavibot/mavibot/1.0.0-M6/mavibot-1.0.0-M6.pom
[WARNING] The POM for org.apache.directory.mavibot:mavibot:jar:1.0.0-M6 is missing, no dependency
information available
Downloading: http://repo.maven.apache.org/maven2/org/apache/directory/mavibot/mavibot/1.0.0-M6/mavibot-1.0.0-M6.jar
[JENKINS] Archiving disabled
[INFO] ------------------------------------------------------------------------
[INFO] Reactor Summary:
[INFO] 
[INFO] ApacheDS .......................................... SUCCESS [11.932s]
[INFO] ApacheDS I18n ..................................... SUCCESS [11.641s]
[INFO] ApacheDS Core Constants ........................... SUCCESS [8.597s]
[INFO] ApacheDS Core API ................................. SUCCESS [57.195s]
[INFO] ApacheDS Core Shared .............................. FAILURE [0.299s]
[INFO] ApacheDS Interceptors ............................. SKIPPED
[INFO] ApacheDS AdministrativePoint Interceptor .......... SKIPPED
[INFO] ApacheDS Authentication Interceptor ............... SKIPPED
[INFO] ApacheDS Interceptor to increment numeric attributes  SKIPPED
[INFO] ApacheDS Authorization Interceptor ................ SKIPPED
[INFO] ApacheDS ChangeLog Interceptor .................... SKIPPED
[INFO] ApacheDS Collective Attribute Interceptor ......... SKIPPED
[INFO] ApacheDS Event Interceptor ........................ SKIPPED
[INFO] ApacheDS Exception Interceptor .................... SKIPPED
[INFO] ApacheDS Journal Interceptor ...................... SKIPPED
[INFO] ApacheDS Normalization Interceptor ................ SKIPPED
[INFO] ApacheDS Operational Attribute Interceptor ........ SKIPPED
[INFO] ApacheDS Referral Interceptor ..................... SKIPPED
[INFO] ApacheDS Schema Interceptor ....................... SKIPPED
[INFO] ApacheDS Subtree Interceptor ...................... SKIPPED
[INFO] ApacheDS Triggers Interceptor ..................... SKIPPED
[INFO] ApacheDS Core ..................................... SKIPPED
[INFO] ApacheDS Core AVL ................................. SKIPPED
[INFO] ApacheDS Generalized (X) DBM Partition ............ SKIPPED
[INFO] ApacheDS LDIF Partition ........................... SKIPPED
[INFO] ApacheDS JDBM Partition ........................... SKIPPED
[INFO] ApacheDS Mavibot Partition ........................ SKIPPED
[INFO] ApacheDS Core Annotations ......................... SKIPPED
[INFO] ApacheDS Core JNDI ................................ SKIPPED
[INFO] ApacheDS Protocol Kerberos Codec .................. SKIPPED
[INFO] ApacheDS Interceptors for Kerberos ................ SKIPPED
[INFO] ApacheDS Protocol Dhcp ............................ SKIPPED
[INFO] ApacheDS Protocol Shared .......................... SKIPPED
[INFO] ApacheDS Protocol Dns ............................. SKIPPED
[INFO] ApacheDS Protocol Kerberos ........................ SKIPPED
[INFO] ApacheDS Protocol Ldap ............................ SKIPPED
[INFO] ApacheDS Protocol Ntp ............................. SKIPPED
[INFO] Apacheds Server Annotations ....................... SKIPPED
[INFO] ApacheDS Server Config ............................ SKIPPED
[INFO] ApacheDS Server JNDI .............................. SKIPPED
[INFO] ApacheDS Test Framework ........................... SKIPPED
[INFO] ApacheDS All ...................................... SKIPPED
[INFO] ApacheDS Logger Interceptor ....................... SKIPPED
[INFO] ApacheDS Password Hashing Interceptor ............. SKIPPED
[INFO] ApacheDS Core Integration ......................... SKIPPED
[INFO] ApacheDS Protocol Kerberos Test ................... SKIPPED
[INFO] ApacheDS Server Integration ....................... SKIPPED
[INFO] ApacheDS DirectoryService-WebApp bridge ........... SKIPPED
[INFO] ApacheDS Jetty HTTP Server Integration ............ SKIPPED
[INFO] ApacheDS Service Builder .......................... SKIPPED
[INFO] Apache Directory LDAP Client API test ............. SKIPPED
[INFO] kerberos-client ................................... SKIPPED
[INFO] ApacheDS Service .................................. SKIPPED
[INFO] ApacheDS Wrapper .................................. SKIPPED
[INFO] ApacheDS Installers Maven Plugin .................. SKIPPED
[INFO] ApacheDS Installers ............................... SKIPPED
[INFO] ------------------------------------------------------------------------
[INFO] BUILD FAILURE
[INFO] ------------------------------------------------------------------------
[INFO] Total time: 1:40.790s
[INFO] Finished at: Fri Nov 14 04:04:34 UTC 2014
[INFO] Final Memory: 46M/257M
[INFO] ------------------------------------------------------------------------
[JENKINS] Archiving disabled
[JENKINS] Archiving disabled
[JENKINS] Archiving disabled
[JENKINS] Archiving disabled
[JENKINS] Archiving disabled
[JENKINS] Archiving disabled
[JENKINS] Archiving disabled
[JENKINS] Archiving disabled
[JENKINS] Archiving disabled
[JENKINS] Archiving disabled
[JENKINS] Archiving disabled
[JENKINS] Archiving disabled
[JENKINS] Archiving disabled
[JENKINS] Archiving disabled
[JENKINS] Archiving disabled
[JENKINS] Archiving disabled
[JENKINS] Archiving disabled
[JENKINS] Archiving disabled
[JENKINS] Archiving disabled
[JENKINS] Archiving disabled
[JENKINS] Archiving disabled
[JENKINS] Archiving disabled
[JENKINS] Archiving disabled
[JENKINS] Archiving disabled
[JENKINS] Archiving disabled
[JENKINS] Archiving disabled
[JENKINS] Archiving disabled
[JENKINS] Archiving disabled
[JENKINS] Archiving disabled
[JENKINS] Archiving disabled
[JENKINS] Archiving disabled
[JENKINS] Archiving disabled
[JENKINS] Archiving disabled
[JENKINS] Archiving disabled
[JENKINS] Archiving disabled
[JENKINS] Archiving disabled
[JENKINS] Archiving disabled
[JENKINS] Archiving disabled
[JENKINS] Archiving disabled
[JENKINS] Archiving disabled
[JENKINS] Archiving disabled
[JENKINS] Archiving disabled
[JENKINS] Archiving disabled
[JENKINS] Archiving disabled
[JENKINS] Archiving disabled
[JENKINS] Archiving disabled
[JENKINS] Archiving disabled
[JENKINS] Archiving disabled
[JENKINS] Archiving disabled
[JENKINS] Archiving disabled
[JENKINS] Archiving disabled
[JENKINS] Archiving disabled
[JENKINS] Archiving disabled
[JENKINS] Archiving disabled
[JENKINS] Archiving disabled
[JENKINS] Archiving disabled
Waiting for Jenkins to finish collecting data[ERROR] Failed to execute goal on project apacheds-core-shared:
Could not resolve dependencies for project org.apache.directory.server:apacheds-core-shared:bundle:2.0.0-M19-SNAPSHOT:
Could not find artifact org.apache.directory.mavibot:mavibot:jar:1.0.0-M6 in central (http://repo.maven.apache.org/maven2)
-> [Help 1]
[ERROR] 
[ERROR] To see the full stack trace of the errors, re-run Maven with the -e switch.
[ERROR] Re-run Maven using the -X switch to enable full debug logging.
[ERROR] 
[ERROR] For more information about the errors and possible solutions, please read the following
articles:
[ERROR] [Help 1] http://cwiki.apache.org/confluence/display/MAVEN/DependencyResolutionException
[ERROR] 
[ERROR] After correcting the problems, you can resume the build with the command
[ERROR]   mvn <goals> -rf :apacheds-core-shared

channel stopped

Mime
View raw message