directory-notifications mailing list archives

Site index · List index
Message view « Date » · « Thread »
Top « Date » · « Thread »
From Apache Jenkins Server <jenk...@builds.apache.org>
Subject Build failed in Jenkins: dir-apacheds-ubuntu-deploy #1499
Date Mon, 03 Nov 2014 04:00:16 GMT
See <https://builds.apache.org/job/dir-apacheds-ubuntu-deploy/1499/changes>

Changes:

[elecharny] Bumped some plugins versions, removed the 'bundle' part for jdbm1 dependency

------------------------------------------
Started by timer
Building remotely on H10 (Ubuntu ubuntu) in workspace <https://builds.apache.org/job/dir-apacheds-ubuntu-deploy/ws/>
Updating https://svn.apache.org/repos/asf/directory/apacheds/trunk at revision '2014-11-03T04:00:01.087
+0000'
U         pom.xml
At revision 1636236
Parsing POMs
ERROR: Failed to parse POMs
java.io.IOException: remote file operation failed: <https://builds.apache.org/job/dir-apacheds-ubuntu-deploy/ws/trunk>
at hudson.remoting.Channel@69bad1d0:H10
	at hudson.FilePath.act(FilePath.java:916)
	at hudson.FilePath.act(FilePath.java:893)
	at hudson.maven.MavenModuleSetBuild$MavenModuleSetBuildExecution.parsePoms(MavenModuleSetBuild.java:953)
	at hudson.maven.MavenModuleSetBuild$MavenModuleSetBuildExecution.doRun(MavenModuleSetBuild.java:681)
	at hudson.model.AbstractBuild$AbstractBuildExecution.run(AbstractBuild.java:529)
	at hudson.model.Run.execute(Run.java:1706)
	at hudson.maven.MavenModuleSetBuild.run(MavenModuleSetBuild.java:529)
	at hudson.model.ResourceController.execute(ResourceController.java:88)
	at hudson.model.Executor.run(Executor.java:232)
Caused by: hudson.remoting.ProxyException: hudson.maven.MavenModuleSetBuild$MavenExecutionException:
org.apache.maven.project.ProjectBuildingException: Some problems were encountered while processing
the POMs:
[ERROR] 'dependencies.dependency.version' for org.apache.directory.jdbm:apacheds-jdbm1:bundle
is missing. @ line 74, column 17
[ERROR] 'dependencies.dependency.version' for org.apache.directory.jdbm:apacheds-jdbm1:bundle
is missing. @ line 70, column 17
[ERROR] 'dependencies.dependency.version' for org.apache.directory.jdbm:apacheds-jdbm1:bundle
is missing. @ line 61, column 17

	at hudson.maven.MavenModuleSetBuild$PomParser.invoke(MavenModuleSetBuild.java:1357)
	at hudson.maven.MavenModuleSetBuild$PomParser.invoke(MavenModuleSetBuild.java:1091)
	at hudson.FilePath$FileCallableWrapper.call(FilePath.java:2474)
	at hudson.remoting.UserRequest.perform(UserRequest.java:118)
	at hudson.remoting.UserRequest.perform(UserRequest.java:48)
	at hudson.remoting.Request$2.run(Request.java:328)
	at hudson.remoting.InterceptingExecutorService$1.call(InterceptingExecutorService.java:72)
	at java.util.concurrent.FutureTask.run(FutureTask.java:262)
	at java.util.concurrent.ThreadPoolExecutor.runWorker(ThreadPoolExecutor.java:1145)
	at java.util.concurrent.ThreadPoolExecutor$Worker.run(ThreadPoolExecutor.java:615)
	at java.lang.Thread.run(Thread.java:745)
Caused by: hudson.remoting.ProxyException: org.apache.maven.project.ProjectBuildingException:
Some problems were encountered while processing the POMs:
[ERROR] 'dependencies.dependency.version' for org.apache.directory.jdbm:apacheds-jdbm1:bundle
is missing. @ line 74, column 17
[ERROR] 'dependencies.dependency.version' for org.apache.directory.jdbm:apacheds-jdbm1:bundle
is missing. @ line 70, column 17
[ERROR] 'dependencies.dependency.version' for org.apache.directory.jdbm:apacheds-jdbm1:bundle
is missing. @ line 61, column 17

	at org.apache.maven.project.DefaultProjectBuilder.build(DefaultProjectBuilder.java:364)
	at hudson.maven.MavenEmbedder.buildProjects(MavenEmbedder.java:361)
	at hudson.maven.MavenEmbedder.readProjects(MavenEmbedder.java:331)
	at hudson.maven.MavenModuleSetBuild$PomParser.invoke(MavenModuleSetBuild.java:1294)
	... 10 more

Mime
View raw message