directory-notifications mailing list archives

Site index · List index
Message view « Date » · « Thread »
Top « Date » · « Thread »
From Apache Jenkins Server <jenk...@builds.apache.org>
Subject Build failed in Jenkins: dir-apacheds-ubuntu-deploy #1481
Date Thu, 16 Oct 2014 04:14:45 GMT
See <https://builds.apache.org/job/dir-apacheds-ubuntu-deploy/1481/>

------------------------------------------
[...truncated 4015 lines...]
[INFO] 
[INFO] --- maven-compiler-plugin:3.1:compile (default-compile) @ apacheds-core-integ ---
[INFO] Changes detected - recompiling the module!
[INFO] Compiling 1 source file to <https://builds.apache.org/job/dir-apacheds-ubuntu-deploy/ws/trunk/core-integ/target/classes>
[INFO] 
[INFO] --- maven-resources-plugin:2.6:testResources (default-testResources) @ apacheds-core-integ
---
[INFO] Using 'UTF-8' encoding to copy filtered resources.
[INFO] Copying 9 resources
[INFO] Copying 3 resources
[INFO] 
[INFO] --- maven-dependency-plugin:2.8:copy (copy) @ apacheds-core-integ ---
[INFO] Configured Artifact: org.apache.directory.api:api-ldap-extras-codec:1.0.0-M25-SNAPSHOT:jar
[INFO] Copying api-ldap-extras-codec-1.0.0-M25-SNAPSHOT.jar to <https://builds.apache.org/job/dir-apacheds-ubuntu-deploy/ws/trunk/core-integ/target/pluginDirectory/api-ldap-extras-codec-1.0.0-M25-20141016.030524-68.jar>
[INFO] 
[INFO] --- maven-compiler-plugin:3.1:testCompile (default-testCompile) @ apacheds-core-integ
---
[INFO] Changes detected - recompiling the module!
[INFO] Compiling 106 source files to <https://builds.apache.org/job/dir-apacheds-ubuntu-deploy/ws/trunk/core-integ/target/test-classes>
[WARNING] <https://builds.apache.org/job/dir-apacheds-ubuntu-deploy/ws/trunk/core-integ/src/test/java/org/apache/directory/server/core/operations/search/SearchIT.java>:
<https://builds.apache.org/job/dir-apacheds-ubuntu-deploy/ws/trunk/core-integ/src/test/java/org/apache/directory/server/core/operations/search/SearchIT.java>
uses unchecked or unsafe operations.
[WARNING] <https://builds.apache.org/job/dir-apacheds-ubuntu-deploy/ws/trunk/core-integ/src/test/java/org/apache/directory/server/core/operations/search/SearchIT.java>:
Recompile with -Xlint:unchecked for details.
[INFO] 
[INFO] --- maven-surefire-plugin:2.17:test (default-test) @ apacheds-core-integ ---
[INFO] Surefire report directory: <https://builds.apache.org/job/dir-apacheds-ubuntu-deploy/ws/trunk/core-integ/target/surefire-reports>

-------------------------------------------------------
 T E S T S
-------------------------------------------------------
Running org.apache.directory.server.core.changelog.DefaultChangeLogIT
Tests run: 7, Failures: 0, Errors: 0, Skipped: 0, Time elapsed: 6.685 sec - in org.apache.directory.server.core.changelog.DefaultChangeLogIT
Running org.apache.directory.server.core.trigger.TriggerInterceptorIT
Tests run: 1, Failures: 0, Errors: 0, Skipped: 1, Time elapsed: 0 sec - in org.apache.directory.server.core.trigger.TriggerInterceptorIT
Running org.apache.directory.server.core.trigger.SubentryServiceForTriggersIT
Tests run: 1, Failures: 0, Errors: 0, Skipped: 1, Time elapsed: 0 sec - in org.apache.directory.server.core.trigger.SubentryServiceForTriggersIT
Running org.apache.directory.server.core.exception.ExceptionServiceIT
Tests run: 19, Failures: 0, Errors: 0, Skipped: 0, Time elapsed: 1.814 sec - in org.apache.directory.server.core.exception.ExceptionServiceIT
Running org.apache.directory.server.core.configuration.PartitionConfigurationIT
Tests run: 1, Failures: 0, Errors: 0, Skipped: 0, Time elapsed: 1.51 sec - in org.apache.directory.server.core.configuration.PartitionConfigurationIT
Running org.apache.directory.server.core.admin.AdministrativePointServiceIT
Tests run: 1, Failures: 0, Errors: 0, Skipped: 1, Time elapsed: 0 sec - in org.apache.directory.server.core.admin.AdministrativePointServiceIT
Running org.apache.directory.server.core.jndi.RootDSEJndiIT
Tests run: 8, Failures: 0, Errors: 0, Skipped: 0, Time elapsed: 1.159 sec - in org.apache.directory.server.core.jndi.RootDSEJndiIT
Running org.apache.directory.server.core.jndi.MixedCaseIT
Tests run: 4, Failures: 0, Errors: 0, Skipped: 0, Time elapsed: 1.372 sec - in org.apache.directory.server.core.jndi.MixedCaseIT
Running org.apache.directory.server.core.jndi.ObjStateFactoryIT
Tests run: 2, Failures: 0, Errors: 0, Skipped: 0, Time elapsed: 1.182 sec - in org.apache.directory.server.core.jndi.ObjStateFactoryIT
Running org.apache.directory.server.core.jndi.ModifyContextIT
Tests run: 3, Failures: 0, Errors: 0, Skipped: 0, Time elapsed: 1.474 sec - in org.apache.directory.server.core.jndi.ModifyContextIT
Running org.apache.directory.server.core.jndi.AddJndiIT
Tests run: 4, Failures: 0, Errors: 0, Skipped: 0, Time elapsed: 1.102 sec - in org.apache.directory.server.core.jndi.AddJndiIT
Running org.apache.directory.server.core.jndi.ExtensibleObjectIT
Tests run: 2, Failures: 0, Errors: 0, Skipped: 0, Time elapsed: 1.068 sec - in org.apache.directory.server.core.jndi.ExtensibleObjectIT
Running org.apache.directory.server.core.jndi.UniqueMemberIT
Tests run: 8, Failures: 0, Errors: 0, Skipped: 0, Time elapsed: 1.136 sec - in org.apache.directory.server.core.jndi.UniqueMemberIT
Running org.apache.directory.server.core.jndi.SimpleBindJndiIT
Tests run: 9, Failures: 0, Errors: 0, Skipped: 0, Time elapsed: 1.062 sec - in org.apache.directory.server.core.jndi.SimpleBindJndiIT
Running org.apache.directory.server.core.jndi.DestroyContextIT
Tests run: 1, Failures: 0, Errors: 0, Skipped: 0, Time elapsed: 1.131 sec - in org.apache.directory.server.core.jndi.DestroyContextIT
Running org.apache.directory.server.core.jndi.ListIT
Tests run: 4, Failures: 0, Errors: 0, Skipped: 0, Time elapsed: 1.043 sec - in org.apache.directory.server.core.jndi.ListIT
Running org.apache.directory.server.core.jndi.CreateContextIT
Tests run: 8, Failures: 0, Errors: 0, Skipped: 0, Time elapsed: 1.291 sec - in org.apache.directory.server.core.jndi.CreateContextIT
Running org.apache.directory.server.core.jndi.RFC2713IT
Tests run: 1, Failures: 0, Errors: 0, Skipped: 0, Time elapsed: 0.999 sec - in org.apache.directory.server.core.jndi.RFC2713IT
Running org.apache.directory.server.core.jndi.DIRSERVER791IT
Tests run: 4, Failures: 0, Errors: 0, Skipped: 0, Time elapsed: 1.136 sec - in org.apache.directory.server.core.jndi.DIRSERVER791IT
Running org.apache.directory.server.core.jndi.referral.ModifyReferralIT
Tests run: 10, Failures: 0, Errors: 0, Skipped: 0, Time elapsed: 1.116 sec - in org.apache.directory.server.core.jndi.referral.ModifyReferralIT
Running org.apache.directory.server.core.jndi.referral.AddReferralIT
Tests run: 6, Failures: 0, Errors: 0, Skipped: 0, Time elapsed: 1.084 sec - in org.apache.directory.server.core.jndi.referral.AddReferralIT
Running org.apache.directory.server.core.jndi.referral.CompareReferralIT
Tests run: 10, Failures: 0, Errors: 0, Skipped: 0, Time elapsed: 1.057 sec - in org.apache.directory.server.core.jndi.referral.CompareReferralIT
Running org.apache.directory.server.core.jndi.referral.DeleteReferralIT
Tests run: 8, Failures: 0, Errors: 0, Skipped: 0, Time elapsed: 1.061 sec - in org.apache.directory.server.core.jndi.referral.DeleteReferralIT
Running org.apache.directory.server.core.jndi.referral.RenameReferralIT
Tests run: 9, Failures: 0, Errors: 0, Skipped: 0, Time elapsed: 1.008 sec - in org.apache.directory.server.core.jndi.referral.RenameReferralIT
Running org.apache.directory.server.core.jndi.referral.RenameReferralIgnoreIT
Tests run: 6, Failures: 0, Errors: 0, Skipped: 0, Time elapsed: 1.186 sec - in org.apache.directory.server.core.jndi.referral.RenameReferralIgnoreIT
Running org.apache.directory.server.core.jndi.referral.MoveReferralIT
Tests run: 14, Failures: 0, Errors: 0, Skipped: 0, Time elapsed: 1.086 sec - in org.apache.directory.server.core.jndi.referral.MoveReferralIT
Running org.apache.directory.server.core.jndi.referral.MoveAndRenameReferralIT
Tests run: 12, Failures: 0, Errors: 0, Skipped: 0, Time elapsed: 1.137 sec - in org.apache.directory.server.core.jndi.referral.MoveAndRenameReferralIT
Running org.apache.directory.server.core.jndi.referral.SearchReferralIT
Tests run: 10, Failures: 0, Errors: 0, Skipped: 0, Time elapsed: 1.101 sec - in org.apache.directory.server.core.jndi.referral.SearchReferralIT
Running org.apache.directory.server.core.jndi.DIRSERVER169IT
Tests run: 2, Failures: 0, Errors: 0, Skipped: 0, Time elapsed: 1.095 sec - in org.apache.directory.server.core.jndi.DIRSERVER169IT
Running org.apache.directory.server.core.jndi.ReferralIT
Tests run: 33, Failures: 0, Errors: 0, Skipped: 0, Time elapsed: 4.895 sec - in org.apache.directory.server.core.jndi.ReferralIT
Running org.apache.directory.server.core.schema.MetaSyntaxHandlerIT
Tests run: 18, Failures: 0, Errors: 0, Skipped: 12, Time elapsed: 1.327 sec - in org.apache.directory.server.core.schema.MetaSyntaxHandlerIT
Running org.apache.directory.server.core.schema.MetaObjectClassHandlerIT
Tests run: 27, Failures: 0, Errors: 0, Skipped: 12, Time elapsed: 1.278 sec - in org.apache.directory.server.core.schema.MetaObjectClassHandlerIT
Running org.apache.directory.server.core.schema.SchemaPersistenceIT
Tests run: 2, Failures: 0, Errors: 0, Skipped: 0, Time elapsed: 3.695 sec - in org.apache.directory.server.core.schema.SchemaPersistenceIT
Running org.apache.directory.server.core.schema.MetaSyntaxCheckerHandlerIT
Tests run: 20, Failures: 0, Errors: 0, Skipped: 12, Time elapsed: 1.216 sec - in org.apache.directory.server.core.schema.MetaSyntaxCheckerHandlerIT
Running org.apache.directory.server.core.schema.MetaNormalizerHandlerIT
Tests run: 20, Failures: 0, Errors: 0, Skipped: 12, Time elapsed: 1.134 sec - in org.apache.directory.server.core.schema.MetaNormalizerHandlerIT
Running org.apache.directory.server.core.schema.ObjectClassCreateIT
Tests run: 4, Failures: 0, Errors: 0, Skipped: 0, Time elapsed: 1.157 sec - in org.apache.directory.server.core.schema.ObjectClassCreateIT
Running org.apache.directory.server.core.schema.SubschemaSubentryIT
Tests run: 18, Failures: 0, Errors: 0, Skipped: 1, Time elapsed: 22.593 sec - in org.apache.directory.server.core.schema.SubschemaSubentryIT
Running org.apache.directory.server.core.schema.SchemaServiceIT
Tests run: 23, Failures: 0, Errors: 0, Skipped: 0, Time elapsed: 2.72 sec - in org.apache.directory.server.core.schema.SchemaServiceIT
Running org.apache.directory.server.core.schema.MetaSchemaHandlerIT
Killed

Results :

Tests run: 340, Failures: 0, Errors: 0, Skipped: 52

[JENKINS] Recording test results
[JENKINS] Archiving disabled
[INFO] ------------------------------------------------------------------------
[INFO] Reactor Summary:
[INFO] 
[INFO] ApacheDS .......................................... SUCCESS [21.012s]
[INFO] ApacheDS I18n ..................................... SUCCESS [14.631s]
[INFO] ApacheDS Core Constants ........................... SUCCESS [17.713s]
[INFO] ApacheDS Core API ................................. SUCCESS [36.489s]
[INFO] ApacheDS Core Shared .............................. SUCCESS [21.234s]
[INFO] ApacheDS Interceptors ............................. SUCCESS [2.224s]
[INFO] ApacheDS AdministrativePoint Interceptor .......... SUCCESS [9.414s]
[INFO] ApacheDS Authentication Interceptor ............... SUCCESS [13.914s]
[INFO] ApacheDS Interceptor to increment numeric attributes  SUCCESS [9.454s]
[INFO] ApacheDS Authorization Interceptor ................ SUCCESS [14.343s]
[INFO] ApacheDS ChangeLog Interceptor .................... SUCCESS [14.778s]
[INFO] ApacheDS Collective Attribute Interceptor ......... SUCCESS [11.704s]
[INFO] ApacheDS Event Interceptor ........................ SUCCESS [8.740s]
[INFO] ApacheDS Exception Interceptor .................... SUCCESS [8.496s]
[INFO] ApacheDS Journal Interceptor ...................... SUCCESS [8.935s]
[INFO] ApacheDS Normalization Interceptor ................ SUCCESS [11.581s]
[INFO] ApacheDS Operational Attribute Interceptor ........ SUCCESS [7.914s]
[INFO] ApacheDS Referral Interceptor ..................... SUCCESS [6.154s]
[INFO] ApacheDS Schema Interceptor ....................... SUCCESS [11.698s]
[INFO] ApacheDS Subtree Interceptor ...................... SUCCESS [14.754s]
[INFO] ApacheDS Triggers Interceptor ..................... SUCCESS [11.315s]
[INFO] ApacheDS Core ..................................... SUCCESS [14.185s]
[INFO] ApacheDS Core AVL ................................. SUCCESS [18.018s]
[INFO] ApacheDS Generalized (X) DBM Partition ............ SUCCESS [20.718s]
[INFO] ApacheDS LDIF Partition ........................... SUCCESS [15.498s]
[INFO] ApacheDS JDBM Partition ........................... SUCCESS [26.993s]
[INFO] ApacheDS Mavibot Partition ........................ SUCCESS [17.481s]
[INFO] ApacheDS Core Annotations ......................... SUCCESS [23.725s]
[INFO] ApacheDS Core JNDI ................................ SUCCESS [11.565s]
[INFO] ApacheDS Protocol Kerberos Codec .................. SUCCESS [20.822s]
[INFO] ApacheDS Interceptors for Kerberos ................ SUCCESS [11.499s]
[INFO] ApacheDS Protocol Dhcp ............................ SUCCESS [8.486s]
[INFO] ApacheDS Protocol Shared .......................... SUCCESS [8.703s]
[INFO] ApacheDS Protocol Dns ............................. SUCCESS [12.604s]
[INFO] ApacheDS Protocol Kerberos ........................ SUCCESS [24.312s]
[INFO] ApacheDS Protocol Ldap ............................ SUCCESS [20.419s]
[INFO] ApacheDS Protocol Ntp ............................. SUCCESS [14.133s]
[INFO] Apacheds Server Annotations ....................... SUCCESS [20.923s]
[INFO] ApacheDS Server Config ............................ SUCCESS [11.458s]
[INFO] ApacheDS Server JNDI .............................. SUCCESS [6.644s]
[INFO] ApacheDS Test Framework ........................... SUCCESS [34.701s]
[INFO] ApacheDS All ...................................... SUCCESS [11.993s]
[INFO] ApacheDS Logger Interceptor ....................... SUCCESS [8.624s]
[INFO] ApacheDS Password Hashing Interceptor ............. SUCCESS [9.037s]
[INFO] ApacheDS Core Integration ......................... FAILURE [1:26.665s]
[INFO] ApacheDS Protocol Kerberos Test ................... SKIPPED
[INFO] ApacheDS Server Integration ....................... SKIPPED
[INFO] ApacheDS DirectoryService-WebApp bridge ........... SKIPPED
[INFO] ApacheDS Jetty HTTP Server Integration ............ SKIPPED
[INFO] ApacheDS Service Builder .......................... SKIPPED
[INFO] Apache Directory LDAP Client API test ............. SKIPPED
[INFO] kerberos-client ................................... SKIPPED
[INFO] ApacheDS Service .................................. SKIPPED
[INFO] ApacheDS Wrapper .................................. SKIPPED
[INFO] ApacheDS Installers Maven Plugin .................. SKIPPED
[INFO] ApacheDS Installers ............................... SKIPPED
[INFO] ApacheDS Mavibot bulkloader ....................... SKIPPED
[INFO] ------------------------------------------------------------------------
[INFO] BUILD FAILURE
[INFO] ------------------------------------------------------------------------
[INFO] Total time: 12:44.023s
[INFO] Finished at: Thu Oct 16 04:14:10 UTC 2014
[INFO] Final Memory: 74M/291M
[INFO] ------------------------------------------------------------------------
[JENKINS] Archiving disabled
[JENKINS] Archiving disabled
[JENKINS] Archiving disabled
[JENKINS] Archiving disabled
[JENKINS] Archiving disabled
[JENKINS] Archiving disabled
[JENKINS] Archiving disabled
[JENKINS] Archiving disabled
[JENKINS] Archiving disabled
[JENKINS] Archiving disabled
[JENKINS] Archiving disabled
[JENKINS] Archiving disabled
[JENKINS] Archiving disabled
[JENKINS] Archiving disabled
[JENKINS] Archiving disabled
[JENKINS] Archiving disabled
[JENKINS] Archiving disabled
[JENKINS] Archiving disabled
[JENKINS] Archiving disabled
[JENKINS] Archiving disabled
[JENKINS] Archiving disabled
[JENKINS] Archiving disabled
[JENKINS] Archiving disabled
[JENKINS] Archiving disabled
[JENKINS] Archiving disabled
[JENKINS] Archiving disabled
[JENKINS] Archiving disabled
[JENKINS] Archiving disabled
[JENKINS] Archiving disabled
[JENKINS] Archiving disabled
[JENKINS] Archiving disabled
[JENKINS] Archiving disabled
[JENKINS] Archiving disabled
[JENKINS] Archiving disabled
[JENKINS] Archiving disabled
[JENKINS] Archiving disabled
[JENKINS] Archiving disabled
[JENKINS] Archiving disabled
[JENKINS] Archiving disabled
[JENKINS] Archiving disabled
[JENKINS] Archiving disabled
[JENKINS] Archiving disabled
[JENKINS] Archiving disabled
[JENKINS] Archiving disabled
[JENKINS] Archiving disabled
[JENKINS] Archiving disabled
[JENKINS] Archiving disabled
[JENKINS] Archiving disabled
[JENKINS] Archiving disabled
[JENKINS] Archiving disabled
[JENKINS] Archiving disabled
[JENKINS] Archiving disabled
[JENKINS] Archiving disabled
[JENKINS] Archiving disabled
[JENKINS] Archiving disabled
[JENKINS] Archiving disabled
[JENKINS] Archiving disabled
Waiting for Jenkins to finish collecting data
[ERROR] Failed to execute goal org.apache.maven.plugins:maven-surefire-plugin:2.17:test (default-test)
on project apacheds-core-integ: Execution default-test of goal org.apache.maven.plugins:maven-surefire-plugin:2.17:test
failed: The forked VM terminated without properly saying goodbye. VM crash or System.exit
called?
[ERROR] Command was /bin/sh -c cd <https://builds.apache.org/job/dir-apacheds-ubuntu-deploy/ws/trunk/core-integ>
&& /home/jenkins/tools/java/jdk1.7.0_25-32/jre/bin/java -Xmx1024m -jar <https://builds.apache.org/job/dir-apacheds-ubuntu-deploy/ws/trunk/core-integ/target/surefire/surefirebooter6434253521470060704.jar>
<https://builds.apache.org/job/dir-apacheds-ubuntu-deploy/ws/trunk/core-integ/target/surefire/surefire5442804877292517538tmp>
<https://builds.apache.org/job/dir-apacheds-ubuntu-deploy/ws/trunk/core-integ/target/surefire/surefire_253756976373300407994tmp>
[ERROR] -> [Help 1]
[ERROR] 
[ERROR] To see the full stack trace of the errors, re-run Maven with the -e switch.
[ERROR] Re-run Maven using the -X switch to enable full debug logging.
[ERROR] 
[ERROR] For more information about the errors and possible solutions, please read the following
articles:
[ERROR] [Help 1] http://cwiki.apache.org/confluence/display/MAVEN/PluginExecutionException
[ERROR] 
[ERROR] After correcting the problems, you can resume the build with the command
[ERROR]   mvn <goals> -rf :apacheds-core-integ
channel stopped

Mime
View raw message