directory-notifications mailing list archives

Site index · List index
Message view « Date » · « Thread »
Top « Date » · « Thread »
From Apache Jenkins Server <jenk...@builds.apache.org>
Subject Build failed in Jenkins: dir-checkstyle-deploy-site #1430
Date Wed, 17 Sep 2014 02:03:01 GMT
See <https://builds.apache.org/job/dir-checkstyle-deploy-site/1430/>

------------------------------------------
Started by timer
Building remotely on jenkins-ubuntu-1404-4gb-d05 (jenkins-cloud-4GB Ubuntu ubuntu) in workspace
<https://builds.apache.org/job/dir-checkstyle-deploy-site/ws/>
Checking out a fresh workspace because <https://builds.apache.org/job/dir-checkstyle-deploy-site/ws/trunk>
doesn't exist
Cleaning local Directory trunk
Checking out https://svn.apache.org/repos/asf/directory/buildtools/checkstyle-configuration/trunk
at revision '2014-09-17T02:00:39.819 +0000'
A         src
A         src/main
A         src/main/resources
AU        src/main/resources/directory-checks.xml
A         src/site
A         src/site/site.xml
AU        pom.xml
 U        .
At revision 1625452
no change for https://svn.apache.org/repos/asf/directory/buildtools/checkstyle-configuration/trunk
since the previous build
Parsing POMs
Downloaded artifact http://repo.maven.apache.org/maven2/org/apache/directory/project/project/32/project-32.pom
maven3-agent.jar already up to date
maven3-interceptor.jar already up to date
maven3-interceptor-commons.jar already up to date
[trunk] $ /home/jenkins/tools/java/latest1.7/bin/java -Xmx512m -XX:MaxPermSize=128m -Djava.awt.headless=true
-cp /jenkins/maven3-agent.jar:/home/jenkins/tools/maven/apache-maven-3.0.4/boot/plexus-classworlds-2.4.jar
org.jvnet.hudson.maven3.agent.Maven3Main /home/jenkins/tools/maven/apache-maven-3.0.4 /tmp/slave.jar
/jenkins/maven3-interceptor.jar /jenkins/maven3-interceptor-commons.jar 52320
<===[JENKINS REMOTING CAPACITY]===>   channel started
log4j:WARN No appenders could be found for logger (org.apache.commons.beanutils.converters.BooleanConverter).
log4j:WARN Please initialize the log4j system properly.
Executing Maven:  -B -f <https://builds.apache.org/job/dir-checkstyle-deploy-site/ws/trunk/pom.xml>
-Dmaven.repo.local=/jenkins/maven-repositories/0 -V clean deploy site
Apache Maven 3.0.4 (r1232337; 2012-01-17 08:44:56+0000)
Maven home: /home/jenkins/tools/maven/apache-maven-3.0.4
Java version: 1.7.0_25, vendor: Oracle Corporation
Java home: /home/jenkins/tools/java/jdk1.7.0_25-32/jre
Default locale: en_US, platform encoding: UTF-8
OS name: "linux", version: "3.13.0-30-generic", arch: "i386", family: "unix"
[INFO] Scanning for projects...
[INFO]                                                                         
[INFO] ------------------------------------------------------------------------
[INFO] Building Apache Directory Checkstyle Configuration 0.2-SNAPSHOT
[INFO] ------------------------------------------------------------------------
Downloading: http://repo.maven.apache.org/maven2/org/apache/maven/plugins/maven-jar-plugin/2.5/maven-jar-plugin-2.5.pom
Downloaded: http://repo.maven.apache.org/maven2/org/apache/maven/plugins/maven-jar-plugin/2.5/maven-jar-plugin-2.5.pom
(8 KB at 29.6 KB/sec)
Downloading: http://repo.maven.apache.org/maven2/org/apache/maven/plugins/maven-jar-plugin/2.5/maven-jar-plugin-2.5.jar
Downloaded: http://repo.maven.apache.org/maven2/org/apache/maven/plugins/maven-jar-plugin/2.5/maven-jar-plugin-2.5.jar
(25 KB at 837.7 KB/sec)
[INFO] 
[INFO] --- maven-clean-plugin:2.4.1:clean (default-clean) @ checkstyle-configuration ---
[INFO] 
[INFO] --- maven-remote-resources-plugin:1.2.1:process (default) @ checkstyle-configuration
---
[INFO] 
[INFO] --- maven-resources-plugin:2.6:resources (default-resources) @ checkstyle-configuration
---
[INFO] Using 'UTF-8' encoding to copy filtered resources.
[INFO] Copying 1 resource
[INFO] Copying 3 resources
[INFO] 
[INFO] --- maven-compiler-plugin:3.1:compile (default-compile) @ checkstyle-configuration
---
[INFO] No sources to compile
[INFO] 
[INFO] --- maven-resources-plugin:2.6:testResources (default-testResources) @ checkstyle-configuration
---
[INFO] Using 'UTF-8' encoding to copy filtered resources.
[INFO] skip non existing resourceDirectory <https://builds.apache.org/job/dir-checkstyle-deploy-site/ws/trunk/src/test/resources>
[INFO] Copying 3 resources
[INFO] 
[INFO] --- maven-compiler-plugin:3.1:testCompile (default-testCompile) @ checkstyle-configuration
---
[INFO] No sources to compile
[INFO] 
[INFO] --- maven-surefire-plugin:2.17:test (default-test) @ checkstyle-configuration ---
[JENKINS] Recording test results
[INFO] 
[INFO] --- maven-jar-plugin:2.5:jar (default-jar) @ checkstyle-configuration ---
Downloading: http://repo.maven.apache.org/maven2/org/codehaus/plexus/plexus-archiver/2.4.4/plexus-archiver-2.4.4.pom
Downloaded: http://repo.maven.apache.org/maven2/org/codehaus/plexus/plexus-archiver/2.4.4/plexus-archiver-2.4.4.pom
(4 KB at 104.5 KB/sec)
Downloading: http://repo.maven.apache.org/maven2/org/codehaus/plexus/plexus-io/2.0.10/plexus-io-2.0.10.pom
Downloaded: http://repo.maven.apache.org/maven2/org/codehaus/plexus/plexus-io/2.0.10/plexus-io-2.0.10.pom
(3 KB at 113.8 KB/sec)
Downloading: http://repo.maven.apache.org/maven2/org/codehaus/plexus/plexus-archiver/2.4.4/plexus-archiver-2.4.4.jar
Downloading: http://repo.maven.apache.org/maven2/org/codehaus/plexus/plexus-io/2.0.10/plexus-io-2.0.10.jar
Downloaded: http://repo.maven.apache.org/maven2/org/codehaus/plexus/plexus-io/2.0.10/plexus-io-2.0.10.jar
(58 KB at 1171.6 KB/sec)
Downloaded: http://repo.maven.apache.org/maven2/org/codehaus/plexus/plexus-archiver/2.4.4/plexus-archiver-2.4.4.jar
(161 KB at 2541.6 KB/sec)
[INFO] Building jar: <https://builds.apache.org/job/dir-checkstyle-deploy-site/ws/trunk/target/checkstyle-configuration-0.2-SNAPSHOT.jar>
[INFO] 
[INFO] --- maven-site-plugin:3.3:attach-descriptor (attach-descriptor) @ checkstyle-configuration
---
[INFO] 
[INFO] --- tools-maven-plugin:1.4:verify-legal-files (verify-legal-files) @ checkstyle-configuration
---
[INFO] Checking legal files in: checkstyle-configuration-0.2-SNAPSHOT.jar
[INFO] 
[INFO] --- maven-install-plugin:2.5.1:install (default-install) @ checkstyle-configuration
---
[INFO] Installing <https://builds.apache.org/job/dir-checkstyle-deploy-site/ws/trunk/target/checkstyle-configuration-0.2-SNAPSHOT.jar>
to /jenkins/maven-repositories/0/org/apache/directory/buildtools/checkstyle-configuration/0.2-SNAPSHOT/checkstyle-configuration-0.2-SNAPSHOT.jar
[INFO] Installing <https://builds.apache.org/job/dir-checkstyle-deploy-site/ws/trunk/pom.xml>
to /jenkins/maven-repositories/0/org/apache/directory/buildtools/checkstyle-configuration/0.2-SNAPSHOT/checkstyle-configuration-0.2-SNAPSHOT.pom
[INFO] 
[INFO] --- maven-deploy-plugin:2.8.1:deploy (default-deploy) @ checkstyle-configuration ---
Downloading: https://repository.apache.org/content/repositories/snapshots/org/apache/directory/buildtools/checkstyle-configuration/0.2-SNAPSHOT/maven-metadata.xml
[WARNING] Could not transfer metadata org.apache.directory.buildtools:checkstyle-configuration:0.2-SNAPSHOT/maven-metadata.xml
from/to apache.snapshots.https (https://repository.apache.org/content/repositories/snapshots):
Not authorized, ReasonPhrase:Unauthorized.
[INFO] ------------------------------------------------------------------------
[INFO] BUILD FAILURE
[INFO] ------------------------------------------------------------------------
[INFO] Total time: 1:10.749s
[INFO] Finished at: Wed Sep 17 02:02:54 UTC 2014
[INFO] Final Memory: 17M/97M
[INFO] ------------------------------------------------------------------------
Waiting for Jenkins to finish collecting data
[ERROR] Failed to execute goal org.apache.maven.plugins:maven-deploy-plugin:2.8.1:deploy (default-deploy)
on project checkstyle-configuration: Failed to retrieve remote metadata org.apache.directory.buildtools:checkstyle-configuration:0.2-SNAPSHOT/maven-metadata.xml:
Could not transfer metadata org.apache.directory.buildtools:checkstyle-configuration:0.2-SNAPSHOT/maven-metadata.xml
from/to apache.snapshots.https (https://repository.apache.org/content/repositories/snapshots):
Not authorized, ReasonPhrase:Unauthorized. -> [Help 1]
[ERROR] 
[ERROR] To see the full stack trace of the errors, re-run Maven with the -e switch.
[ERROR] Re-run Maven using the -X switch to enable full debug logging.
[ERROR] 
[ERROR] For more information about the errors and possible solutions, please read the following
articles:
[ERROR] [Help 1] http://cwiki.apache.org/confluence/display/MAVEN/MojoExecutionException
[JENKINS] Archiving <https://builds.apache.org/job/dir-checkstyle-deploy-site/ws/trunk/pom.xml>
to org.apache.directory.buildtools/checkstyle-configuration/0.2-SNAPSHOT/checkstyle-configuration-0.2-SNAPSHOT.pom
[JENKINS] Archiving <https://builds.apache.org/job/dir-checkstyle-deploy-site/ws/trunk/target/checkstyle-configuration-0.2-SNAPSHOT.jar>
to org.apache.directory.buildtools/checkstyle-configuration/0.2-SNAPSHOT/checkstyle-configuration-0.2-SNAPSHOT.jar
Sending artifact delta relative to dir-checkstyle-deploy-site ยป Apache Directory Checkstyle
Configuration #1429
Archived 2 artifacts
Archive block size is 32768
Received 0 blocks and 12395 bytes
Compression is 0.0%
Took 1.8 sec
Sending e-mails to: notifications@directory.apache.org
channel stopped

Mime
View raw message