directory-notifications mailing list archives

Site index · List index
Message view « Date » · « Thread »
Top « Date » · « Thread »
From Apache Jenkins Server <jenk...@builds.apache.org>
Subject Build failed in Jenkins: dir-studio-maven-plugin-deploy-site #1436
Date Wed, 17 Sep 2014 03:05:34 GMT
See <https://builds.apache.org/job/dir-studio-maven-plugin-deploy-site/1436/>

------------------------------------------
[...truncated 155 lines...]
Downloaded: http://repo.maven.apache.org/maven2/org/apache/maven/scm/maven-scm-providers-cvs/1.4/maven-scm-providers-cvs-1.4.pom
(2 KB at 83.4 KB/sec)
Downloading: http://repo.maven.apache.org/maven2/org/apache/maven/scm/maven-scm-provider-cvs-commons/1.4/maven-scm-provider-cvs-commons-1.4.pom
Downloaded: http://repo.maven.apache.org/maven2/org/apache/maven/scm/maven-scm-provider-cvs-commons/1.4/maven-scm-provider-cvs-commons-1.4.pom
(3 KB at 111.1 KB/sec)
Downloading: http://repo.maven.apache.org/maven2/org/apache/maven/scm/maven-scm-provider-cvsjava/1.4/maven-scm-provider-cvsjava-1.4.pom
Downloaded: http://repo.maven.apache.org/maven2/org/apache/maven/scm/maven-scm-provider-cvsjava/1.4/maven-scm-provider-cvsjava-1.4.pom
(3 KB at 134.0 KB/sec)
Downloading: http://repo.maven.apache.org/maven2/org/apache/maven/scm/maven-scm-provider-gitexe/1.4/maven-scm-provider-gitexe-1.4.pom
Downloaded: http://repo.maven.apache.org/maven2/org/apache/maven/scm/maven-scm-provider-gitexe/1.4/maven-scm-provider-gitexe-1.4.pom
(3 KB at 116.7 KB/sec)
Downloading: http://repo.maven.apache.org/maven2/org/apache/maven/scm/maven-scm-providers-git/1.4/maven-scm-providers-git-1.4.pom
Downloaded: http://repo.maven.apache.org/maven2/org/apache/maven/scm/maven-scm-providers-git/1.4/maven-scm-providers-git-1.4.pom
(3 KB at 107.9 KB/sec)
Downloading: http://repo.maven.apache.org/maven2/org/apache/maven/scm/maven-scm-provider-git-commons/1.4/maven-scm-provider-git-commons-1.4.pom
Downloaded: http://repo.maven.apache.org/maven2/org/apache/maven/scm/maven-scm-provider-git-commons/1.4/maven-scm-provider-git-commons-1.4.pom
(3 KB at 108.6 KB/sec)
Downloading: http://repo.maven.apache.org/maven2/org/apache/maven/scm/maven-scm-provider-hg/1.4/maven-scm-provider-hg-1.4.pom
Downloaded: http://repo.maven.apache.org/maven2/org/apache/maven/scm/maven-scm-provider-hg/1.4/maven-scm-provider-hg-1.4.pom
(3 KB at 113.7 KB/sec)
Downloading: http://repo.maven.apache.org/maven2/org/apache/maven/scm/maven-scm-provider-perforce/1.4/maven-scm-provider-perforce-1.4.pom
Downloaded: http://repo.maven.apache.org/maven2/org/apache/maven/scm/maven-scm-provider-perforce/1.4/maven-scm-provider-perforce-1.4.pom
(3 KB at 128.4 KB/sec)
Downloading: http://repo.maven.apache.org/maven2/org/apache/maven/scm/maven-scm-provider-starteam/1.4/maven-scm-provider-starteam-1.4.pom
Downloaded: http://repo.maven.apache.org/maven2/org/apache/maven/scm/maven-scm-provider-starteam/1.4/maven-scm-provider-starteam-1.4.pom
(3 KB at 124.0 KB/sec)
Downloading: http://repo.maven.apache.org/maven2/org/apache/maven/scm/maven-scm-provider-synergy/1.4/maven-scm-provider-synergy-1.4.pom
Downloaded: http://repo.maven.apache.org/maven2/org/apache/maven/scm/maven-scm-provider-synergy/1.4/maven-scm-provider-synergy-1.4.pom
(2 KB at 82.8 KB/sec)
Downloading: http://repo.maven.apache.org/maven2/org/apache/maven/scm/maven-scm-provider-vss/1.4/maven-scm-provider-vss-1.4.pom
Downloaded: http://repo.maven.apache.org/maven2/org/apache/maven/scm/maven-scm-provider-vss/1.4/maven-scm-provider-vss-1.4.pom
(3 KB at 125.2 KB/sec)
Downloading: http://repo.maven.apache.org/maven2/org/apache/maven/scm/maven-scm-provider-tfs/1.4/maven-scm-provider-tfs-1.4.pom
Downloaded: http://repo.maven.apache.org/maven2/org/apache/maven/scm/maven-scm-provider-tfs/1.4/maven-scm-provider-tfs-1.4.pom
(3 KB at 107.3 KB/sec)
Downloading: http://repo.maven.apache.org/maven2/org/apache/maven/scm/maven-scm-manager-plexus/1.4/maven-scm-manager-plexus-1.4.pom
Downloaded: http://repo.maven.apache.org/maven2/org/apache/maven/scm/maven-scm-manager-plexus/1.4/maven-scm-manager-plexus-1.4.pom
(3 KB at 105.7 KB/sec)
Downloading: http://repo.maven.apache.org/maven2/org/apache/maven/scm/maven-scm-managers/1.4/maven-scm-managers-1.4.pom
Downloaded: http://repo.maven.apache.org/maven2/org/apache/maven/scm/maven-scm-managers/1.4/maven-scm-managers-1.4.pom
(2 KB at 69.2 KB/sec)
Downloading: http://repo.maven.apache.org/maven2/jaxen/jaxen/1.1-beta-8/jaxen-1.1-beta-8.pom
Downloaded: http://repo.maven.apache.org/maven2/jaxen/jaxen/1.1-beta-8/jaxen-1.1-beta-8.pom
(7 KB at 297.3 KB/sec)
Downloading: http://repo.maven.apache.org/maven2/findbugs/annotations/1.0.0/annotations-1.0.0.pom
Downloaded: http://repo.maven.apache.org/maven2/findbugs/annotations/1.0.0/annotations-1.0.0.pom
(376 B at 17.5 KB/sec)
Downloading: http://repo.maven.apache.org/maven2/org/apache/felix/maven-bundle-plugin/2.1.0/maven-bundle-plugin-2.1.0.jar
Downloading: http://repo.maven.apache.org/maven2/biz/aQute/bndlib/0.0.357/bndlib-0.0.357.jar
Downloading: http://repo.maven.apache.org/maven2/org/apache/felix/org.apache.felix.bundlerepository/1.6.2/org.apache.felix.bundlerepository-1.6.2.jar
Downloading: http://repo.maven.apache.org/maven2/org/apache/maven/maven-artifact-manager/2.0.7/maven-artifact-manager-2.0.7.jar
Downloading: http://repo.maven.apache.org/maven2/org/apache/maven/maven-settings/2.0.7/maven-settings-2.0.7.jar
Downloaded: http://repo.maven.apache.org/maven2/org/apache/maven/maven-artifact-manager/2.0.7/maven-artifact-manager-2.0.7.jar
(56 KB at 904.7 KB/sec)
Downloading: http://repo.maven.apache.org/maven2/org/apache/maven/wagon/wagon-provider-api/1.0-beta-2/wagon-provider-api-1.0-beta-2.jar
Downloaded: http://repo.maven.apache.org/maven2/org/apache/maven/maven-settings/2.0.7/maven-settings-2.0.7.jar
(48 KB at 737.9 KB/sec)
Downloading: http://repo.maven.apache.org/maven2/org/apache/maven/release/maven-release-manager/2.1/maven-release-manager-2.1.jar
Downloaded: http://repo.maven.apache.org/maven2/biz/aQute/bndlib/0.0.357/bndlib-0.0.357.jar
(273 KB at 3891.7 KB/sec)
Downloading: http://repo.maven.apache.org/maven2/commons-logging/commons-logging/1.0/commons-logging-1.0.jar
Downloaded: http://repo.maven.apache.org/maven2/org/apache/felix/org.apache.felix.bundlerepository/1.6.2/org.apache.felix.bundlerepository-1.6.2.jar
(147 KB at 2013.6 KB/sec)
Downloading: http://repo.maven.apache.org/maven2/org/apache/maven/scm/maven-scm-provider-accurev/1.4/maven-scm-provider-accurev-1.4.jar
Downloaded: http://repo.maven.apache.org/maven2/org/apache/felix/maven-bundle-plugin/2.1.0/maven-bundle-plugin-2.1.0.jar
(130 KB at 1725.2 KB/sec)
Downloading: http://repo.maven.apache.org/maven2/org/apache/maven/scm/maven-scm-provider-bazaar/1.4/maven-scm-provider-bazaar-1.4.jar
Downloaded: http://repo.maven.apache.org/maven2/org/apache/maven/wagon/wagon-provider-api/1.0-beta-2/wagon-provider-api-1.0-beta-2.jar
(46 KB at 1809.6 KB/sec)
Downloading: http://repo.maven.apache.org/maven2/org/apache/maven/scm/maven-scm-provider-clearcase/1.4/maven-scm-provider-clearcase-1.4.jar
Downloaded: http://repo.maven.apache.org/maven2/commons-logging/commons-logging/1.0/commons-logging-1.0.jar
(22 KB at 1128.2 KB/sec)
Downloading: http://repo.maven.apache.org/maven2/org/apache/maven/scm/maven-scm-provider-cvsexe/1.4/maven-scm-provider-cvsexe-1.4.jar
Downloaded: http://repo.maven.apache.org/maven2/org/apache/maven/scm/maven-scm-provider-bazaar/1.4/maven-scm-provider-bazaar-1.4.jar
(53 KB at 2175.4 KB/sec)
Downloading: http://repo.maven.apache.org/maven2/org/apache/maven/scm/maven-scm-provider-cvs-commons/1.4/maven-scm-provider-cvs-commons-1.4.jar
Downloaded: http://repo.maven.apache.org/maven2/org/apache/maven/scm/maven-scm-provider-accurev/1.4/maven-scm-provider-accurev-1.4.jar
(89 KB at 3398.5 KB/sec)
Downloading: http://repo.maven.apache.org/maven2/org/apache/maven/scm/maven-scm-provider-cvsjava/1.4/maven-scm-provider-cvsjava-1.4.jar
Downloaded: http://repo.maven.apache.org/maven2/org/apache/maven/release/maven-release-manager/2.1/maven-release-manager-2.1.jar
(156 KB at 3607.3 KB/sec)
Downloading: http://repo.maven.apache.org/maven2/org/apache/maven/scm/maven-scm-provider-gitexe/1.4/maven-scm-provider-gitexe-1.4.jar
Downloaded: http://repo.maven.apache.org/maven2/org/apache/maven/scm/maven-scm-provider-cvsexe/1.4/maven-scm-provider-cvsexe-1.4.jar
(30 KB at 1160.4 KB/sec)
Downloading: http://repo.maven.apache.org/maven2/org/apache/maven/scm/maven-scm-provider-git-commons/1.4/maven-scm-provider-git-commons-1.4.jar
Downloaded: http://repo.maven.apache.org/maven2/org/apache/maven/scm/maven-scm-provider-clearcase/1.4/maven-scm-provider-clearcase-1.4.jar
(68 KB at 2193.5 KB/sec)
Downloading: http://repo.maven.apache.org/maven2/org/apache/maven/scm/maven-scm-provider-hg/1.4/maven-scm-provider-hg-1.4.jar
Downloaded: http://repo.maven.apache.org/maven2/org/apache/maven/scm/maven-scm-provider-cvsjava/1.4/maven-scm-provider-cvsjava-1.4.jar
(43 KB at 2224.8 KB/sec)
Downloading: http://repo.maven.apache.org/maven2/org/apache/maven/scm/maven-scm-provider-perforce/1.4/maven-scm-provider-perforce-1.4.jar
Downloaded: http://repo.maven.apache.org/maven2/org/apache/maven/scm/maven-scm-provider-cvs-commons/1.4/maven-scm-provider-cvs-commons-1.4.jar
(77 KB at 2938.6 KB/sec)
Downloading: http://repo.maven.apache.org/maven2/org/apache/maven/scm/maven-scm-provider-starteam/1.4/maven-scm-provider-starteam-1.4.jar
Downloaded: http://repo.maven.apache.org/maven2/org/apache/maven/scm/maven-scm-provider-gitexe/1.4/maven-scm-provider-gitexe-1.4.jar
(52 KB at 1963.3 KB/sec)
Downloading: http://repo.maven.apache.org/maven2/org/apache/maven/scm/maven-scm-provider-synergy/1.4/maven-scm-provider-synergy-1.4.jar
Downloaded: http://repo.maven.apache.org/maven2/org/apache/maven/scm/maven-scm-provider-git-commons/1.4/maven-scm-provider-git-commons-1.4.jar
(38 KB at 1498.8 KB/sec)
Downloading: http://repo.maven.apache.org/maven2/org/apache/maven/scm/maven-scm-provider-vss/1.4/maven-scm-provider-vss-1.4.jar
Downloaded: http://repo.maven.apache.org/maven2/org/apache/maven/scm/maven-scm-provider-hg/1.4/maven-scm-provider-hg-1.4.jar
(54 KB at 1729.7 KB/sec)
Downloaded: http://repo.maven.apache.org/maven2/org/apache/maven/scm/maven-scm-provider-perforce/1.4/maven-scm-provider-perforce-1.4.jar
(78 KB at 2594.4 KB/sec)
Downloading: http://repo.maven.apache.org/maven2/org/apache/maven/scm/maven-scm-provider-tfs/1.4/maven-scm-provider-tfs-1.4.jar
Downloading: http://repo.maven.apache.org/maven2/org/apache/maven/scm/maven-scm-manager-plexus/1.4/maven-scm-manager-plexus-1.4.jar
Downloaded: http://repo.maven.apache.org/maven2/org/apache/maven/scm/maven-scm-provider-starteam/1.4/maven-scm-provider-starteam-1.4.jar
(72 KB at 2852.9 KB/sec)
Downloading: http://repo.maven.apache.org/maven2/jaxen/jaxen/1.1-beta-8/jaxen-1.1-beta-8.jar
Downloaded: http://repo.maven.apache.org/maven2/org/apache/maven/scm/maven-scm-manager-plexus/1.4/maven-scm-manager-plexus-1.4.jar
(11 KB at 540.5 KB/sec)
Downloading: http://repo.maven.apache.org/maven2/org/apache/maven/maven-core/2.2.1/maven-core-2.2.1.jar
Downloaded: http://repo.maven.apache.org/maven2/org/apache/maven/scm/maven-scm-provider-tfs/1.4/maven-scm-provider-tfs-1.4.jar
(41 KB at 2112.7 KB/sec)
Downloading: http://repo.maven.apache.org/maven2/org/apache/maven/wagon/wagon-file/1.0-beta-6/wagon-file-1.0-beta-6.jar
Downloaded: http://repo.maven.apache.org/maven2/org/apache/maven/scm/maven-scm-provider-synergy/1.4/maven-scm-provider-synergy-1.4.jar
(51 KB at 1582.5 KB/sec)
Downloading: http://repo.maven.apache.org/maven2/org/apache/maven/maven-plugin-parameter-documenter/2.2.1/maven-plugin-parameter-documenter-2.2.1.jar
Downloaded: http://repo.maven.apache.org/maven2/org/apache/maven/scm/maven-scm-provider-vss/1.4/maven-scm-provider-vss-1.4.jar
(67 KB at 2073.6 KB/sec)
Downloading: http://repo.maven.apache.org/maven2/org/apache/maven/wagon/wagon-http-lightweight/1.0-beta-6/wagon-http-lightweight-1.0-beta-6.jar
Downloaded: http://repo.maven.apache.org/maven2/org/apache/maven/wagon/wagon-file/1.0-beta-6/wagon-file-1.0-beta-6.jar
(11 KB at 567.5 KB/sec)
Downloading: http://repo.maven.apache.org/maven2/org/apache/maven/wagon/wagon-http-shared/1.0-beta-6/wagon-http-shared-1.0-beta-6.jar
Downloaded: http://repo.maven.apache.org/maven2/org/apache/maven/maven-plugin-parameter-documenter/2.2.1/maven-plugin-parameter-documenter-2.2.1.jar
(22 KB at 1140.6 KB/sec)
Downloading: http://repo.maven.apache.org/maven2/nekohtml/xercesMinimal/1.9.6.2/xercesMinimal-1.9.6.2.jar
Downloaded: http://repo.maven.apache.org/maven2/org/apache/maven/wagon/wagon-http-lightweight/1.0-beta-6/wagon-http-lightweight-1.0-beta-6.jar
(15 KB at 762.7 KB/sec)
Downloading: http://repo.maven.apache.org/maven2/nekohtml/nekohtml/1.9.6.2/nekohtml-1.9.6.2.jar
Downloaded: http://repo.maven.apache.org/maven2/jaxen/jaxen/1.1-beta-8/jaxen-1.1-beta-8.jar
(227 KB at 5656.9 KB/sec)
Downloading: http://repo.maven.apache.org/maven2/org/apache/maven/wagon/wagon-http/1.0-beta-6/wagon-http-1.0-beta-6.jar
Downloaded: http://repo.maven.apache.org/maven2/org/apache/maven/maven-core/2.2.1/maven-core-2.2.1.jar
(174 KB at 4571.5 KB/sec)
Downloading: http://repo.maven.apache.org/maven2/org/apache/maven/wagon/wagon-webdav-jackrabbit/1.0-beta-6/wagon-webdav-jackrabbit-1.0-beta-6.jar
Downloaded: http://repo.maven.apache.org/maven2/org/apache/maven/wagon/wagon-http/1.0-beta-6/wagon-http-1.0-beta-6.jar
(11 KB at 570.3 KB/sec)
Downloaded: http://repo.maven.apache.org/maven2/org/apache/maven/wagon/wagon-http-shared/1.0-beta-6/wagon-http-shared-1.0-beta-6.jar
(25 KB at 1177.7 KB/sec)
Downloading: http://repo.maven.apache.org/maven2/org/apache/jackrabbit/jackrabbit-webdav/1.5.0/jackrabbit-webdav-1.5.0.jar
Downloading: http://repo.maven.apache.org/maven2/org/apache/jackrabbit/jackrabbit-jcr-commons/1.5.0/jackrabbit-jcr-commons-1.5.0.jar
Downloaded: http://repo.maven.apache.org/maven2/nekohtml/xercesMinimal/1.9.6.2/xercesMinimal-1.9.6.2.jar
(39 KB at 1850.7 KB/sec)
Downloading: http://repo.maven.apache.org/maven2/commons-httpclient/commons-httpclient/3.0/commons-httpclient-3.0.jar
Downloaded: http://repo.maven.apache.org/maven2/org/apache/maven/wagon/wagon-webdav-jackrabbit/1.0-beta-6/wagon-webdav-jackrabbit-1.0-beta-6.jar
(18 KB at 940.1 KB/sec)
Downloading: http://repo.maven.apache.org/maven2/org/slf4j/slf4j-nop/1.5.3/slf4j-nop-1.5.3.jar
Downloaded: http://repo.maven.apache.org/maven2/nekohtml/nekohtml/1.9.6.2/nekohtml-1.9.6.2.jar
(110 KB at 2874.9 KB/sec)
Downloading: http://repo.maven.apache.org/maven2/org/apache/maven/maven-error-diagnostics/2.2.1/maven-error-diagnostics-2.2.1.jar
Downloaded: http://repo.maven.apache.org/maven2/org/apache/jackrabbit/jackrabbit-jcr-commons/1.5.0/jackrabbit-jcr-commons-1.5.0.jar
(199 KB at 6187.7 KB/sec)
Downloading: http://repo.maven.apache.org/maven2/org/apache/maven/wagon/wagon-ssh-external/1.0-beta-6/wagon-ssh-external-1.0-beta-6.jar
Downloaded: http://repo.maven.apache.org/maven2/org/slf4j/slf4j-nop/1.5.3/slf4j-nop-1.5.3.jar
(6 KB at 298.8 KB/sec)
Downloading: http://repo.maven.apache.org/maven2/org/apache/maven/maven-monitor/2.2.1/maven-monitor-2.2.1.jar
Downloaded: http://repo.maven.apache.org/maven2/org/apache/maven/maven-error-diagnostics/2.2.1/maven-error-diagnostics-2.2.1.jar
(13 KB at 706.5 KB/sec)
Downloading: http://repo.maven.apache.org/maven2/findbugs/annotations/1.0.0/annotations-1.0.0.jar
Downloaded: http://repo.maven.apache.org/maven2/org/apache/jackrabbit/jackrabbit-webdav/1.5.0/jackrabbit-webdav-1.5.0.jar
(296 KB at 5919.6 KB/sec)
Downloaded: http://repo.maven.apache.org/maven2/org/apache/maven/wagon/wagon-ssh-external/1.0-beta-6/wagon-ssh-external-1.0-beta-6.jar
(15 KB at 785.4 KB/sec)
Downloaded: http://repo.maven.apache.org/maven2/org/apache/maven/maven-monitor/2.2.1/maven-monitor-2.2.1.jar
(11 KB at 567.3 KB/sec)
Downloaded: http://repo.maven.apache.org/maven2/commons-httpclient/commons-httpclient/3.0/commons-httpclient-3.0.jar
(273 KB at 5246.8 KB/sec)
Downloaded: http://repo.maven.apache.org/maven2/findbugs/annotations/1.0.0/annotations-1.0.0.jar
(27 KB at 1406.5 KB/sec)
[INFO] 
[INFO] --- maven-clean-plugin:2.4.1:clean (default-clean) @ studio-maven-plugin ---
[INFO] 
[INFO] --- maven-plugin-plugin:2.9:descriptor (default-descriptor) @ studio-maven-plugin ---
Downloading: http://repo.maven.apache.org/maven2/org/apache/maven/plugin-tools/maven-plugin-tools-api/2.9/maven-plugin-tools-api-2.9.pom
Downloaded: http://repo.maven.apache.org/maven2/org/apache/maven/plugin-tools/maven-plugin-tools-api/2.9/maven-plugin-tools-api-2.9.pom
(5 KB at 61.0 KB/sec)
Downloading: http://repo.maven.apache.org/maven2/org/apache/maven/plugin-tools/maven-plugin-tools/2.9/maven-plugin-tools-2.9.pom
Downloaded: http://repo.maven.apache.org/maven2/org/apache/maven/plugin-tools/maven-plugin-tools/2.9/maven-plugin-tools-2.9.pom
(10 KB at 269.2 KB/sec)
Downloading: http://repo.maven.apache.org/maven2/org/apache/maven/plugin-tools/maven-plugin-tools-java/2.9/maven-plugin-tools-java-2.9.pom
Downloaded: http://repo.maven.apache.org/maven2/org/apache/maven/plugin-tools/maven-plugin-tools-java/2.9/maven-plugin-tools-java-2.9.pom
(3 KB at 78.1 KB/sec)
Downloading: http://repo.maven.apache.org/maven2/com/thoughtworks/qdox/qdox/1.11/qdox-1.11.pom
Downloaded: http://repo.maven.apache.org/maven2/com/thoughtworks/qdox/qdox/1.11/qdox-1.11.pom
(19 KB at 354.0 KB/sec)
Downloading: http://repo.maven.apache.org/maven2/org/apache/maven/plugin-tools/maven-plugin-tools-beanshell/2.9/maven-plugin-tools-beanshell-2.9.pom
Downloaded: http://repo.maven.apache.org/maven2/org/apache/maven/plugin-tools/maven-plugin-tools-beanshell/2.9/maven-plugin-tools-beanshell-2.9.pom
(3 KB at 59.9 KB/sec)
Downloading: http://repo.maven.apache.org/maven2/org/apache/maven/plugin-tools/maven-plugin-tools-api/2.9/maven-plugin-tools-api-2.9.jar
Downloading: http://repo.maven.apache.org/maven2/com/thoughtworks/qdox/qdox/1.11/qdox-1.11.jar
Downloading: http://repo.maven.apache.org/maven2/org/apache/maven/plugin-tools/maven-plugin-tools-beanshell/2.9/maven-plugin-tools-beanshell-2.9.jar
Downloading: http://repo.maven.apache.org/maven2/org/apache/maven/plugin-tools/maven-plugin-tools-java/2.9/maven-plugin-tools-java-2.9.jar
Downloaded: http://repo.maven.apache.org/maven2/org/apache/maven/plugin-tools/maven-plugin-tools-api/2.9/maven-plugin-tools-api-2.9.jar
(56 KB at 734.5 KB/sec)
Downloaded: http://repo.maven.apache.org/maven2/org/apache/maven/plugin-tools/maven-plugin-tools-java/2.9/maven-plugin-tools-java-2.9.jar
(17 KB at 242.4 KB/sec)
Downloaded: http://repo.maven.apache.org/maven2/org/apache/maven/plugin-tools/maven-plugin-tools-beanshell/2.9/maven-plugin-tools-beanshell-2.9.jar
(14 KB at 174.5 KB/sec)
Downloaded: http://repo.maven.apache.org/maven2/com/thoughtworks/qdox/qdox/1.11/qdox-1.11.jar
(172 KB at 1184.1 KB/sec)
[INFO] Using 'UTF-8' encoding to read mojo metadata.
[INFO] Applying mojo extractor for language: java
[INFO] Mojo extractor for language: java found 6 mojo descriptors.
[INFO] Applying mojo extractor for language: bsh
[INFO] Mojo extractor for language: bsh found 0 mojo descriptors.
[INFO] 
[INFO] --- maven-remote-resources-plugin:1.2.1:process (default) @ studio-maven-plugin ---
[INFO] 
[INFO] --- maven-resources-plugin:2.5:resources (default-resources) @ studio-maven-plugin
---
[debug] execute contextualize
[INFO] Using 'UTF-8' encoding to copy filtered resources.
[INFO] skip non existing resourceDirectory <https://builds.apache.org/job/dir-studio-maven-plugin-deploy-site/ws/trunk/src/main/resources>
[INFO] Copying 3 resources
[INFO] 
[INFO] --- maven-compiler-plugin:2.3.2:compile (default-compile) @ studio-maven-plugin ---
[INFO] Compiling 8 source files to <https://builds.apache.org/job/dir-studio-maven-plugin-deploy-site/ws/trunk/target/classes>
[INFO] 
[INFO] --- maven-resources-plugin:2.5:testResources (default-testResources) @ studio-maven-plugin
---
[debug] execute contextualize
[INFO] Using 'UTF-8' encoding to copy filtered resources.
[INFO] Copying 16 resources
[INFO] Copying 3 resources
[INFO] 
[INFO] --- maven-compiler-plugin:2.3.2:testCompile (default-testCompile) @ studio-maven-plugin
---
[INFO] Compiling 6 source files to <https://builds.apache.org/job/dir-studio-maven-plugin-deploy-site/ws/trunk/target/test-classes>
[INFO] 
[INFO] --- maven-surefire-plugin:2.10:test (default-test) @ studio-maven-plugin ---
Downloading: http://repo.maven.apache.org/maven2/org/apache/maven/surefire/surefire-booter/2.10/surefire-booter-2.10.pom
Downloaded: http://repo.maven.apache.org/maven2/org/apache/maven/surefire/surefire-booter/2.10/surefire-booter-2.10.pom
(3 KB at 79.9 KB/sec)
Downloading: http://repo.maven.apache.org/maven2/org/apache/maven/surefire/surefire-api/2.10/surefire-api-2.10.pom
Downloaded: http://repo.maven.apache.org/maven2/org/apache/maven/surefire/surefire-api/2.10/surefire-api-2.10.pom
(3 KB at 62.0 KB/sec)
Downloading: http://repo.maven.apache.org/maven2/org/apache/maven/surefire/maven-surefire-common/2.10/maven-surefire-common-2.10.pom
Downloaded: http://repo.maven.apache.org/maven2/org/apache/maven/surefire/maven-surefire-common/2.10/maven-surefire-common-2.10.pom
(4 KB at 108.8 KB/sec)
Downloading: http://repo.maven.apache.org/maven2/org/apache/maven/surefire/surefire-booter/2.10/surefire-booter-2.10.jar
Downloading: http://repo.maven.apache.org/maven2/org/apache/maven/surefire/surefire-api/2.10/surefire-api-2.10.jar
Downloading: http://repo.maven.apache.org/maven2/org/apache/maven/surefire/maven-surefire-common/2.10/maven-surefire-common-2.10.jar
Downloaded: http://repo.maven.apache.org/maven2/org/apache/maven/surefire/surefire-booter/2.10/surefire-booter-2.10.jar
(34 KB at 893.5 KB/sec)
Downloaded: http://repo.maven.apache.org/maven2/org/apache/maven/surefire/maven-surefire-common/2.10/maven-surefire-common-2.10.jar
(60 KB at 702.6 KB/sec)
Downloaded: http://repo.maven.apache.org/maven2/org/apache/maven/surefire/surefire-api/2.10/surefire-api-2.10.jar
(158 KB at 1559.9 KB/sec)
[INFO] Surefire report directory: <https://builds.apache.org/job/dir-studio-maven-plugin-deploy-site/ws/trunk/target/surefire-reports>
Downloading: http://repo.maven.apache.org/maven2/org/apache/maven/surefire/surefire-junit3/2.10/surefire-junit3-2.10.pom
Downloaded: http://repo.maven.apache.org/maven2/org/apache/maven/surefire/surefire-junit3/2.10/surefire-junit3-2.10.pom
(2 KB at 46.3 KB/sec)
Downloading: http://repo.maven.apache.org/maven2/org/apache/maven/surefire/surefire-providers/2.10/surefire-providers-2.10.pom
Downloaded: http://repo.maven.apache.org/maven2/org/apache/maven/surefire/surefire-providers/2.10/surefire-providers-2.10.pom
(3 KB at 59.8 KB/sec)
Downloading: http://repo.maven.apache.org/maven2/org/apache/maven/surefire/surefire-junit3/2.10/surefire-junit3-2.10.jar
Downloaded: http://repo.maven.apache.org/maven2/org/apache/maven/surefire/surefire-junit3/2.10/surefire-junit3-2.10.jar
(26 KB at 709.1 KB/sec)

-------------------------------------------------------
 T E S T S
-------------------------------------------------------

Results :

Tests run: 0, Failures: 0, Errors: 0, Skipped: 0

[JENKINS] Recording test results
[INFO] 
[INFO] --- maven-jar-plugin:2.3.2:jar (default-jar) @ studio-maven-plugin ---
Downloading: http://repo.maven.apache.org/maven2/org/codehaus/plexus/plexus-archiver/2.0.1/plexus-archiver-2.0.1.jar
Downloaded: http://repo.maven.apache.org/maven2/org/codehaus/plexus/plexus-archiver/2.0.1/plexus-archiver-2.0.1.jar
(176 KB at 2042.9 KB/sec)
[INFO] Building jar: <https://builds.apache.org/job/dir-studio-maven-plugin-deploy-site/ws/trunk/target/studio-maven-plugin-1.0.6-SNAPSHOT.jar>
[INFO] 
[INFO] --- maven-plugin-plugin:2.9:addPluginArtifactMetadata (default-addPluginArtifactMetadata)
@ studio-maven-plugin ---
[WARNING] Failed to getClass for org.apache.maven.plugin.source.SourceJarMojo
[INFO] 
[INFO] --- maven-source-plugin:2.1.2:jar (attach-sources) @ studio-maven-plugin ---
[INFO] META-INF already added, skipping
[INFO] META-INF/LICENSE already added, skipping
[INFO] META-INF/NOTICE already added, skipping
[INFO] META-INF/DEPENDENCIES already added, skipping
[INFO] Building jar: <https://builds.apache.org/job/dir-studio-maven-plugin-deploy-site/ws/trunk/target/studio-maven-plugin-1.0.6-SNAPSHOT-sources.jar>
[INFO] META-INF already added, skipping
[INFO] META-INF/LICENSE already added, skipping
[INFO] META-INF/NOTICE already added, skipping
[INFO] META-INF/DEPENDENCIES already added, skipping
[INFO] 
[INFO] --- tools-maven-plugin:1.4:verify-legal-files (verify-legal-files) @ studio-maven-plugin
---
[INFO] Checking legal files in: studio-maven-plugin-1.0.6-SNAPSHOT.jar
[INFO] Checking legal files in: studio-maven-plugin-1.0.6-SNAPSHOT-sources.jar
[INFO] 
[INFO] --- maven-install-plugin:2.3.1:install (default-install) @ studio-maven-plugin ---
[INFO] Installing <https://builds.apache.org/job/dir-studio-maven-plugin-deploy-site/ws/trunk/target/studio-maven-plugin-1.0.6-SNAPSHOT.jar>
to /jenkins/maven-repositories/0/org/apache/directory/studio/studio-maven-plugin/1.0.6-SNAPSHOT/studio-maven-plugin-1.0.6-SNAPSHOT.jar
[INFO] Installing <https://builds.apache.org/job/dir-studio-maven-plugin-deploy-site/ws/trunk/pom.xml>
to /jenkins/maven-repositories/0/org/apache/directory/studio/studio-maven-plugin/1.0.6-SNAPSHOT/studio-maven-plugin-1.0.6-SNAPSHOT.pom
[INFO] Installing <https://builds.apache.org/job/dir-studio-maven-plugin-deploy-site/ws/trunk/target/studio-maven-plugin-1.0.6-SNAPSHOT-sources.jar>
to /jenkins/maven-repositories/0/org/apache/directory/studio/studio-maven-plugin/1.0.6-SNAPSHOT/studio-maven-plugin-1.0.6-SNAPSHOT-sources.jar
[INFO] 
[INFO] --- maven-deploy-plugin:2.7:deploy (default-deploy) @ studio-maven-plugin ---
Downloading: https://repository.apache.org/content/repositories/snapshots/org/apache/directory/studio/studio-maven-plugin/1.0.6-SNAPSHOT/maven-metadata.xml
[WARNING] Could not transfer metadata org.apache.directory.studio:studio-maven-plugin:1.0.6-SNAPSHOT/maven-metadata.xml
from/to apache.snapshots.https (https://repository.apache.org/content/repositories/snapshots):
Not authorized, ReasonPhrase:Unauthorized.
[INFO] ------------------------------------------------------------------------
[INFO] BUILD FAILURE
[INFO] ------------------------------------------------------------------------
[INFO] Total time: 1:31.787s
[INFO] Finished at: Wed Sep 17 03:05:21 UTC 2014
[INFO] Final Memory: 30M/206M
[INFO] ------------------------------------------------------------------------
Waiting for Jenkins to finish collecting data
[ERROR] Failed to execute goal org.apache.maven.plugins:maven-deploy-plugin:2.7:deploy (default-deploy)
on project studio-maven-plugin: Failed to retrieve remote metadata org.apache.directory.studio:studio-maven-plugin:1.0.6-SNAPSHOT/maven-metadata.xml:
Could not transfer metadata org.apache.directory.studio:studio-maven-plugin:1.0.6-SNAPSHOT/maven-metadata.xml
from/to apache.snapshots.https (https://repository.apache.org/content/repositories/snapshots):
Not authorized, ReasonPhrase:Unauthorized. -> [Help 1]
[ERROR] 
[ERROR] To see the full stack trace of the errors, re-run Maven with the -e switch.
[ERROR] Re-run Maven using the -X switch to enable full debug logging.
[ERROR] 
[ERROR] For more information about the errors and possible solutions, please read the following
articles:
[ERROR] [Help 1] http://cwiki.apache.org/confluence/display/MAVEN/MojoExecutionException
[JENKINS] Archiving <https://builds.apache.org/job/dir-studio-maven-plugin-deploy-site/ws/trunk/pom.xml>
to org.apache.directory.studio/studio-maven-plugin/1.0.6-SNAPSHOT/studio-maven-plugin-1.0.6-SNAPSHOT.pom
[JENKINS] Archiving <https://builds.apache.org/job/dir-studio-maven-plugin-deploy-site/ws/trunk/target/studio-maven-plugin-1.0.6-SNAPSHOT.jar>
to org.apache.directory.studio/studio-maven-plugin/1.0.6-SNAPSHOT/studio-maven-plugin-1.0.6-SNAPSHOT.jar
[JENKINS] Archiving <https://builds.apache.org/job/dir-studio-maven-plugin-deploy-site/ws/trunk/target/studio-maven-plugin-1.0.6-SNAPSHOT-sources.jar>
to org.apache.directory.studio/studio-maven-plugin/1.0.6-SNAPSHOT/studio-maven-plugin-1.0.6-SNAPSHOT-sources.jar
Sending artifact delta relative to dir-studio-maven-plugin-deploy-site ยป Apache Directory
Studio Plugin #1435
Archived 3 artifacts
Archive block size is 32768
Received 0 blocks and 72915 bytes
Compression is 0.0%
Took 0.54 sec
Sending e-mails to: notifications@directory.apache.org
channel stopped

Mime
View raw message