directory-notifications mailing list archives

Site index · List index
Message view « Date » · « Thread »
Top « Date » · « Thread »
From Apache Jenkins Server <jenk...@builds.apache.org>
Subject Build failed in Jenkins: dir-project-deploy #1413
Date Wed, 17 Sep 2014 01:02:46 GMT
See <https://builds.apache.org/job/dir-project-deploy/1413/>

------------------------------------------
Started by timer
Building remotely on jenkins-ubuntu-1404-4gb-d05 (jenkins-cloud-4GB Ubuntu ubuntu) in workspace
<https://builds.apache.org/job/dir-project-deploy/ws/>
Checking out a fresh workspace because <https://builds.apache.org/job/dir-project-deploy/ws/trunk>
doesn't exist
Cleaning local Directory trunk
Checking out https://svn.apache.org/repos/asf/directory/project/trunk at revision '2014-09-17T01:00:39.748
+0000'
A         src
A         src/site
A         src/site/site.xml
A         pom.xml
A         resources
AU        resources/pommodules.sh
AU        resources/pomgroupId.sh
AU        resources/generate_modules_index_xdoc.sh
AU        resources/pomartifactId.sh
AU        resources/pomdistSiteUrl.sh
AU        resources/pomdesc.sh
AU        resources/pomname.sh
A         resources/dictionary
A         resources/Reveal in Finder.launch
AU        resources/IntelliJIDEA60-apacheds.xml
A         resources/formatting.xml
AU        resources/deps-versions.sh
AU        resources/superclean.sh
AU        resources/codesize.sh
A         resources/doap_Directory.rdf
AU        resources/gpg-sign-all
AU        resources/svn_ignore.sh
A         resources/svn_ignore.txt
A         resources/codetemplates.xml
AU        resources/create_branch.sh
AU        resources/plugin-version.sh
A         README.txt
A         NOTICE.txt
A         LICENSE.txt
 U        .
At revision 1625443
no change for https://svn.apache.org/repos/asf/directory/project/trunk since the previous
build
Parsing POMs
maven3-agent.jar already up to date
maven3-interceptor.jar already up to date
maven3-interceptor-commons.jar already up to date
[trunk] $ /home/jenkins/tools/java/latest1.7/bin/java -Xmx512m -XX:MaxPermSize=128m -cp /jenkins/maven3-agent.jar:/home/jenkins/tools/maven/apache-maven-3.0.4/boot/plexus-classworlds-2.4.jar
org.jvnet.hudson.maven3.agent.Maven3Main /home/jenkins/tools/maven/apache-maven-3.0.4 /tmp/slave.jar
/jenkins/maven3-interceptor.jar /jenkins/maven3-interceptor-commons.jar 37614
<===[JENKINS REMOTING CAPACITY]===>   channel started
log4j:WARN No appenders could be found for logger (org.apache.commons.beanutils.converters.BooleanConverter).
log4j:WARN Please initialize the log4j system properly.
Executing Maven:  -B -f <https://builds.apache.org/job/dir-project-deploy/ws/trunk/pom.xml>
-Dmaven.repo.local=/jenkins/maven-repositories/0 -V clean deploy
Apache Maven 3.0.4 (r1232337; 2012-01-17 08:44:56+0000)
Maven home: /home/jenkins/tools/maven/apache-maven-3.0.4
Java version: 1.7.0_25, vendor: Oracle Corporation
Java home: /home/jenkins/tools/java/jdk1.7.0_25-32/jre
Default locale: en_US, platform encoding: UTF-8
OS name: "linux", version: "3.13.0-30-generic", arch: "i386", family: "unix"
[INFO] Scanning for projects...
Downloading: http://repo.maven.apache.org/maven2/org/apache/felix/maven-bundle-plugin/2.5.0/maven-bundle-plugin-2.5.0.pom
Downloaded: http://repo.maven.apache.org/maven2/org/apache/felix/maven-bundle-plugin/2.5.0/maven-bundle-plugin-2.5.0.pom
(5 KB at 27.3 KB/sec)
Downloading: http://repo.maven.apache.org/maven2/biz/aQute/bnd/bndlib/2.3.0/bndlib-2.3.0.pom
Downloaded: http://repo.maven.apache.org/maven2/biz/aQute/bnd/bndlib/2.3.0/bndlib-2.3.0.pom
(2 KB at 66.2 KB/sec)
Downloading: http://repo.maven.apache.org/maven2/biz/aQute/bnd/parent/2.3.0/parent-2.3.0.pom
Downloaded: http://repo.maven.apache.org/maven2/biz/aQute/bnd/parent/2.3.0/parent-2.3.0.pom
(5 KB at 192.9 KB/sec)
Downloading: http://repo.maven.apache.org/maven2/org/osgi/org.osgi.core/4.3.1/org.osgi.core-4.3.1.pom
Downloaded: http://repo.maven.apache.org/maven2/org/osgi/org.osgi.core/4.3.1/org.osgi.core-4.3.1.pom
(2 KB at 69.0 KB/sec)
Downloading: http://repo.maven.apache.org/maven2/org/apache/felix/org.apache.felix.utils/1.6.0/org.apache.felix.utils-1.6.0.pom
Downloaded: http://repo.maven.apache.org/maven2/org/apache/felix/org.apache.felix.utils/1.6.0/org.apache.felix.utils-1.6.0.pom
(4 KB at 145.4 KB/sec)
Downloading: http://repo.maven.apache.org/maven2/org/osgi/org.osgi.compendium/4.2.0/org.osgi.compendium-4.2.0.pom
Downloaded: http://repo.maven.apache.org/maven2/org/osgi/org.osgi.compendium/4.2.0/org.osgi.compendium-4.2.0.pom
(463 B at 21.5 KB/sec)
Downloading: http://repo.maven.apache.org/maven2/org/apache/felix/maven-bundle-plugin/2.5.0/maven-bundle-plugin-2.5.0.jar
Downloading: http://repo.maven.apache.org/maven2/biz/aQute/bnd/bndlib/2.3.0/bndlib-2.3.0.jar
Downloading: http://repo.maven.apache.org/maven2/org/osgi/org.osgi.core/4.3.1/org.osgi.core-4.3.1.jar
Downloading: http://repo.maven.apache.org/maven2/org/osgi/org.osgi.compendium/4.2.0/org.osgi.compendium-4.2.0.jar
Downloading: http://repo.maven.apache.org/maven2/org/apache/felix/org.apache.felix.utils/1.6.0/org.apache.felix.utils-1.6.0.jar
Downloaded: http://repo.maven.apache.org/maven2/org/apache/felix/maven-bundle-plugin/2.5.0/maven-bundle-plugin-2.5.0.jar
(171 KB at 2628.7 KB/sec)
Downloaded: http://repo.maven.apache.org/maven2/org/apache/felix/org.apache.felix.utils/1.6.0/org.apache.felix.utils-1.6.0.jar
(67 KB at 1119.3 KB/sec)
Downloaded: http://repo.maven.apache.org/maven2/org/osgi/org.osgi.core/4.3.1/org.osgi.core-4.3.1.jar
(342 KB at 3384.0 KB/sec)
Downloaded: http://repo.maven.apache.org/maven2/org/osgi/org.osgi.compendium/4.2.0/org.osgi.compendium-4.2.0.jar
(600 KB at 5040.0 KB/sec)
Downloaded: http://repo.maven.apache.org/maven2/biz/aQute/bnd/bndlib/2.3.0/bndlib-2.3.0.jar
(1744 KB at 11037.9 KB/sec)
[INFO]                                                                         
[INFO] ------------------------------------------------------------------------
[INFO] Building Apache Directory Project 33-SNAPSHOT
[INFO] ------------------------------------------------------------------------
Downloading: http://repo.maven.apache.org/maven2/org/apache/geronimo/genesis/plugins/tools-maven-plugin/1.4/tools-maven-plugin-1.4.pom
Downloaded: http://repo.maven.apache.org/maven2/org/apache/geronimo/genesis/plugins/tools-maven-plugin/1.4/tools-maven-plugin-1.4.pom
(2 KB at 61.4 KB/sec)
Downloading: http://repo.maven.apache.org/maven2/org/apache/geronimo/genesis/plugins/plugins/1.4/plugins-1.4.pom
Downloaded: http://repo.maven.apache.org/maven2/org/apache/geronimo/genesis/plugins/plugins/1.4/plugins-1.4.pom
(8 KB at 268.6 KB/sec)
Downloading: http://repo.maven.apache.org/maven2/org/apache/geronimo/genesis/genesis/1.4/genesis-1.4.pom
Downloaded: http://repo.maven.apache.org/maven2/org/apache/geronimo/genesis/genesis/1.4/genesis-1.4.pom
(0 B at 0.0 KB/sec)
Downloading: http://repo.maven.apache.org/maven2/org/apache/geronimo/genesis/plugins/tools-maven-plugin/1.4/tools-maven-plugin-1.4.jar
Downloaded: http://repo.maven.apache.org/maven2/org/apache/geronimo/genesis/plugins/tools-maven-plugin/1.4/tools-maven-plugin-1.4.jar
(19 KB at 662.4 KB/sec)
Downloading: http://repo.maven.apache.org/maven2/org/apache/maven/plugins/maven-deploy-plugin/2.8.1/maven-deploy-plugin-2.8.1.pom
Downloaded: http://repo.maven.apache.org/maven2/org/apache/maven/plugins/maven-deploy-plugin/2.8.1/maven-deploy-plugin-2.8.1.pom
(8 KB at 352.8 KB/sec)
Downloading: http://repo.maven.apache.org/maven2/org/apache/maven/plugins/maven-deploy-plugin/2.8.1/maven-deploy-plugin-2.8.1.jar
Downloaded: http://repo.maven.apache.org/maven2/org/apache/maven/plugins/maven-deploy-plugin/2.8.1/maven-deploy-plugin-2.8.1.jar
(34 KB at 1504.3 KB/sec)
[INFO] 
[INFO] --- maven-clean-plugin:2.4.1:clean (default-clean) @ project ---
[INFO] 
[INFO] --- maven-remote-resources-plugin:1.2.1:process (default) @ project ---
[INFO] 
[INFO] --- maven-site-plugin:3.3:attach-descriptor (attach-descriptor) @ project ---
[INFO] 
[INFO] --- tools-maven-plugin:1.4:verify-legal-files (verify-legal-files) @ project ---
Downloading: http://repo.maven.apache.org/maven2/org/codehaus/mojo/plugin-support/1.0-alpha-1/plugin-support-1.0-alpha-1.pom
Downloaded: http://repo.maven.apache.org/maven2/org/codehaus/mojo/plugin-support/1.0-alpha-1/plugin-support-1.0-alpha-1.pom
(5 KB at 91.0 KB/sec)
Downloading: http://repo.maven.apache.org/maven2/org/codehaus/mojo/mojo/13/mojo-13.pom
Downloaded: http://repo.maven.apache.org/maven2/org/codehaus/mojo/mojo/13/mojo-13.pom (9 KB
at 296.4 KB/sec)
Downloading: http://repo.maven.apache.org/maven2/ant/ant/1.6.5/ant-1.6.5.pom
Downloaded: http://repo.maven.apache.org/maven2/ant/ant/1.6.5/ant-1.6.5.pom (861 B at 38.2
KB/sec)
Downloading: http://repo.maven.apache.org/maven2/commons-jexl/commons-jexl/1.1/commons-jexl-1.1.pom
Downloaded: http://repo.maven.apache.org/maven2/commons-jexl/commons-jexl/1.1/commons-jexl-1.1.pom
(5 KB at 242.0 KB/sec)
Downloading: http://repo.maven.apache.org/maven2/org/codehaus/mojo/plugin-support/1.0-alpha-1/plugin-support-1.0-alpha-1.jar
Downloading: http://repo.maven.apache.org/maven2/ant/ant/1.6.5/ant-1.6.5.jar
Downloading: http://repo.maven.apache.org/maven2/commons-jexl/commons-jexl/1.1/commons-jexl-1.1.jar
Downloaded: http://repo.maven.apache.org/maven2/org/codehaus/mojo/plugin-support/1.0-alpha-1/plugin-support-1.0-alpha-1.jar
(45 KB at 959.6 KB/sec)
Downloaded: http://repo.maven.apache.org/maven2/commons-jexl/commons-jexl/1.1/commons-jexl-1.1.jar
(130 KB at 2225.3 KB/sec)
Downloaded: http://repo.maven.apache.org/maven2/ant/ant/1.6.5/ant-1.6.5.jar (1010 KB at 7767.8
KB/sec)
[INFO] 
[INFO] --- maven-install-plugin:2.5.1:install (default-install) @ project ---
[INFO] Installing <https://builds.apache.org/job/dir-project-deploy/ws/trunk/pom.xml>
to /jenkins/maven-repositories/0/org/apache/directory/project/project/33-SNAPSHOT/project-33-SNAPSHOT.pom
[INFO] Installing <https://builds.apache.org/job/dir-project-deploy/ws/trunk/target/project-33-SNAPSHOT-site.xml>
to /jenkins/maven-repositories/0/org/apache/directory/project/project/33-SNAPSHOT/project-33-SNAPSHOT-site.xml
[INFO] 
[INFO] --- maven-deploy-plugin:2.8.1:deploy (default-deploy) @ project ---
Downloading: https://repository.apache.org/content/repositories/snapshots/org/apache/directory/project/project/33-SNAPSHOT/maven-metadata.xml
[WARNING] Could not transfer metadata org.apache.directory.project:project:33-SNAPSHOT/maven-metadata.xml
from/to apache.snapshots.https (https://repository.apache.org/content/repositories/snapshots):
Not authorized, ReasonPhrase:Unauthorized.
[INFO] ------------------------------------------------------------------------
[INFO] BUILD FAILURE
[INFO] ------------------------------------------------------------------------
[INFO] Total time: 1:11.161s
[INFO] Finished at: Wed Sep 17 01:02:39 UTC 2014
[INFO] Final Memory: 18M/146M
[INFO] ------------------------------------------------------------------------
Waiting for Jenkins to finish collecting data
[ERROR] Failed to execute goal org.apache.maven.plugins:maven-deploy-plugin:2.8.1:deploy (default-deploy)
on project project: Failed to retrieve remote metadata org.apache.directory.project:project:33-SNAPSHOT/maven-metadata.xml:
Could not transfer metadata org.apache.directory.project:project:33-SNAPSHOT/maven-metadata.xml
from/to apache.snapshots.https (https://repository.apache.org/content/repositories/snapshots):
Not authorized, ReasonPhrase:Unauthorized. -> [Help 1]
[ERROR] 
[ERROR] To see the full stack trace of the errors, re-run Maven with the -e switch.
[ERROR] Re-run Maven using the -X switch to enable full debug logging.
[ERROR] 
[ERROR] For more information about the errors and possible solutions, please read the following
articles:
[ERROR] [Help 1] http://cwiki.apache.org/confluence/display/MAVEN/MojoExecutionException
[JENKINS] Archiving <https://builds.apache.org/job/dir-project-deploy/ws/trunk/pom.xml>
to org.apache.directory.project/project/33-SNAPSHOT/project-33-SNAPSHOT.pom
[JENKINS] Archiving <https://builds.apache.org/job/dir-project-deploy/ws/trunk/target/project-33-SNAPSHOT-site.xml>
to org.apache.directory.project/project/33-SNAPSHOT/project-33-SNAPSHOT-site.xml
Sending artifact delta relative to dir-project-deploy ยป Apache Directory Project #1412
Archived 2 artifacts
Archive block size is 32768
Received 0 blocks and 28845 bytes
Compression is 0.0%
Took 0.31 sec
Sending e-mails to: notifications@directory.apache.org
channel stopped

Mime
View raw message