directory-notifications mailing list archives

Site index · List index
Message view « Date » · « Thread »
Top « Date » · « Thread »
From Apache Jenkins Server <jenk...@builds.apache.org>
Subject Build failed in Jenkins: dir-apacheds-ubuntu-deploy #1463
Date Sun, 28 Sep 2014 04:12:25 GMT
See <https://builds.apache.org/job/dir-apacheds-ubuntu-deploy/1463/>

------------------------------------------
[...truncated 5697 lines...]
Tests run: 5, Failures: 0, Errors: 0, Skipped: 0, Time elapsed: 0.398 sec - in org.apache.directory.server.core.partition.impl.btree.jdbm.DupsContainerCursorTest
Running org.apache.directory.server.core.partition.impl.btree.jdbm.StringSerializerTest
Tests run: 2, Failures: 0, Errors: 0, Skipped: 0, Time elapsed: 0.016 sec - in org.apache.directory.server.core.partition.impl.btree.jdbm.StringSerializerTest
Running org.apache.directory.server.core.partition.impl.btree.jdbm.DupsCursorTest
Tests run: 15, Failures: 0, Errors: 0, Skipped: 0, Time elapsed: 0.643 sec - in org.apache.directory.server.core.partition.impl.btree.jdbm.DupsCursorTest
Running org.apache.directory.server.core.partition.impl.btree.jdbm.KeyCursorTest
Tests run: 5, Failures: 0, Errors: 0, Skipped: 0, Time elapsed: 0.051 sec - in org.apache.directory.server.core.partition.impl.btree.jdbm.KeyCursorTest
Running org.apache.directory.server.core.partition.impl.btree.jdbm.JdbmTableWithDuplicatesTest
Tests run: 15, Failures: 0, Errors: 0, Skipped: 0, Time elapsed: 0.488 sec - in org.apache.directory.server.core.partition.impl.btree.jdbm.JdbmTableWithDuplicatesTest
Running org.apache.directory.server.core.partition.impl.btree.jdbm.JdbmTableNoDuplicatesTest
Tests run: 8, Failures: 0, Errors: 0, Skipped: 0, Time elapsed: 0.385 sec - in org.apache.directory.server.core.partition.impl.btree.jdbm.JdbmTableNoDuplicatesTest
Running org.apache.directory.server.core.partition.impl.btree.jdbm.KeyTupleArrayCursorTest
Tests run: 2, Failures: 0, Errors: 0, Skipped: 0, Time elapsed: 0.003 sec - in org.apache.directory.server.core.partition.impl.btree.jdbm.KeyTupleArrayCursorTest
Running org.apache.directory.server.core.partition.tree.PartitionTreeTest
Tests run: 3, Failures: 0, Errors: 0, Skipped: 0, Time elapsed: 0.251 sec - in org.apache.directory.server.core.partition.tree.PartitionTreeTest

Results :

Tests run: 124, Failures: 0, Errors: 0, Skipped: 0

[JENKINS] Recording test results
[INFO] 
[INFO] --- maven-bundle-plugin:2.5.0:bundle (default-bundle) @ apacheds-jdbm-partition ---
[INFO] 
[INFO] --- maven-site-plugin:3.3:attach-descriptor (attach-descriptor) @ apacheds-jdbm-partition
---
[INFO] 
[INFO] --- tools-maven-plugin:1.4:verify-legal-files (verify-legal-files) @ apacheds-jdbm-partition
---
[INFO] Checking legal files in: apacheds-jdbm-partition-2.0.0-M18-SNAPSHOT.jar
[WARNING] Failed to getClass for org.apache.maven.plugin.source.SourceJarMojo
[INFO] 
[INFO] --- maven-source-plugin:2.2.1:jar (attach-sources) @ apacheds-jdbm-partition ---
[INFO] Building jar: <https://builds.apache.org/job/dir-apacheds-ubuntu-deploy/ws/trunk/jdbm-partition/target/apacheds-jdbm-partition-2.0.0-M18-SNAPSHOT-sources.jar>
[INFO] 
[INFO] --- maven-install-plugin:2.5.1:install (default-install) @ apacheds-jdbm-partition
---
[INFO] Installing <https://builds.apache.org/job/dir-apacheds-ubuntu-deploy/ws/trunk/jdbm-partition/target/apacheds-jdbm-partition-2.0.0-M18-SNAPSHOT.jar>
to /home/jenkins/jenkins-slave/maven-repositories/1/org/apache/directory/server/apacheds-jdbm-partition/2.0.0-M18-SNAPSHOT/apacheds-jdbm-partition-2.0.0-M18-SNAPSHOT.jar
[INFO] Installing <https://builds.apache.org/job/dir-apacheds-ubuntu-deploy/ws/trunk/jdbm-partition/pom.xml>
to /home/jenkins/jenkins-slave/maven-repositories/1/org/apache/directory/server/apacheds-jdbm-partition/2.0.0-M18-SNAPSHOT/apacheds-jdbm-partition-2.0.0-M18-SNAPSHOT.pom
[INFO] Installing <https://builds.apache.org/job/dir-apacheds-ubuntu-deploy/ws/trunk/jdbm-partition/target/apacheds-jdbm-partition-2.0.0-M18-SNAPSHOT-sources.jar>
to /home/jenkins/jenkins-slave/maven-repositories/1/org/apache/directory/server/apacheds-jdbm-partition/2.0.0-M18-SNAPSHOT/apacheds-jdbm-partition-2.0.0-M18-SNAPSHOT-sources.jar
[INFO] 
[INFO] --- maven-bundle-plugin:2.5.0:install (default-install) @ apacheds-jdbm-partition ---
[INFO] Installing org/apache/directory/server/apacheds-jdbm-partition/2.0.0-M18-SNAPSHOT/apacheds-jdbm-partition-2.0.0-M18-SNAPSHOT.jar
[INFO] Writing OBR metadata
[INFO] 
[INFO] --- maven-deploy-plugin:2.8.1:deploy (default-deploy) @ apacheds-jdbm-partition ---
Downloading: https://repository.apache.org/content/repositories/snapshots/org/apache/directory/server/apacheds-jdbm-partition/2.0.0-M18-SNAPSHOT/maven-metadata.xml
Downloaded: https://repository.apache.org/content/repositories/snapshots/org/apache/directory/server/apacheds-jdbm-partition/2.0.0-M18-SNAPSHOT/maven-metadata.xml
(2 KB at 0.3 KB/sec)
Uploading: https://repository.apache.org/content/repositories/snapshots/org/apache/directory/server/apacheds-jdbm-partition/2.0.0-M18-SNAPSHOT/apacheds-jdbm-partition-2.0.0-M18-20140928.040959-73.jar
Uploaded: https://repository.apache.org/content/repositories/snapshots/org/apache/directory/server/apacheds-jdbm-partition/2.0.0-M18-SNAPSHOT/apacheds-jdbm-partition-2.0.0-M18-20140928.040959-73.jar
(71 KB at 86.8 KB/sec)
Uploading: https://repository.apache.org/content/repositories/snapshots/org/apache/directory/server/apacheds-jdbm-partition/2.0.0-M18-SNAPSHOT/apacheds-jdbm-partition-2.0.0-M18-20140928.040959-73.pom
Uploaded: https://repository.apache.org/content/repositories/snapshots/org/apache/directory/server/apacheds-jdbm-partition/2.0.0-M18-SNAPSHOT/apacheds-jdbm-partition-2.0.0-M18-20140928.040959-73.pom
(5 KB at 8.0 KB/sec)
Downloading: https://repository.apache.org/content/repositories/snapshots/org/apache/directory/server/apacheds-jdbm-partition/maven-metadata.xml
Downloaded: https://repository.apache.org/content/repositories/snapshots/org/apache/directory/server/apacheds-jdbm-partition/maven-metadata.xml
(418 B at 1.0 KB/sec)
Uploading: https://repository.apache.org/content/repositories/snapshots/org/apache/directory/server/apacheds-jdbm-partition/2.0.0-M18-SNAPSHOT/maven-metadata.xml
Uploaded: https://repository.apache.org/content/repositories/snapshots/org/apache/directory/server/apacheds-jdbm-partition/2.0.0-M18-SNAPSHOT/maven-metadata.xml
(2 KB at 1.8 KB/sec)
Uploading: https://repository.apache.org/content/repositories/snapshots/org/apache/directory/server/apacheds-jdbm-partition/maven-metadata.xml
Uploaded: https://repository.apache.org/content/repositories/snapshots/org/apache/directory/server/apacheds-jdbm-partition/maven-metadata.xml
(418 B at 0.1 KB/sec)
Uploading: https://repository.apache.org/content/repositories/snapshots/org/apache/directory/server/apacheds-jdbm-partition/2.0.0-M18-SNAPSHOT/apacheds-jdbm-partition-2.0.0-M18-20140928.040959-73-sources.jar
Uploaded: https://repository.apache.org/content/repositories/snapshots/org/apache/directory/server/apacheds-jdbm-partition/2.0.0-M18-SNAPSHOT/apacheds-jdbm-partition-2.0.0-M18-20140928.040959-73-sources.jar
(61 KB at 12.1 KB/sec)
Uploading: https://repository.apache.org/content/repositories/snapshots/org/apache/directory/server/apacheds-jdbm-partition/2.0.0-M18-SNAPSHOT/maven-metadata.xml
Uploaded: https://repository.apache.org/content/repositories/snapshots/org/apache/directory/server/apacheds-jdbm-partition/2.0.0-M18-SNAPSHOT/maven-metadata.xml
(2 KB at 0.5 KB/sec)
[INFO] 
[INFO] --- maven-bundle-plugin:2.5.0:deploy (default-deploy) @ apacheds-jdbm-partition ---
[INFO] Remote OBR update disabled (enable with -DremoteOBR)
[JENKINS] Archiving disabled
[INFO]                                                                         
[INFO] ------------------------------------------------------------------------
[INFO] Building ApacheDS Mavibot Partition 2.0.0-M18-SNAPSHOT
[INFO] ------------------------------------------------------------------------
[INFO] 
[INFO] --- maven-clean-plugin:2.4.1:clean (default-clean) @ apacheds-mavibot-partition ---
[INFO] 
[INFO] --- maven-remote-resources-plugin:1.2.1:process (default) @ apacheds-mavibot-partition
---
[INFO] 
[INFO] --- maven-resources-plugin:2.6:resources (default-resources) @ apacheds-mavibot-partition
---
[INFO] Using 'UTF-8' encoding to copy filtered resources.
[INFO] Copying 0 resource
[INFO] Copying 3 resources
[INFO] 
[INFO] --- maven-compiler-plugin:3.1:compile (default-compile) @ apacheds-mavibot-partition
---
[INFO] Changes detected - recompiling the module!
[INFO] Compiling 14 source files to <https://builds.apache.org/job/dir-apacheds-ubuntu-deploy/ws/trunk/mavibot-partition/target/classes>
[WARNING] <https://builds.apache.org/job/dir-apacheds-ubuntu-deploy/ws/trunk/mavibot-partition/src/main/java/org/apache/directory/server/core/partition/impl/btree/mavibot/MavibotPartition.java>:
Some input files use unchecked or unsafe operations.
[WARNING] <https://builds.apache.org/job/dir-apacheds-ubuntu-deploy/ws/trunk/mavibot-partition/src/main/java/org/apache/directory/server/core/partition/impl/btree/mavibot/MavibotPartition.java>:
Recompile with -Xlint:unchecked for details.
[INFO] 
[INFO] --- maven-resources-plugin:2.6:testResources (default-testResources) @ apacheds-mavibot-partition
---
[INFO] Using 'UTF-8' encoding to copy filtered resources.
[INFO] Copying 1 resource
[INFO] Copying 3 resources
[INFO] 
[INFO] --- maven-compiler-plugin:3.1:testCompile (default-testCompile) @ apacheds-mavibot-partition
---
[INFO] Changes detected - recompiling the module!
[INFO] Compiling 6 source files to <https://builds.apache.org/job/dir-apacheds-ubuntu-deploy/ws/trunk/mavibot-partition/target/test-classes>
[INFO] -------------------------------------------------------------
[WARNING] COMPILATION WARNING : 
[INFO] -------------------------------------------------------------
[WARNING] <https://builds.apache.org/job/dir-apacheds-ubuntu-deploy/ws/trunk/mavibot-partition/src/test/java/org/apache/directory/server/core/partition/impl/btree/mavibot/LdifBulkLoaderTest.java>:
<https://builds.apache.org/job/dir-apacheds-ubuntu-deploy/ws/trunk/mavibot-partition/src/test/java/org/apache/directory/server/core/partition/impl/btree/mavibot/LdifBulkLoaderTest.java>
uses unchecked or unsafe operations.
[WARNING] <https://builds.apache.org/job/dir-apacheds-ubuntu-deploy/ws/trunk/mavibot-partition/src/test/java/org/apache/directory/server/core/partition/impl/btree/mavibot/LdifBulkLoaderTest.java>:
Recompile with -Xlint:unchecked for details.
[INFO] 2 warnings 
[INFO] -------------------------------------------------------------
[INFO] -------------------------------------------------------------
[ERROR] COMPILATION ERROR : 
[INFO] -------------------------------------------------------------
[ERROR] <https://builds.apache.org/job/dir-apacheds-ubuntu-deploy/ws/trunk/mavibot-partition/src/test/java/org/apache/directory/server/core/partition/impl/btree/mavibot/LdifBulkLoaderTest.java>:[59,46]
constructor LdifTupleReaderWriter in class org.apache.directory.server.core.partition.impl.btree.mavibot.LdifTupleReaderWriter<E>
cannot be applied to given types;
  required: java.lang.String,org.apache.directory.api.ldap.model.schema.SchemaManager
  found: no arguments
  reason: actual and formal argument lists differ in length
[INFO] 1 error
[INFO] -------------------------------------------------------------
[JENKINS] Archiving disabled
[INFO] ------------------------------------------------------------------------
[INFO] Reactor Summary:
[INFO] 
[INFO] ApacheDS .......................................... SUCCESS [41.312s]
[INFO] ApacheDS I18n ..................................... SUCCESS [14.271s]
[INFO] ApacheDS Core Constants ........................... SUCCESS [17.377s]
[INFO] ApacheDS Core API ................................. SUCCESS [54.154s]
[INFO] ApacheDS Core Shared .............................. SUCCESS [18.864s]
[INFO] ApacheDS Interceptors ............................. SUCCESS [2.967s]
[INFO] ApacheDS AdministrativePoint Interceptor .......... SUCCESS [11.312s]
[INFO] ApacheDS Authentication Interceptor ............... SUCCESS [30.006s]
[INFO] ApacheDS Interceptor to increment numeric attributes  SUCCESS [11.384s]
[INFO] ApacheDS Authorization Interceptor ................ SUCCESS [21.058s]
[INFO] ApacheDS ChangeLog Interceptor .................... SUCCESS [9.586s]
[INFO] ApacheDS Collective Attribute Interceptor ......... SUCCESS [10.861s]
[INFO] ApacheDS Event Interceptor ........................ SUCCESS [14.850s]
[INFO] ApacheDS Exception Interceptor .................... SUCCESS [13.994s]
[INFO] ApacheDS Journal Interceptor ...................... SUCCESS [17.425s]
[INFO] ApacheDS Normalization Interceptor ................ SUCCESS [17.313s]
[INFO] ApacheDS Operational Attribute Interceptor ........ SUCCESS [11.695s]
[INFO] ApacheDS Referral Interceptor ..................... SUCCESS [11.622s]
[INFO] ApacheDS Schema Interceptor ....................... SUCCESS [20.188s]
[INFO] ApacheDS Subtree Interceptor ...................... SUCCESS [26.174s]
[INFO] ApacheDS Triggers Interceptor ..................... SUCCESS [35.383s]
[INFO] ApacheDS Core ..................................... SUCCESS [23.593s]
[INFO] ApacheDS Core AVL ................................. SUCCESS [17.333s]
[INFO] ApacheDS Generalized (X) DBM Partition ............ SUCCESS [27.221s]
[INFO] ApacheDS LDIF Partition ........................... SUCCESS [20.966s]
[INFO] ApacheDS JDBM Partition ........................... SUCCESS [38.691s]
[INFO] ApacheDS Mavibot Partition ........................ FAILURE [3.021s]
[INFO] ApacheDS Core Annotations ......................... SKIPPED
[INFO] ApacheDS Core JNDI ................................ SKIPPED
[INFO] ApacheDS Protocol Kerberos Codec .................. SKIPPED
[INFO] ApacheDS Interceptors for Kerberos ................ SKIPPED
[INFO] ApacheDS Protocol Dhcp ............................ SKIPPED
[INFO] ApacheDS Protocol Shared .......................... SKIPPED
[INFO] ApacheDS Protocol Dns ............................. SKIPPED
[INFO] ApacheDS Protocol Kerberos ........................ SKIPPED
[INFO] ApacheDS Protocol Ldap ............................ SKIPPED
[INFO] ApacheDS Protocol Ntp ............................. SKIPPED
[INFO] Apacheds Server Annotations ....................... SKIPPED
[INFO] ApacheDS Server Config ............................ SKIPPED
[INFO] ApacheDS Server JNDI .............................. SKIPPED
[INFO] ApacheDS Test Framework ........................... SKIPPED
[INFO] ApacheDS All ...................................... SKIPPED
[INFO] ApacheDS Logger Interceptor ....................... SKIPPED
[INFO] ApacheDS Password Hashing Interceptor ............. SKIPPED
[INFO] ApacheDS Core Integration ......................... SKIPPED
[INFO] ApacheDS Protocol Kerberos Test ................... SKIPPED
[INFO] ApacheDS Server Integration ....................... SKIPPED
[INFO] ApacheDS DirectoryService-WebApp bridge ........... SKIPPED
[INFO] ApacheDS Jetty HTTP Server Integration ............ SKIPPED
[INFO] ApacheDS Service Builder .......................... SKIPPED
[INFO] Apache Directory LDAP Client API test ............. SKIPPED
[INFO] kerberos-client ................................... SKIPPED
[INFO] ApacheDS Service .................................. SKIPPED
[INFO] ApacheDS Wrapper .................................. SKIPPED
[INFO] ApacheDS Installers Maven Plugin .................. SKIPPED
[INFO] ApacheDS Installers ............................... SKIPPED
[INFO] ApacheDS Mavibot bulkloader ....................... SKIPPED
[INFO] ------------------------------------------------------------------------
[INFO] BUILD FAILURE
[INFO] ------------------------------------------------------------------------
[INFO] Total time: 9:32.006s
[INFO] Finished at: Sun Sep 28 04:10:22 UTC 2014
[INFO] Final Memory: 65M/256M
[INFO] ------------------------------------------------------------------------
[JENKINS] Archiving disabled
[JENKINS] Archiving disabled
[JENKINS] Archiving disabled
[JENKINS] Archiving disabled
[JENKINS] Archiving disabled
[JENKINS] Archiving disabled
[JENKINS] Archiving disabled
[JENKINS] Archiving disabled
[JENKINS] Archiving disabled
[JENKINS] Archiving disabled
[JENKINS] Archiving disabled
[JENKINS] Archiving disabled
[JENKINS] Archiving disabled
[JENKINS] Archiving disabled
[JENKINS] Archiving disabled
[JENKINS] Archiving disabled
[JENKINS] Archiving disabled
[JENKINS] Archiving disabled
[JENKINS] Archiving disabled
[JENKINS] Archiving disabled
[JENKINS] Archiving disabled
[JENKINS] Archiving disabled
[JENKINS] Archiving disabled
[JENKINS] Archiving disabled
[JENKINS] Archiving disabled
[JENKINS] Archiving disabled
[JENKINS] Archiving disabled
[JENKINS] Archiving disabled
[JENKINS] Archiving disabled
[JENKINS] Archiving disabled
[JENKINS] Archiving disabled
[JENKINS] Archiving disabled
[JENKINS] Archiving disabled
[JENKINS] Archiving disabled
[JENKINS] Archiving disabled
[JENKINS] Archiving disabled
[JENKINS] Archiving disabled
[JENKINS] Archiving disabled
[JENKINS] Archiving disabled
[JENKINS] Archiving disabled
[JENKINS] Archiving disabled
[JENKINS] Archiving disabled
[JENKINS] Archiving disabled
[JENKINS] Archiving disabled
[JENKINS] Archiving disabled
[JENKINS] Archiving disabled
[JENKINS] Archiving disabled
[JENKINS] Archiving disabled
[JENKINS] Archiving disabled
[JENKINS] Archiving disabled
[JENKINS] Archiving disabled
[JENKINS] Archiving disabled
[JENKINS] Archiving disabled
[JENKINS] Archiving disabled
[JENKINS] Archiving disabled
[JENKINS] Archiving disabled
[JENKINS] Archiving disabled
Waiting for Jenkins to finish collecting data
[ERROR] Failed to execute goal org.apache.maven.plugins:maven-compiler-plugin:3.1:testCompile
(default-testCompile) on project apacheds-mavibot-partition: Compilation failure
[ERROR] <https://builds.apache.org/job/dir-apacheds-ubuntu-deploy/ws/trunk/mavibot-partition/src/test/java/org/apache/directory/server/core/partition/impl/btree/mavibot/LdifBulkLoaderTest.java>:[59,46]
constructor LdifTupleReaderWriter in class org.apache.directory.server.core.partition.impl.btree.mavibot.LdifTupleReaderWriter<E>
cannot be applied to given types;
[ERROR] required: java.lang.String,org.apache.directory.api.ldap.model.schema.SchemaManager
[ERROR] found: no arguments
[ERROR] reason: actual and formal argument lists differ in length
[ERROR] -> [Help 1]
[ERROR] 
[ERROR] To see the full stack trace of the errors, re-run Maven with the -e switch.
[ERROR] Re-run Maven using the -X switch to enable full debug logging.
[ERROR] 
[ERROR] For more information about the errors and possible solutions, please read the following
articles:
[ERROR] [Help 1] http://cwiki.apache.org/confluence/display/MAVEN/MojoFailureException
[ERROR] 
[ERROR] After correcting the problems, you can resume the build with the command
[ERROR]   mvn <goals> -rf :apacheds-mavibot-partition
channel stopped

Mime
View raw message