directory-notifications mailing list archives

Site index · List index
Message view « Date » · « Thread »
Top « Date » · « Thread »
From Apache Jenkins Server <jenk...@builds.apache.org>
Subject Build failed in Jenkins: dir-mavibot-ubuntu-deploy #352
Date Tue, 26 Aug 2014 03:07:37 GMT
See <https://builds.apache.org/job/dir-mavibot-ubuntu-deploy/352/>

------------------------------------------
[...truncated 57 lines...]
Uploading: https://repository.apache.org/content/repositories/snapshots/org/apache/directory/mavibot/mavibot-parent/1.0.0-M6-SNAPSHOT/maven-metadata.xml
Uploaded: https://repository.apache.org/content/repositories/snapshots/org/apache/directory/mavibot/mavibot-parent/1.0.0-M6-SNAPSHOT/maven-metadata.xml
(627 B at 0.4 KB/sec)
Uploading: https://repository.apache.org/content/repositories/snapshots/org/apache/directory/mavibot/mavibot-parent/maven-metadata.xml
Uploaded: https://repository.apache.org/content/repositories/snapshots/org/apache/directory/mavibot/mavibot-parent/maven-metadata.xml
(405 B at 0.1 KB/sec)
[INFO]                                                                         
[INFO] ------------------------------------------------------------------------
[INFO] Building ApacheDS MVCC BTree implementation 1.0.0-M6-SNAPSHOT
[INFO] ------------------------------------------------------------------------
[INFO] 
[INFO] --- maven-clean-plugin:2.4.1:clean (default-clean) @ mavibot ---
[INFO] Deleting <https://builds.apache.org/job/dir-mavibot-ubuntu-deploy/ws/mavibot/target>
[INFO] 
[INFO] --- maven-enforcer-plugin:1.3.1:enforce (enforce-java-16) @ mavibot ---
[INFO] 
[INFO] --- maven-remote-resources-plugin:1.2.1:process (default) @ mavibot ---
[INFO] 
[INFO] --- maven-resources-plugin:2.6:resources (default-resources) @ mavibot ---
[INFO] Using 'UTF-8' encoding to copy filtered resources.
[INFO] skip non existing resourceDirectory <https://builds.apache.org/job/dir-mavibot-ubuntu-deploy/ws/mavibot/src/main/resources>
[INFO] Copying 3 resources
[INFO] 
[INFO] --- maven-compiler-plugin:3.1:compile (default-compile) @ mavibot ---
[INFO] Changes detected - recompiling the module!
[INFO] Compiling 121 source files to <https://builds.apache.org/job/dir-mavibot-ubuntu-deploy/ws/mavibot/target/classes>
[WARNING] <https://builds.apache.org/job/dir-mavibot-ubuntu-deploy/ws/mavibot/src/main/java/org/apache/directory/mavibot/btree/PersistedPageHolder.java>:
Some input files use unchecked or unsafe operations.
[WARNING] <https://builds.apache.org/job/dir-mavibot-ubuntu-deploy/ws/mavibot/src/main/java/org/apache/directory/mavibot/btree/PersistedPageHolder.java>:
Recompile with -Xlint:unchecked for details.
[INFO] 
[INFO] --- maven-resources-plugin:2.6:testResources (default-testResources) @ mavibot ---
[INFO] Using 'UTF-8' encoding to copy filtered resources.
[INFO] Copying 1 resource
[INFO] Copying 3 resources
[INFO] 
[INFO] --- maven-compiler-plugin:3.1:testCompile (default-testCompile) @ mavibot ---
[INFO] Changes detected - recompiling the module!
[INFO] Compiling 44 source files to <https://builds.apache.org/job/dir-mavibot-ubuntu-deploy/ws/mavibot/target/test-classes>
[WARNING] <https://builds.apache.org/job/dir-mavibot-ubuntu-deploy/ws/mavibot/src/test/java/org/apache/directory/mavibot/btree/InMemoryBTreeTest.java>:
Some input files use unchecked or unsafe operations.
[WARNING] <https://builds.apache.org/job/dir-mavibot-ubuntu-deploy/ws/mavibot/src/test/java/org/apache/directory/mavibot/btree/InMemoryBTreeTest.java>:
Recompile with -Xlint:unchecked for details.
[INFO] 
[INFO] --- maven-surefire-plugin:2.17:test (default-test) @ mavibot ---
[INFO] Surefire report directory: <https://builds.apache.org/job/dir-mavibot-ubuntu-deploy/ws/mavibot/target/surefire-reports>
Downloading: http://repo.maven.apache.org/maven2/org/apache/maven/surefire/surefire-junit4/2.17/surefire-junit4-2.17.pom
Downloaded: http://repo.maven.apache.org/maven2/org/apache/maven/surefire/surefire-junit4/2.17/surefire-junit4-2.17.pom
(3 KB at 17.4 KB/sec)
Downloading: http://repo.maven.apache.org/maven2/org/apache/maven/surefire/surefire-junit4/2.17/surefire-junit4-2.17.jar
Downloaded: http://repo.maven.apache.org/maven2/org/apache/maven/surefire/surefire-junit4/2.17/surefire-junit4-2.17.jar
(63 KB at 350.9 KB/sec)

-------------------------------------------------------
 T E S T S
-------------------------------------------------------
Running org.apache.directory.mavibot.btree.InMemoryBTreeBuilderTest
built rootpage : Node[r0, nbElems:1] -> {r0|<5>|r0}
Tests run: 1, Failures: 0, Errors: 0, Skipped: 0, Time elapsed: 0.15 sec - in org.apache.directory.mavibot.btree.InMemoryBTreeBuilderTest
Running org.apache.directory.mavibot.btree.comparator.ShortComparatorTest
Tests run: 1, Failures: 0, Errors: 0, Skipped: 0, Time elapsed: 0 sec - in org.apache.directory.mavibot.btree.comparator.ShortComparatorTest
Running org.apache.directory.mavibot.btree.comparator.BooleanArrayComparatorTest
Tests run: 1, Failures: 0, Errors: 0, Skipped: 0, Time elapsed: 0 sec - in org.apache.directory.mavibot.btree.comparator.BooleanArrayComparatorTest
Running org.apache.directory.mavibot.btree.comparator.ByteArrayComparatorTest
Tests run: 1, Failures: 0, Errors: 0, Skipped: 0, Time elapsed: 0 sec - in org.apache.directory.mavibot.btree.comparator.ByteArrayComparatorTest
Running org.apache.directory.mavibot.btree.comparator.StringComparatorTest
Tests run: 1, Failures: 0, Errors: 0, Skipped: 0, Time elapsed: 0 sec - in org.apache.directory.mavibot.btree.comparator.StringComparatorTest
Running org.apache.directory.mavibot.btree.comparator.ShortArrayComparatorTest
Tests run: 1, Failures: 0, Errors: 0, Skipped: 0, Time elapsed: 0 sec - in org.apache.directory.mavibot.btree.comparator.ShortArrayComparatorTest
Running org.apache.directory.mavibot.btree.comparator.IntArrayComparatorTest
Tests run: 1, Failures: 0, Errors: 0, Skipped: 0, Time elapsed: 0 sec - in org.apache.directory.mavibot.btree.comparator.IntArrayComparatorTest
Running org.apache.directory.mavibot.btree.comparator.LongComparatorTest
Tests run: 1, Failures: 0, Errors: 0, Skipped: 0, Time elapsed: 0 sec - in org.apache.directory.mavibot.btree.comparator.LongComparatorTest
Running org.apache.directory.mavibot.btree.comparator.IntComparatorTest
Tests run: 1, Failures: 0, Errors: 0, Skipped: 0, Time elapsed: 0 sec - in org.apache.directory.mavibot.btree.comparator.IntComparatorTest
Running org.apache.directory.mavibot.btree.comparator.CharArrayComparatorTest
Tests run: 1, Failures: 0, Errors: 0, Skipped: 0, Time elapsed: 0 sec - in org.apache.directory.mavibot.btree.comparator.CharArrayComparatorTest
Running org.apache.directory.mavibot.btree.comparator.CharComparatorTest
Tests run: 1, Failures: 0, Errors: 0, Skipped: 0, Time elapsed: 0.001 sec - in org.apache.directory.mavibot.btree.comparator.CharComparatorTest
Running org.apache.directory.mavibot.btree.comparator.LongArrayComparatorTest
Tests run: 1, Failures: 0, Errors: 0, Skipped: 0, Time elapsed: 0.001 sec - in org.apache.directory.mavibot.btree.comparator.LongArrayComparatorTest
Running org.apache.directory.mavibot.btree.comparator.ByteComparatorTest
Tests run: 1, Failures: 0, Errors: 0, Skipped: 0, Time elapsed: 0 sec - in org.apache.directory.mavibot.btree.comparator.ByteComparatorTest
Running org.apache.directory.mavibot.btree.comparator.BooleanComparatorTest
Tests run: 1, Failures: 0, Errors: 0, Skipped: 0, Time elapsed: 0.001 sec - in org.apache.directory.mavibot.btree.comparator.BooleanComparatorTest
Running org.apache.directory.mavibot.btree.PersistedReadTest
Tests run: 3, Failures: 0, Errors: 0, Skipped: 0, Time elapsed: 0.003 sec - in org.apache.directory.mavibot.btree.PersistedReadTest
Running org.apache.directory.mavibot.btree.PersistedBTreeBuilderTest
Tests run: 1, Failures: 0, Errors: 0, Skipped: 1, Time elapsed: 0 sec - in org.apache.directory.mavibot.btree.PersistedBTreeBuilderTest
Running org.apache.directory.mavibot.btree.RecordManagerTest
/tmp/junit7337779331708807997/e020a3f5-d9c0-49a8-8620-40baa61b56f9/mavibot.db
/tmp/junit3847650546036472159/35f5dcfa-9363-427a-8ac3-a41875bbc91c/mavibot.db
/tmp/junit4819316755232242376/7a35e73c-7fe5-4bc7-81c3-41820079d9d0/mavibot.db
/tmp/junit6939427966336279186/6c54b041-1028-4da9-bff9-b99554e56a82/mavibot.db
/tmp/junit5369691733668467094/8cfcd79f-1c99-4293-915a-1594877b41c8/mavibot.db
/tmp/junit5635379903446410036/be956393-c2af-4a00-a0c2-88f58e7b4a8f/mavibot.db
/tmp/junit5471132959094375646/b993f761-752a-4e6b-841c-7c70dd322b17/mavibot.db
/tmp/junit1523658002064697650/b4f740b9-1044-4452-9627-267c0e248538/mavibot.db
/tmp/junit4625358873276884023/d653832f-43f4-4a1e-aa8c-24cbdd8a11ae/mavibot.db
Tests run: 11, Failures: 0, Errors: 0, Skipped: 2, Time elapsed: 0.213 sec - in org.apache.directory.mavibot.btree.RecordManagerTest
Running org.apache.directory.mavibot.btree.PersistedBTreeTransactionTest
Delta without transaction for 100K elements = 1420
Tests run: 2, Failures: 0, Errors: 0, Skipped: 1, Time elapsed: 1.426 sec - in org.apache.directory.mavibot.btree.PersistedBTreeTransactionTest
Running org.apache.directory.mavibot.btree.PersistedSubBtreeKeyCursorTest
Tests run: 1, Failures: 0, Errors: 0, Skipped: 0, Time elapsed: 0.004 sec - in org.apache.directory.mavibot.btree.PersistedSubBtreeKeyCursorTest
Running org.apache.directory.mavibot.btree.InMemoryBTreeFlushTest
Written 10000 elements in : 209ms
Written 20000 elements in : 154ms
Written 30000 elements in : 148ms
Written 40000 elements in : 92ms
Written 50000 elements in : 97ms
Written 60000 elements in : 86ms
Written 70000 elements in : 33ms
Written 80000 elements in : 33ms
Written 90000 elements in : 29ms
Delta : 908, nbError = 0, Nb insertion per second : 110000
Time to flush 100 000 elements : 118ms
Tests run: 2, Failures: 0, Errors: 0, Skipped: 0, Time elapsed: 1.27 sec - in org.apache.directory.mavibot.btree.InMemoryBTreeFlushTest
Running org.apache.directory.mavibot.btree.PersistedBTreeBrowseTest
Tests run: 24, Failures: 0, Errors: 0, Skipped: 2, Time elapsed: 31.986 sec - in org.apache.directory.mavibot.btree.PersistedBTreeBrowseTest
Running org.apache.directory.mavibot.btree.InMemoryBulkDataSorterTest
Tests run: 2, Failures: 0, Errors: 0, Skipped: 0, Time elapsed: 8.267 sec - in org.apache.directory.mavibot.btree.InMemoryBulkDataSorterTest
Running org.apache.directory.mavibot.btree.RevisionNameSerializerTest
Tests run: 1, Failures: 0, Errors: 0, Skipped: 0, Time elapsed: 0.002 sec - in org.apache.directory.mavibot.btree.RevisionNameSerializerTest
Running org.apache.directory.mavibot.btree.MultiThreadedInMemoryBtreeTest
 Time to create 1M entries : 562 milliseconds
Written 0 elements
Written 10000 elements
Written 20000 elements
Written 30000 elements
Written 40000 elements
 Time to create 50K entries and to have 100 threads reading them : 2 seconds
Tests run: 2, Failures: 0, Errors: 0, Skipped: 0, Time elapsed: 3.448 sec - in org.apache.directory.mavibot.btree.MultiThreadedInMemoryBtreeTest
Running org.apache.directory.mavibot.btree.PersistedBTreeDuplicateKeyTest
Tests run: 16, Failures: 0, Errors: 0, Skipped: 1, Time elapsed: 0.148 sec - in org.apache.directory.mavibot.btree.PersistedBTreeDuplicateKeyTest
Running org.apache.directory.mavibot.btree.RecordManagerWithDuplicatesTest
Tests run: 3, Failures: 0, Errors: 0, Skipped: 0, Time elapsed: 0.081 sec - in org.apache.directory.mavibot.btree.RecordManagerWithDuplicatesTest
Running org.apache.directory.mavibot.btree.RecordManagerPrivateMethodTest
/tmp/junit9061062295032209388/0f1391f0-c48d-4332-b987-15a60ba9d0cd/mavibot.db
/tmp/junit8202795095503857832/b6d3cd88-37bd-4914-a98e-4d0209c6778e/mavibot.db
Tests run: 2, Failures: 0, Errors: 0, Skipped: 0, Time elapsed: 0.003 sec - in org.apache.directory.mavibot.btree.RecordManagerPrivateMethodTest
Running org.apache.directory.mavibot.btree.serializer.LongArraySerializerTest
Tests run: 1, Failures: 0, Errors: 0, Skipped: 1, Time elapsed: 0 sec - in org.apache.directory.mavibot.btree.serializer.LongArraySerializerTest
Running org.apache.directory.mavibot.btree.serializer.CharSerializerTest
Tests run: 1, Failures: 0, Errors: 0, Skipped: 0, Time elapsed: 0.001 sec - in org.apache.directory.mavibot.btree.serializer.CharSerializerTest
Running org.apache.directory.mavibot.btree.serializer.ByteSerializerTest
Tests run: 1, Failures: 0, Errors: 0, Skipped: 0, Time elapsed: 0 sec - in org.apache.directory.mavibot.btree.serializer.ByteSerializerTest
Running org.apache.directory.mavibot.btree.serializer.IntSerializerTest
Tests run: 1, Failures: 0, Errors: 0, Skipped: 0, Time elapsed: 0 sec - in org.apache.directory.mavibot.btree.serializer.IntSerializerTest
Running org.apache.directory.mavibot.btree.serializer.BooleanSerializerTest
Tests run: 1, Failures: 0, Errors: 0, Skipped: 0, Time elapsed: 0 sec - in org.apache.directory.mavibot.btree.serializer.BooleanSerializerTest
Running org.apache.directory.mavibot.btree.serializer.ShortSerializerTest
Tests run: 1, Failures: 0, Errors: 0, Skipped: 0, Time elapsed: 0 sec - in org.apache.directory.mavibot.btree.serializer.ShortSerializerTest
Running org.apache.directory.mavibot.btree.serializer.ByteArraySerializerTest
Tests run: 1, Failures: 0, Errors: 0, Skipped: 0, Time elapsed: 0 sec - in org.apache.directory.mavibot.btree.serializer.ByteArraySerializerTest
Running org.apache.directory.mavibot.btree.serializer.StringSerializerTest
Tests run: 1, Failures: 0, Errors: 0, Skipped: 0, Time elapsed: 0 sec - in org.apache.directory.mavibot.btree.serializer.StringSerializerTest
Running org.apache.directory.mavibot.btree.serializer.LongSerializerTest
Tests run: 1, Failures: 0, Errors: 0, Skipped: 0, Time elapsed: 0 sec - in org.apache.directory.mavibot.btree.serializer.LongSerializerTest
Running org.apache.directory.mavibot.btree.PersistedStoreTest
Tests run: 3, Failures: 0, Errors: 0, Skipped: 0, Time elapsed: 0.001 sec - in org.apache.directory.mavibot.btree.PersistedStoreTest
Running org.apache.directory.mavibot.btree.InMemoryBTreeDuplicateKeyTest
Tests run: 14, Failures: 0, Errors: 0, Skipped: 1, Time elapsed: 0.017 sec - in org.apache.directory.mavibot.btree.InMemoryBTreeDuplicateKeyTest
Running org.apache.directory.mavibot.btree.InMemoryBTreeConfigurationTest
Tests run: 2, Failures: 0, Errors: 0, Skipped: 0, Time elapsed: 0.209 sec - in org.apache.directory.mavibot.btree.InMemoryBTreeConfigurationTest
Running org.apache.directory.mavibot.btree.RecordManagerFreePageTest
Delta : 4604, nbError = 0, Nb insertion per second : 2000
Tests run: 1, Failures: 0, Errors: 0, Skipped: 0, Time elapsed: 4.696 sec - in org.apache.directory.mavibot.btree.RecordManagerFreePageTest
Running org.apache.directory.mavibot.btree.RevisionNameComparatorTest
Tests run: 1, Failures: 0, Errors: 0, Skipped: 0, Time elapsed: 0 sec - in org.apache.directory.mavibot.btree.RevisionNameComparatorTest
Running org.apache.directory.mavibot.btree.InMemoryLeafTest
Tests run: 8, Failures: 0, Errors: 0, Skipped: 0, Time elapsed: 0.005 sec - in org.apache.directory.mavibot.btree.InMemoryLeafTest
Running org.apache.directory.mavibot.btree.InMemoryBTreeTest
Node[r7, nbElems:2] -> {r5|<3>|r7|<5>|r7}
Delta1: 333
Delta2: 443
Delta3: 281
Delta4: 512
Nb elements read : 500000
Delta : 80, nbError = 0, Nb searches per second : 6250000
Delta : 2092, nbError = 0, Nb insertion per second : 478011
Delta : 4365, nbError = 0, Nb deletion per second : 229095
Tests run: 36, Failures: 0, Errors: 0, Skipped: 1, Time elapsed: 8.456 sec - in org.apache.directory.mavibot.btree.InMemoryBTreeTest

Results :

Tests run: 158, Failures: 0, Errors: 0, Skipped: 10

[JENKINS] Recording test results
[INFO] 
[INFO] --- maven-jar-plugin:2.5:jar (default-jar) @ mavibot ---
[INFO] Building jar: <https://builds.apache.org/job/dir-mavibot-ubuntu-deploy/ws/mavibot/target/mavibot-1.0.0-M6-SNAPSHOT.jar>
[INFO] 
[INFO] --- maven-site-plugin:3.3:attach-descriptor (attach-descriptor) @ mavibot ---
[INFO] 
[INFO] --- tools-maven-plugin:1.4:verify-legal-files (verify-legal-files) @ mavibot ---
[INFO] Checking legal files in: mavibot-1.0.0-M6-SNAPSHOT.jar
[INFO] 
[INFO] --- maven-source-plugin:2.2.1:jar-no-fork (attach-source) @ mavibot ---
[INFO] Building jar: <https://builds.apache.org/job/dir-mavibot-ubuntu-deploy/ws/mavibot/target/mavibot-1.0.0-M6-SNAPSHOT-sources.jar>
[INFO] 
[INFO] --- maven-install-plugin:2.5.1:install (default-install) @ mavibot ---
[INFO] Installing <https://builds.apache.org/job/dir-mavibot-ubuntu-deploy/ws/mavibot/target/mavibot-1.0.0-M6-SNAPSHOT.jar>
to /home/jenkins/jenkins-slave/maven-repositories/2/org/apache/directory/mavibot/mavibot/1.0.0-M6-SNAPSHOT/mavibot-1.0.0-M6-SNAPSHOT.jar
[INFO] Installing <https://builds.apache.org/job/dir-mavibot-ubuntu-deploy/ws/mavibot/pom.xml>
to /home/jenkins/jenkins-slave/maven-repositories/2/org/apache/directory/mavibot/mavibot/1.0.0-M6-SNAPSHOT/mavibot-1.0.0-M6-SNAPSHOT.pom
[INFO] Installing <https://builds.apache.org/job/dir-mavibot-ubuntu-deploy/ws/mavibot/target/mavibot-1.0.0-M6-SNAPSHOT-sources.jar>
to /home/jenkins/jenkins-slave/maven-repositories/2/org/apache/directory/mavibot/mavibot/1.0.0-M6-SNAPSHOT/mavibot-1.0.0-M6-SNAPSHOT-sources.jar
[INFO] 
[INFO] --- maven-deploy-plugin:2.8.1:deploy (default-deploy) @ mavibot ---
Downloading: https://repository.apache.org/content/repositories/snapshots/org/apache/directory/mavibot/mavibot/1.0.0-M6-SNAPSHOT/maven-metadata.xml
[WARNING] Could not transfer metadata org.apache.directory.mavibot:mavibot:1.0.0-M6-SNAPSHOT/maven-metadata.xml
from/to apache.snapshots.https (https://repository.apache.org/content/repositories/snapshots):
Failed to transfer file: https://repository.apache.org/content/repositories/snapshots/org/apache/directory/mavibot/mavibot/1.0.0-M6-SNAPSHOT/maven-metadata.xml.
Return code is: 502, ReasonPhrase:Proxy Error.
[INFO] ------------------------------------------------------------------------
[INFO] Reactor Summary:
[INFO] 
[INFO] ApacheDS Mavibot Parent ........................... SUCCESS [2:56.777s]
[INFO] ApacheDS MVCC BTree implementation ................ FAILURE [2:29.825s]
[INFO] Apache Mavibot Distribution ....................... SKIPPED
[INFO] ------------------------------------------------------------------------
[INFO] BUILD FAILURE
[INFO] ------------------------------------------------------------------------
[INFO] Total time: 5:34.281s
[INFO] Finished at: Tue Aug 26 03:07:21 UTC 2014
[INFO] Final Memory: 24M/167M
[INFO] ------------------------------------------------------------------------
Waiting for Jenkins to finish collecting data[ERROR] Failed to execute goal org.apache.maven.plugins:maven-deploy-plugin:2.8.1:deploy
(default-deploy) on project mavibot: Failed to retrieve remote metadata org.apache.directory.mavibot:mavibot:1.0.0-M6-SNAPSHOT/maven-metadata.xml:
Could not transfer metadata org.apache.directory.mavibot:mavibot:1.0.0-M6-SNAPSHOT/maven-metadata.xml
from/to apache.snapshots.https (https://repository.apache.org/content/repositories/snapshots):
Failed to transfer file: https://repository.apache.org/content/repositories/snapshots/org/apache/directory/mavibot/mavibot/1.0.0-M6-SNAPSHOT/maven-metadata.xml.
Return code is: 502, ReasonPhrase:Proxy Error. -> [Help 1]
[ERROR] 
[ERROR] To see the full stack trace of the errors, re-run Maven with the -e switch.
[ERROR] Re-run Maven using the -X switch to enable full debug logging.
[ERROR] 
[ERROR] For more information about the errors and possible solutions, please read the following
articles:
[ERROR] [Help 1] http://cwiki.apache.org/confluence/display/MAVEN/MojoExecutionException
[ERROR] 
[ERROR] After correcting the problems, you can resume the build with the command
[ERROR]   mvn <goals> -rf :mavibot

[JENKINS] Archiving <https://builds.apache.org/job/dir-mavibot-ubuntu-deploy/ws/mavibot/pom.xml>
to org.apache.directory.mavibot/mavibot/1.0.0-M6-SNAPSHOT/mavibot-1.0.0-M6-SNAPSHOT.pom
[JENKINS] Archiving <https://builds.apache.org/job/dir-mavibot-ubuntu-deploy/ws/mavibot/target/mavibot-1.0.0-M6-SNAPSHOT.jar>
to org.apache.directory.mavibot/mavibot/1.0.0-M6-SNAPSHOT/mavibot-1.0.0-M6-SNAPSHOT.jar
[JENKINS] Archiving <https://builds.apache.org/job/dir-mavibot-ubuntu-deploy/ws/mavibot/target/mavibot-1.0.0-M6-SNAPSHOT-sources.jar>
to org.apache.directory.mavibot/mavibot/1.0.0-M6-SNAPSHOT/mavibot-1.0.0-M6-SNAPSHOT-sources.jar
Sending artifact delta relative to dir-mavibot-ubuntu-deploy ? ApacheDS MVCC BTree implementation
#350
Archived 3 artifacts
Archive block size is 32768
Received 0 blocks and 524333 bytes
Compression is 0.0%
Took 0.34 sec
[JENKINS] Archiving <https://builds.apache.org/job/dir-mavibot-ubuntu-deploy/ws/pom.xml>
to org.apache.directory.mavibot/mavibot-parent/1.0.0-M6-SNAPSHOT/mavibot-parent-1.0.0-M6-SNAPSHOT.pom
Sending artifact delta relative to dir-mavibot-ubuntu-deploy ? ApacheDS Mavibot Parent #350
Archived 1 artifacts
Archive block size is 32768
Received 0 blocks and 15073 bytes
Compression is 0.0%
Took 0.13 sec
[JENKINS] Archiving <https://builds.apache.org/job/dir-mavibot-ubuntu-deploy/ws/distribution/pom.xml>
to org.apache.directory.mavibot/distribution/1.0.0-M6-SNAPSHOT/distribution-1.0.0-M6-SNAPSHOT.pom
Sending artifact delta relative to dir-mavibot-ubuntu-deploy ? Apache Mavibot Distribution
#350
Archived 1 artifacts
Archive block size is 32768
Received 0 blocks and 2815 bytes
Compression is 0.0%
Took 0.1 sec
channel stopped

Mime
View raw message