directory-notifications mailing list archives

Site index · List index
Message view « Date » · « Thread »
Top « Date » · « Thread »
From Apache Jenkins Server <jenk...@builds.apache.org>
Subject Build failed in Jenkins: dir-apacheds-jdbm-ubuntu-deploy #858
Date Mon, 18 Aug 2014 03:16:27 GMT
See <https://builds.apache.org/job/dir-apacheds-jdbm-ubuntu-deploy/858/>

------------------------------------------
[...truncated 56 lines...]
[INFO] ------------------------------------------------------------------------
[INFO] Building ApacheDS JDBM Original Implementation 2.0.0-M3-SNAPSHOT
[INFO] ------------------------------------------------------------------------
[INFO] 
[INFO] --- maven-clean-plugin:2.4.1:clean (default-clean) @ apacheds-jdbm1 ---
[INFO] Deleting <https://builds.apache.org/job/dir-apacheds-jdbm-ubuntu-deploy/ws/jdbm1/target>
[INFO] 
[INFO] --- maven-remote-resources-plugin:1.2.1:process (default) @ apacheds-jdbm1 ---
[INFO] 
[INFO] --- maven-resources-plugin:2.6:resources (default-resources) @ apacheds-jdbm1 ---
[INFO] Using 'UTF-8' encoding to copy filtered resources.
[INFO] Copying 6 resources
[INFO] Copying 3 resources
[INFO] 
[INFO] --- maven-compiler-plugin:3.1:compile (default-compile) @ apacheds-jdbm1 ---
[INFO] Changes detected - recompiling the module!
[INFO] Compiling 58 source files to <https://builds.apache.org/job/dir-apacheds-jdbm-ubuntu-deploy/ws/jdbm1/target/classes>
[WARNING] <https://builds.apache.org/job/dir-apacheds-jdbm-ubuntu-deploy/ws/jdbm1/src/main/java/jdbm/htree/HashDirectory.java>:
Some input files use unchecked or unsafe operations.
[WARNING] <https://builds.apache.org/job/dir-apacheds-jdbm-ubuntu-deploy/ws/jdbm1/src/main/java/jdbm/htree/HashDirectory.java>:
Recompile with -Xlint:unchecked for details.
[INFO] 
[INFO] --- maven-resources-plugin:2.6:testResources (default-testResources) @ apacheds-jdbm1
---
[INFO] Using 'UTF-8' encoding to copy filtered resources.
[INFO] skip non existing resourceDirectory <https://builds.apache.org/job/dir-apacheds-jdbm-ubuntu-deploy/ws/jdbm1/src/test/resources>
[INFO] Copying 3 resources
[INFO] 
[INFO] --- maven-compiler-plugin:3.1:testCompile (default-testCompile) @ apacheds-jdbm1 ---
[INFO] Changes detected - recompiling the module!
[INFO] Compiling 3 source files to <https://builds.apache.org/job/dir-apacheds-jdbm-ubuntu-deploy/ws/jdbm1/target/test-classes>
[WARNING] <https://builds.apache.org/job/dir-apacheds-jdbm-ubuntu-deploy/ws/jdbm1/src/test/java/jdbm/btree/TestBTree.java>:
<https://builds.apache.org/job/dir-apacheds-jdbm-ubuntu-deploy/ws/jdbm1/src/test/java/jdbm/btree/TestBTree.java>
uses unchecked or unsafe operations.
[WARNING] <https://builds.apache.org/job/dir-apacheds-jdbm-ubuntu-deploy/ws/jdbm1/src/test/java/jdbm/btree/TestBTree.java>:
Recompile with -Xlint:unchecked for details.
[INFO] 
[INFO] --- maven-surefire-plugin:2.17:test (default-test) @ apacheds-jdbm1 ---
[INFO] Surefire report directory: <https://builds.apache.org/job/dir-apacheds-jdbm-ubuntu-deploy/ws/jdbm1/target/surefire-reports>

-------------------------------------------------------
 T E S T S
-------------------------------------------------------
Running jdbm.btree.TestBTree
Tests run: 10, Failures: 0, Errors: 0, Skipped: 1, Time elapsed: 10.167 sec - in jdbm.btree.TestBTree
Running jdbm.recman.LocationTest
Tests run: 8, Failures: 0, Errors: 0, Skipped: 2, Time elapsed: 0 sec - in jdbm.recman.LocationTest

Results :

Tests run: 18, Failures: 0, Errors: 0, Skipped: 3

[JENKINS] Recording test results
[INFO] 
[INFO] --- maven-bundle-plugin:2.5.0:bundle (default-bundle) @ apacheds-jdbm1 ---
[INFO] 
[INFO] --- maven-site-plugin:3.0:attach-descriptor (attach-descriptor) @ apacheds-jdbm1 ---
[INFO] 
[INFO] --- tools-maven-plugin:1.4:verify-legal-files (verify-legal-files) @ apacheds-jdbm1
---
[INFO] Checking legal files in: apacheds-jdbm1-2.0.0-M3-SNAPSHOT.jar
[INFO] 
[INFO] --- maven-install-plugin:2.5.1:install (default-install) @ apacheds-jdbm1 ---
[INFO] Installing <https://builds.apache.org/job/dir-apacheds-jdbm-ubuntu-deploy/ws/jdbm1/target/apacheds-jdbm1-2.0.0-M3-SNAPSHOT.jar>
to /home/jenkins/jenkins-slave/maven-repositories/1/org/apache/directory/jdbm/apacheds-jdbm1/2.0.0-M3-SNAPSHOT/apacheds-jdbm1-2.0.0-M3-SNAPSHOT.jar
[INFO] Installing <https://builds.apache.org/job/dir-apacheds-jdbm-ubuntu-deploy/ws/jdbm1/pom.xml>
to /home/jenkins/jenkins-slave/maven-repositories/1/org/apache/directory/jdbm/apacheds-jdbm1/2.0.0-M3-SNAPSHOT/apacheds-jdbm1-2.0.0-M3-SNAPSHOT.pom
[INFO] 
[INFO] --- maven-bundle-plugin:2.5.0:install (default-install) @ apacheds-jdbm1 ---
[WARNING] Exception while updating local OBR: Unable to read repository xml: file:/home/jenkins/jenkins-slave/maven-repositories/1/repository.xml
org.apache.maven.plugin.MojoExecutionException: Unable to read repository xml: file:/home/jenkins/jenkins-slave/maven-repositories/1/repository.xml
	at org.apache.felix.obrplugin.ObrUpdate.parseRepositoryXml(ObrUpdate.java:324)
	at org.apache.felix.obrplugin.ObrInstall.execute(ObrInstall.java:143)
	at org.apache.maven.plugin.DefaultBuildPluginManager.executeMojo(DefaultBuildPluginManager.java:101)
	at org.apache.maven.lifecycle.internal.MojoExecutor.execute(MojoExecutor.java:209)
	at org.apache.maven.lifecycle.internal.MojoExecutor.execute(MojoExecutor.java:153)
	at org.apache.maven.lifecycle.internal.MojoExecutor.execute(MojoExecutor.java:145)
	at org.apache.maven.lifecycle.internal.LifecycleModuleBuilder.buildProject(LifecycleModuleBuilder.java:84)
	at org.apache.maven.lifecycle.internal.LifecycleModuleBuilder.buildProject(LifecycleModuleBuilder.java:59)
	at org.apache.maven.lifecycle.internal.LifecycleStarter.singleThreadedBuild(LifecycleStarter.java:183)
	at org.apache.maven.lifecycle.internal.LifecycleStarter.execute(LifecycleStarter.java:161)
	at org.apache.maven.DefaultMaven.doExecute(DefaultMaven.java:320)
	at org.apache.maven.DefaultMaven.execute(DefaultMaven.java:156)
	at org.jvnet.hudson.maven3.launcher.Maven3Launcher.main(Maven3Launcher.java:117)
	at sun.reflect.NativeMethodAccessorImpl.invoke0(Native Method)
	at sun.reflect.NativeMethodAccessorImpl.invoke(NativeMethodAccessorImpl.java:57)
	at sun.reflect.DelegatingMethodAccessorImpl.invoke(DelegatingMethodAccessorImpl.java:43)
	at java.lang.reflect.Method.invoke(Method.java:606)
	at org.codehaus.plexus.classworlds.launcher.Launcher.launchStandard(Launcher.java:329)
	at org.codehaus.plexus.classworlds.launcher.Launcher.launch(Launcher.java:239)
	at org.jvnet.hudson.maven3.agent.Maven3Main.launch(Maven3Main.java:178)
	at sun.reflect.NativeMethodAccessorImpl.invoke0(Native Method)
	at sun.reflect.NativeMethodAccessorImpl.invoke(NativeMethodAccessorImpl.java:57)
	at sun.reflect.DelegatingMethodAccessorImpl.invoke(DelegatingMethodAccessorImpl.java:43)
	at java.lang.reflect.Method.invoke(Method.java:606)
	at hudson.maven.Maven3Builder.call(Maven3Builder.java:134)
	at hudson.maven.Maven3Builder.call(Maven3Builder.java:69)
	at hudson.remoting.UserRequest.perform(UserRequest.java:118)
	at hudson.remoting.UserRequest.perform(UserRequest.java:48)
	at hudson.remoting.Request$2.run(Request.java:328)
	at hudson.remoting.InterceptingExecutorService$1.call(InterceptingExecutorService.java:72)
	at java.util.concurrent.FutureTask$Sync.innerRun(FutureTask.java:334)
	at java.util.concurrent.FutureTask.run(FutureTask.java:166)
	at java.util.concurrent.ThreadPoolExecutor.runWorker(ThreadPoolExecutor.java:1145)
	at java.util.concurrent.ThreadPoolExecutor$Worker.run(ThreadPoolExecutor.java:615)
	at java.lang.Thread.run(Thread.java:724)
Caused by: org.xmlpull.v1.XmlPullParserException: unexpected type (position:END_DOCUMENT null@3:1
in java.io.InputStreamReader@461db6) 
	at org.kxml2.io.KXmlParser.exception(Unknown Source)
	at org.kxml2.io.KXmlParser.nextTag(Unknown Source)
	at org.apache.felix.bundlerepository.impl.PullParser.parseRepository(PullParser.java:43)
	at org.apache.felix.bundlerepository.impl.DataModelHelperImpl.repository(DataModelHelperImpl.java:147)
	at org.apache.felix.bundlerepository.impl.DataModelHelperImpl.repository(DataModelHelperImpl.java:118)
	at org.apache.felix.obrplugin.ObrUpdate.parseRepositoryXml(ObrUpdate.java:316)
	... 34 more
[INFO] 
[INFO] --- maven-deploy-plugin:2.8.1:deploy (default-deploy) @ apacheds-jdbm1 ---
Downloading: https://repository.apache.org/content/repositories/snapshots/org/apache/directory/jdbm/apacheds-jdbm1/2.0.0-M3-SNAPSHOT/maven-metadata.xml
Downloaded: https://repository.apache.org/content/repositories/snapshots/org/apache/directory/jdbm/apacheds-jdbm1/2.0.0-M3-SNAPSHOT/maven-metadata.xml
(804 B at 0.1 KB/sec)
Uploading: https://repository.apache.org/content/repositories/snapshots/org/apache/directory/jdbm/apacheds-jdbm1/2.0.0-M3-SNAPSHOT/apacheds-jdbm1-2.0.0-M3-20140818.030448-512.jar
[WARNING] Failed to upload MD5 checksum for <https://builds.apache.org/job/dir-apacheds-jdbm-ubuntu-deploy/ws/jdbm1/target/apacheds-jdbm1-2.0.0-M3-SNAPSHOT.jar>:
Failed to transfer file: https://repository.apache.org/content/repositories/snapshots/org/apache/directory/jdbm/apacheds-jdbm1/2.0.0-M3-SNAPSHOT/apacheds-jdbm1-2.0.0-M3-20140818.030448-512.jar.md5.
Return code is: 502, ReasonPhrase:Proxy Error.
org.apache.maven.wagon.TransferFailedException: Failed to transfer file: https://repository.apache.org/content/repositories/snapshots/org/apache/directory/jdbm/apacheds-jdbm1/2.0.0-M3-SNAPSHOT/apacheds-jdbm1-2.0.0-M3-20140818.030448-512.jar.md5.
Return code is: 502, ReasonPhrase:Proxy Error.
	at org.apache.maven.wagon.shared.http4.AbstractHttpClientWagon.put(AbstractHttpClientWagon.java:562)
	at org.apache.maven.wagon.shared.http4.AbstractHttpClientWagon.put(AbstractHttpClientWagon.java:471)
	at org.apache.maven.wagon.shared.http4.AbstractHttpClientWagon.putFromStream(AbstractHttpClientWagon.java:465)
	at org.sonatype.aether.connector.wagon.WagonRepositoryConnector$PutTask.uploadChecksum(WagonRepositoryConnector.java:886)
	at org.sonatype.aether.connector.wagon.WagonRepositoryConnector$PutTask.uploadChecksums(WagonRepositoryConnector.java:861)
	at org.sonatype.aether.connector.wagon.WagonRepositoryConnector$PutTask.run(WagonRepositoryConnector.java:818)
	at org.sonatype.aether.connector.wagon.WagonRepositoryConnector.put(WagonRepositoryConnector.java:467)
	at org.sonatype.aether.impl.internal.DefaultDeployer.deploy(DefaultDeployer.java:274)
	at org.sonatype.aether.impl.internal.DefaultDeployer.deploy(DefaultDeployer.java:211)
	at org.sonatype.aether.impl.internal.DefaultRepositorySystem.deploy(DefaultRepositorySystem.java:443)
	at org.apache.maven.artifact.deployer.DefaultArtifactDeployer.deploy(DefaultArtifactDeployer.java:137)
	at org.apache.maven.plugin.deploy.AbstractDeployMojo.deploy(AbstractDeployMojo.java:171)
	at org.apache.maven.plugin.deploy.DeployMojo.deployProject(DeployMojo.java:248)
	at org.apache.maven.plugin.deploy.DeployMojo.execute(DeployMojo.java:169)
	at org.apache.maven.plugin.DefaultBuildPluginManager.executeMojo(DefaultBuildPluginManager.java:101)
	at org.apache.maven.lifecycle.internal.MojoExecutor.execute(MojoExecutor.java:209)
	at org.apache.maven.lifecycle.internal.MojoExecutor.execute(MojoExecutor.java:153)
	at org.apache.maven.lifecycle.internal.MojoExecutor.execute(MojoExecutor.java:145)
	at org.apache.maven.lifecycle.internal.LifecycleModuleBuilder.buildProject(LifecycleModuleBuilder.java:84)
	at org.apache.maven.lifecycle.internal.LifecycleModuleBuilder.buildProject(LifecycleModuleBuilder.java:59)
	at org.apache.maven.lifecycle.internal.LifecycleStarter.singleThreadedBuild(LifecycleStarter.java:183)
	at org.apache.maven.lifecycle.internal.LifecycleStarter.execute(LifecycleStarter.java:161)
	at org.apache.maven.DefaultMaven.doExecute(DefaultMaven.java:320)
	at org.apache.maven.DefaultMaven.execute(DefaultMaven.java:156)
	at org.jvnet.hudson.maven3.launcher.Maven3Launcher.main(Maven3Launcher.java:117)
	at sun.reflect.NativeMethodAccessorImpl.invoke0(Native Method)
	at sun.reflect.NativeMethodAccessorImpl.invoke(NativeMethodAccessorImpl.java:57)
	at sun.reflect.DelegatingMethodAccessorImpl.invoke(DelegatingMethodAccessorImpl.java:43)
	at java.lang.reflect.Method.invoke(Method.java:606)
	at org.codehaus.plexus.classworlds.launcher.Launcher.launchStandard(Launcher.java:329)
	at org.codehaus.plexus.classworlds.launcher.Launcher.launch(Launcher.java:239)
	at org.jvnet.hudson.maven3.agent.Maven3Main.launch(Maven3Main.java:178)
	at sun.reflect.NativeMethodAccessorImpl.invoke0(Native Method)
	at sun.reflect.NativeMethodAccessorImpl.invoke(NativeMethodAccessorImpl.java:57)
	at sun.reflect.DelegatingMethodAccessorImpl.invoke(DelegatingMethodAccessorImpl.java:43)
	at java.lang.reflect.Method.invoke(Method.java:606)
	at hudson.maven.Maven3Builder.call(Maven3Builder.java:134)
	at hudson.maven.Maven3Builder.call(Maven3Builder.java:69)
	at hudson.remoting.UserRequest.perform(UserRequest.java:118)
	at hudson.remoting.UserRequest.perform(UserRequest.java:48)
	at hudson.remoting.Request$2.run(Request.java:328)
	at hudson.remoting.InterceptingExecutorService$1.call(InterceptingExecutorService.java:72)
	at java.util.concurrent.FutureTask$Sync.innerRun(FutureTask.java:334)
	at java.util.concurrent.FutureTask.run(FutureTask.java:166)
	at java.util.concurrent.ThreadPoolExecutor.runWorker(ThreadPoolExecutor.java:1145)
	at java.util.concurrent.ThreadPoolExecutor$Worker.run(ThreadPoolExecutor.java:615)
	at java.lang.Thread.run(Thread.java:724)
Uploaded: https://repository.apache.org/content/repositories/snapshots/org/apache/directory/jdbm/apacheds-jdbm1/2.0.0-M3-SNAPSHOT/apacheds-jdbm1-2.0.0-M3-20140818.030448-512.jar
(103 KB at 1.3 KB/sec)
Uploading: https://repository.apache.org/content/repositories/snapshots/org/apache/directory/jdbm/apacheds-jdbm1/2.0.0-M3-SNAPSHOT/apacheds-jdbm1-2.0.0-M3-20140818.030448-512.pom
Uploaded: https://repository.apache.org/content/repositories/snapshots/org/apache/directory/jdbm/apacheds-jdbm1/2.0.0-M3-SNAPSHOT/apacheds-jdbm1-2.0.0-M3-20140818.030448-512.pom
(3 KB at 0.1 KB/sec)
Downloading: https://repository.apache.org/content/repositories/snapshots/org/apache/directory/jdbm/apacheds-jdbm1/maven-metadata.xml
Downloaded: https://repository.apache.org/content/repositories/snapshots/org/apache/directory/jdbm/apacheds-jdbm1/maven-metadata.xml
(365 B at 0.0 KB/sec)
Uploading: https://repository.apache.org/content/repositories/snapshots/org/apache/directory/jdbm/apacheds-jdbm1/2.0.0-M3-SNAPSHOT/maven-metadata.xml
Uploaded: https://repository.apache.org/content/repositories/snapshots/org/apache/directory/jdbm/apacheds-jdbm1/2.0.0-M3-SNAPSHOT/maven-metadata.xml
(804 B at 0.3 KB/sec)
Uploading: https://repository.apache.org/content/repositories/snapshots/org/apache/directory/jdbm/apacheds-jdbm1/maven-metadata.xml
Uploaded: https://repository.apache.org/content/repositories/snapshots/org/apache/directory/jdbm/apacheds-jdbm1/maven-metadata.xml
(365 B at 0.4 KB/sec)
[INFO] 
[INFO] --- maven-bundle-plugin:2.5.0:deploy (default-deploy) @ apacheds-jdbm1 ---
[INFO] Remote OBR update disabled (enable with -DremoteOBR)
[INFO]                                                                         
[INFO] ------------------------------------------------------------------------
[INFO] Building ApacheDS JDBM Implementation MVCC 2.0.0-M3-SNAPSHOT
[INFO] ------------------------------------------------------------------------
[INFO] 
[INFO] --- maven-clean-plugin:2.4.1:clean (default-clean) @ apacheds-jdbm2 ---
[INFO] Deleting <https://builds.apache.org/job/dir-apacheds-jdbm-ubuntu-deploy/ws/jdbm2/target>
[INFO] 
[INFO] --- maven-remote-resources-plugin:1.2.1:process (default) @ apacheds-jdbm2 ---
[INFO] 
[INFO] --- maven-resources-plugin:2.6:resources (default-resources) @ apacheds-jdbm2 ---
[INFO] Using 'UTF-8' encoding to copy filtered resources.
[INFO] Copying 6 resources
[INFO] Copying 3 resources
[INFO] 
[INFO] --- maven-compiler-plugin:3.1:compile (default-compile) @ apacheds-jdbm2 ---
[INFO] Changes detected - recompiling the module!
[INFO] Compiling 65 source files to <https://builds.apache.org/job/dir-apacheds-jdbm-ubuntu-deploy/ws/jdbm2/target/classes>
[WARNING] <https://builds.apache.org/job/dir-apacheds-jdbm-ubuntu-deploy/ws/jdbm2/src/main/java/jdbm/htree/HashDirectory.java>:
Some input files use unchecked or unsafe operations.
[WARNING] <https://builds.apache.org/job/dir-apacheds-jdbm-ubuntu-deploy/ws/jdbm2/src/main/java/jdbm/htree/HashDirectory.java>:
Recompile with -Xlint:unchecked for details.
[INFO] 
[INFO] --- maven-resources-plugin:2.6:testResources (default-testResources) @ apacheds-jdbm2
---
[INFO] Using 'UTF-8' encoding to copy filtered resources.
[INFO] Copying 1 resource
[INFO] Copying 3 resources
[INFO] 
[INFO] --- maven-compiler-plugin:3.1:testCompile (default-testCompile) @ apacheds-jdbm2 ---
[INFO] Changes detected - recompiling the module!
[INFO] Compiling 8 source files to <https://builds.apache.org/job/dir-apacheds-jdbm-ubuntu-deploy/ws/jdbm2/target/test-classes>
[WARNING] <https://builds.apache.org/job/dir-apacheds-jdbm-ubuntu-deploy/ws/jdbm2/src/test/java/jdbm/btree/TestBTree.java>:
Some input files use unchecked or unsafe operations.
[WARNING] <https://builds.apache.org/job/dir-apacheds-jdbm-ubuntu-deploy/ws/jdbm2/src/test/java/jdbm/btree/TestBTree.java>:
Recompile with -Xlint:unchecked for details.
[INFO] 
[INFO] --- maven-surefire-plugin:2.17:test (default-test) @ apacheds-jdbm2 ---
[INFO] Surefire report directory: <https://builds.apache.org/job/dir-apacheds-jdbm-ubuntu-deploy/ws/jdbm2/target/surefire-reports>

-------------------------------------------------------
 T E S T S
-------------------------------------------------------
Running jdbm.helper.TestVersionedCache
Sum is: 1027
Tests run: 2, Failures: 0, Errors: 0, Skipped: 0, Time elapsed: 0.562 sec - in jdbm.helper.TestVersionedCache
Running jdbm.helper.TestActionVersioning
Tests run: 1, Failures: 0, Errors: 0, Skipped: 0, Time elapsed: 0.001 sec - in jdbm.helper.TestActionVersioning
Running jdbm.btree.TestSnapshotBTree
 TestLongBrowsing read thread min key is0max value is0
 TestLongBrowsing read thread min key is0max value is1
 TestLongBrowsing read thread min key is0max value is1
 TestLongBrowsing read thread min key is0max value is1
TestLongBrowsing read thread count is 10000
TestLongBrowsing read thread count is 10000
TestLongBrowsing read thread count is 10000
TestLongBrowsing read thread count is 10000
TestLongBrowsing updates ended
[JENKINS] Recording test results
Waiting for Jenkins to finish collecting data
[JENKINS] Archiving <https://builds.apache.org/job/dir-apacheds-jdbm-ubuntu-deploy/ws/jdbm2/pom.xml>
to org.apache.directory.jdbm/apacheds-jdbm2/2.0.0-M3-SNAPSHOT/apacheds-jdbm2-2.0.0-M3-SNAPSHOT.pom
[JENKINS] Archiving <https://builds.apache.org/job/dir-apacheds-jdbm-ubuntu-deploy/ws/jdbm2/target/apacheds-jdbm2-2.0.0-M3-SNAPSHOT.jar>
to org.apache.directory.jdbm/apacheds-jdbm2/2.0.0-M3-SNAPSHOT/apacheds-jdbm2-2.0.0-M3-SNAPSHOT.jar
Sending artifact delta relative to dir-apacheds-jdbm-ubuntu-deploy ? ApacheDS JDBM Implementation
MVCC #856
Archived 2 artifacts
Archive block size is 32768
Received 0 blocks and 146915 bytes
Compression is 0.0%
Took 59 ms
[JENKINS] Archiving <https://builds.apache.org/job/dir-apacheds-jdbm-ubuntu-deploy/ws/pom.xml>
to org.apache.directory.jdbm/apacheds-jdbm-parent/2.0.0-M3-SNAPSHOT/apacheds-jdbm-parent-2.0.0-M3-SNAPSHOT.pom
Sending artifact delta relative to dir-apacheds-jdbm-ubuntu-deploy ? ApacheDS JDBM #856
Archived 1 artifacts
Archive block size is 32768
Received 0 blocks and 18154 bytes
Compression is 0.0%
Took 12 ms
[JENKINS] Archiving <https://builds.apache.org/job/dir-apacheds-jdbm-ubuntu-deploy/ws/jdbm1/pom.xml>
to org.apache.directory.jdbm/apacheds-jdbm1/2.0.0-M3-SNAPSHOT/apacheds-jdbm1-2.0.0-M3-SNAPSHOT.pom
[JENKINS] Archiving <https://builds.apache.org/job/dir-apacheds-jdbm-ubuntu-deploy/ws/jdbm1/target/apacheds-jdbm1-2.0.0-M3-SNAPSHOT.jar>
to org.apache.directory.jdbm/apacheds-jdbm1/2.0.0-M3-20140818.030448-512/apacheds-jdbm1-2.0.0-M3-20140818.030448-512.jar
Sending artifact delta relative to dir-apacheds-jdbm-ubuntu-deploy ? ApacheDS JDBM Original
Implementation #856
Archived 2 artifacts
Archive block size is 32768
Received 0 blocks and 108064 bytes
Compression is 0.0%
Took 37 ms

Mime
View raw message