directory-notifications mailing list archives

Site index · List index
Message view « Date » · « Thread »
Top « Date » · « Thread »
From Apache Jenkins Server <jenk...@builds.apache.org>
Subject Build failed in Jenkins: dir-studio-maven-plugin-deploy-site #1412
Date Sun, 24 Aug 2014 03:07:24 GMT
See <https://builds.apache.org/job/dir-studio-maven-plugin-deploy-site/1412/>

------------------------------------------
[...truncated 37 lines...]
Downloaded: http://repo.maven.apache.org/maven2/org/apache/felix/org.apache.felix.bundlerepository/1.6.2/org.apache.felix.bundlerepository-1.6.2.pom
(6 KB at 99.6 KB/sec)
Downloading: http://repo.maven.apache.org/maven2/org/apache/felix/org.osgi.core/1.0.0/org.osgi.core-1.0.0.pom
Downloaded: http://repo.maven.apache.org/maven2/org/apache/felix/org.osgi.core/1.0.0/org.osgi.core-1.0.0.pom
(0 B at 0.0 KB/sec)
Downloading: http://repo.maven.apache.org/maven2/org/apache/felix/felix/1.0.0/felix-1.0.0.pom
Downloaded: http://repo.maven.apache.org/maven2/org/apache/felix/felix/1.0.0/felix-1.0.0.pom
(0 B at 0.0 KB/sec)
Downloading: http://repo.maven.apache.org/maven2/org/apache/felix/org.osgi.service.obr/1.0.1/org.osgi.service.obr-1.0.1.pom
Downloaded: http://repo.maven.apache.org/maven2/org/apache/felix/org.osgi.service.obr/1.0.1/org.osgi.service.obr-1.0.1.pom
(0 B at 0.0 KB/sec)
Downloading: http://repo.maven.apache.org/maven2/org/apache/felix/felix/1.0.2/felix-1.0.2.pom
Downloaded: http://repo.maven.apache.org/maven2/org/apache/felix/felix/1.0.2/felix-1.0.2.pom
(0 B at 0.0 KB/sec)
Downloading: http://repo.maven.apache.org/maven2/org/apache/maven/wagon/wagon-provider-api/1.0-alpha-5/wagon-provider-api-1.0-alpha-5.pom
Downloaded: http://repo.maven.apache.org/maven2/org/apache/maven/wagon/wagon-provider-api/1.0-alpha-5/wagon-provider-api-1.0-alpha-5.pom
(5 KB at 81.2 KB/sec)
Downloading: http://repo.maven.apache.org/maven2/org/codehaus/plexus/plexus-utils/1.4.7/plexus-utils-1.4.7.pom
Downloaded: http://repo.maven.apache.org/maven2/org/codehaus/plexus/plexus-utils/1.4.7/plexus-utils-1.4.7.pom
(0 B at 0.0 KB/sec)
Downloading: http://repo.maven.apache.org/maven2/org/apache/maven/release/maven-release-manager/2.1/maven-release-manager-2.1.pom
Downloaded: http://repo.maven.apache.org/maven2/org/apache/maven/release/maven-release-manager/2.1/maven-release-manager-2.1.pom
(9 KB at 157.6 KB/sec)
Downloading: http://repo.maven.apache.org/maven2/org/apache/maven/shared/maven-invoker/2.0.9/maven-invoker-2.0.9.pom
Downloaded: http://repo.maven.apache.org/maven2/org/apache/maven/shared/maven-invoker/2.0.9/maven-invoker-2.0.9.pom
(0 B at 0.0 KB/sec)
Downloading: http://repo.maven.apache.org/maven2/org/apache/maven/scm/maven-scm-providers-standard/1.4/maven-scm-providers-standard-1.4.pom
Downloaded: http://repo.maven.apache.org/maven2/org/apache/maven/scm/maven-scm-providers-standard/1.4/maven-scm-providers-standard-1.4.pom
(4 KB at 66.5 KB/sec)
Downloading: http://repo.maven.apache.org/maven2/org/apache/maven/scm/maven-scm-provider-accurev/1.4/maven-scm-provider-accurev-1.4.pom
Downloaded: http://repo.maven.apache.org/maven2/org/apache/maven/scm/maven-scm-provider-accurev/1.4/maven-scm-provider-accurev-1.4.pom
(4 KB at 64.3 KB/sec)
Downloading: http://repo.maven.apache.org/maven2/org/apache/maven/scm/maven-scm-provider-bazaar/1.4/maven-scm-provider-bazaar-1.4.pom
Downloaded: http://repo.maven.apache.org/maven2/org/apache/maven/scm/maven-scm-provider-bazaar/1.4/maven-scm-provider-bazaar-1.4.pom
(3 KB at 37.2 KB/sec)
Downloading: http://repo.maven.apache.org/maven2/org/apache/maven/scm/maven-scm-provider-clearcase/1.4/maven-scm-provider-clearcase-1.4.pom
Downloaded: http://repo.maven.apache.org/maven2/org/apache/maven/scm/maven-scm-provider-clearcase/1.4/maven-scm-provider-clearcase-1.4.pom
(3 KB at 48.5 KB/sec)
Downloading: http://repo.maven.apache.org/maven2/org/apache/maven/scm/maven-scm-provider-synergy/1.4/maven-scm-provider-synergy-1.4.pom
Downloaded: http://repo.maven.apache.org/maven2/org/apache/maven/scm/maven-scm-provider-synergy/1.4/maven-scm-provider-synergy-1.4.pom
(2 KB at 35.3 KB/sec)
Downloading: http://repo.maven.apache.org/maven2/org/apache/maven/scm/maven-scm-provider-vss/1.4/maven-scm-provider-vss-1.4.pom
Downloaded: http://repo.maven.apache.org/maven2/org/apache/maven/scm/maven-scm-provider-vss/1.4/maven-scm-provider-vss-1.4.pom
(3 KB at 46.4 KB/sec)
Downloading: http://repo.maven.apache.org/maven2/org/apache/maven/scm/maven-scm-provider-tfs/1.4/maven-scm-provider-tfs-1.4.pom
Downloaded: http://repo.maven.apache.org/maven2/org/apache/maven/scm/maven-scm-provider-tfs/1.4/maven-scm-provider-tfs-1.4.pom
(3 KB at 50.7 KB/sec)
Downloading: http://repo.maven.apache.org/maven2/jaxen/jaxen/1.1-beta-8/jaxen-1.1-beta-8.pom
Downloaded: http://repo.maven.apache.org/maven2/jaxen/jaxen/1.1-beta-8/jaxen-1.1-beta-8.pom
(7 KB at 121.1 KB/sec)
Downloading: http://repo.maven.apache.org/maven2/org/apache/maven/wagon/wagon-http/1.0-beta-6/wagon-http-1.0-beta-6.pom
Downloaded: http://repo.maven.apache.org/maven2/org/apache/maven/wagon/wagon-http/1.0-beta-6/wagon-http-1.0-beta-6.pom
(4 KB at 61.6 KB/sec)
Downloading: http://repo.maven.apache.org/maven2/org/slf4j/slf4j-nop/1.5.3/slf4j-nop-1.5.3.pom
Downloaded: http://repo.maven.apache.org/maven2/org/slf4j/slf4j-nop/1.5.3/slf4j-nop-1.5.3.pom
(2 KB at 26.4 KB/sec)
Downloading: http://repo.maven.apache.org/maven2/biz/aQute/bndlib/0.0.203/bndlib-0.0.203.pom
Downloaded: http://repo.maven.apache.org/maven2/biz/aQute/bndlib/0.0.203/bndlib-0.0.203.pom
(0 B at 0.0 KB/sec)
Downloading: http://repo.maven.apache.org/maven2/findbugs/annotations/1.0.0/annotations-1.0.0.pom
Downloaded: http://repo.maven.apache.org/maven2/findbugs/annotations/1.0.0/annotations-1.0.0.pom
(376 B at 6.8 KB/sec)
Downloading: http://repo.maven.apache.org/maven2/org/apache/maven/wagon/wagon-file/1.0-alpha-5/wagon-file-1.0-alpha-5.pom
Downloaded: http://repo.maven.apache.org/maven2/org/apache/maven/wagon/wagon-file/1.0-alpha-5/wagon-file-1.0-alpha-5.pom
(6 KB at 97.1 KB/sec)
Downloading: http://repo.maven.apache.org/maven2/org/apache/maven/wagon/wagon-http-lightweight/1.0-alpha-5/wagon-http-lightweight-1.0-alpha-5.pom
Downloaded: http://repo.maven.apache.org/maven2/org/apache/maven/wagon/wagon-http-lightweight/1.0-alpha-5/wagon-http-lightweight-1.0-alpha-5.pom
(6 KB at 105.5 KB/sec)
Downloading: http://repo.maven.apache.org/maven2/org/apache/maven/wagon/wagon-ssh/1.0-alpha-5/wagon-ssh-1.0-alpha-5.pom
Downloaded: http://repo.maven.apache.org/maven2/org/apache/maven/wagon/wagon-ssh/1.0-alpha-5/wagon-ssh-1.0-alpha-5.pom
(7 KB at 112.3 KB/sec)
Downloading: http://repo.maven.apache.org/maven2/com/jcraft/jsch/0.1.23/jsch-0.1.23.pom
Downloaded: http://repo.maven.apache.org/maven2/com/jcraft/jsch/0.1.23/jsch-0.1.23.pom (485
B at 8.8 KB/sec)
Downloading: http://repo.maven.apache.org/maven2/org/apache/felix/maven-bundle-plugin/2.1.0/maven-bundle-plugin-2.1.0.jar
Downloading: http://repo.maven.apache.org/maven2/biz/aQute/bndlib/0.0.357/bndlib-0.0.357.jar
Downloading: http://repo.maven.apache.org/maven2/net/sf/kxml/kxml2/2.2.2/kxml2-2.2.2.jar
Downloading: http://repo.maven.apache.org/maven2/org/apache/felix/org.apache.felix.bundlerepository/1.6.2/org.apache.felix.bundlerepository-1.6.2.jar
Downloading: http://repo.maven.apache.org/maven2/org/apache/felix/org.osgi.core/1.0.0/org.osgi.core-1.0.0.jar
Downloaded: http://repo.maven.apache.org/maven2/org/apache/felix/maven-bundle-plugin/2.1.0/maven-bundle-plugin-2.1.0.jar
(130 KB at 874.3 KB/sec)
Downloading: http://repo.maven.apache.org/maven2/org/apache/felix/org.osgi.service.obr/1.0.1/org.osgi.service.obr-1.0.1.jar
Downloaded: http://repo.maven.apache.org/maven2/org/apache/felix/org.osgi.core/1.0.0/org.osgi.core-1.0.0.jar
(0 B at 0.0 KB/sec)
Downloading: http://repo.maven.apache.org/maven2/org/apache/maven/maven-artifact-manager/2.0.7/maven-artifact-manager-2.0.7.jar
Downloaded: http://repo.maven.apache.org/maven2/org/apache/felix/org.apache.felix.bundlerepository/1.6.2/org.apache.felix.bundlerepository-1.6.2.jar
(147 KB at 677.4 KB/sec)
Downloading: http://repo.maven.apache.org/maven2/org/apache/maven/maven-settings/2.0.7/maven-settings-2.0.7.jar
Downloaded: http://repo.maven.apache.org/maven2/biz/aQute/bndlib/0.0.357/bndlib-0.0.357.jar
(273 KB at 1051.8 KB/sec)
Downloading: http://repo.maven.apache.org/maven2/org/apache/maven/release/maven-release-manager/2.1/maven-release-manager-2.1.jar
Downloaded: http://repo.maven.apache.org/maven2/org/apache/maven/maven-settings/2.0.7/maven-settings-2.0.7.jar
(48 KB at 607.1 KB/sec)
Downloading: http://repo.maven.apache.org/maven2/org/apache/maven/shared/maven-invoker/2.0.9/maven-invoker-2.0.9.jar
Downloaded: http://repo.maven.apache.org/maven2/net/sf/kxml/kxml2/2.2.2/kxml2-2.2.2.jar (0
B at 0.0 KB/sec)
Downloading: http://repo.maven.apache.org/maven2/commons-logging/commons-logging/1.0/commons-logging-1.0.jar
Downloaded: http://repo.maven.apache.org/maven2/org/apache/maven/maven-artifact-manager/2.0.7/maven-artifact-manager-2.0.7.jar
(56 KB at 441.5 KB/sec)
Downloading: http://repo.maven.apache.org/maven2/org/apache/maven/scm/maven-scm-provider-accurev/1.4/maven-scm-provider-accurev-1.4.jar
Downloaded: http://repo.maven.apache.org/maven2/org/apache/maven/release/maven-release-manager/2.1/maven-release-manager-2.1.jar
(156 KB at 1520.7 KB/sec)
Downloading: http://repo.maven.apache.org/maven2/org/apache/maven/scm/maven-scm-provider-bazaar/1.4/maven-scm-provider-bazaar-1.4.jar
Downloaded: http://repo.maven.apache.org/maven2/commons-logging/commons-logging/1.0/commons-logging-1.0.jar
(22 KB at 274.8 KB/sec)
Downloading: http://repo.maven.apache.org/maven2/org/apache/maven/scm/maven-scm-provider-clearcase/1.4/maven-scm-provider-clearcase-1.4.jar
Downloaded: http://repo.maven.apache.org/maven2/org/apache/felix/org.osgi.service.obr/1.0.1/org.osgi.service.obr-1.0.1.jar
(0 B at 0.0 KB/sec)
Downloading: http://repo.maven.apache.org/maven2/org/apache/maven/scm/maven-scm-provider-synergy/1.4/maven-scm-provider-synergy-1.4.jar
Downloaded: http://repo.maven.apache.org/maven2/org/apache/maven/scm/maven-scm-provider-bazaar/1.4/maven-scm-provider-bazaar-1.4.jar
(53 KB at 949.3 KB/sec)
Downloading: http://repo.maven.apache.org/maven2/org/apache/maven/scm/maven-scm-provider-vss/1.4/maven-scm-provider-vss-1.4.jar
Downloaded: http://repo.maven.apache.org/maven2/org/apache/maven/scm/maven-scm-provider-synergy/1.4/maven-scm-provider-synergy-1.4.jar
(51 KB at 937.8 KB/sec)
Downloading: http://repo.maven.apache.org/maven2/org/apache/maven/scm/maven-scm-provider-tfs/1.4/maven-scm-provider-tfs-1.4.jar
Downloaded: http://repo.maven.apache.org/maven2/org/apache/maven/scm/maven-scm-provider-accurev/1.4/maven-scm-provider-accurev-1.4.jar
(89 KB at 701.3 KB/sec)
Downloading: http://repo.maven.apache.org/maven2/jaxen/jaxen/1.1-beta-8/jaxen-1.1-beta-8.jar
Downloaded: http://repo.maven.apache.org/maven2/org/apache/maven/shared/maven-invoker/2.0.9/maven-invoker-2.0.9.jar
(0 B at 0.0 KB/sec)
Downloading: http://repo.maven.apache.org/maven2/org/apache/maven/maven-core/2.2.1/maven-core-2.2.1.jar
Downloaded: http://repo.maven.apache.org/maven2/org/apache/maven/scm/maven-scm-provider-vss/1.4/maven-scm-provider-vss-1.4.jar
(67 KB at 873.1 KB/sec)
Downloading: http://repo.maven.apache.org/maven2/org/apache/maven/maven-plugin-parameter-documenter/2.2.1/maven-plugin-parameter-documenter-2.2.1.jar
Downloaded: http://repo.maven.apache.org/maven2/org/apache/maven/scm/maven-scm-provider-tfs/1.4/maven-scm-provider-tfs-1.4.jar
(41 KB at 729.8 KB/sec)
Downloading: http://repo.maven.apache.org/maven2/org/apache/maven/wagon/wagon-http/1.0-beta-6/wagon-http-1.0-beta-6.jar
Downloaded: http://repo.maven.apache.org/maven2/org/apache/maven/scm/maven-scm-provider-clearcase/1.4/maven-scm-provider-clearcase-1.4.jar
(68 KB at 539.7 KB/sec)
Downloading: http://repo.maven.apache.org/maven2/commons-httpclient/commons-httpclient/3.0/commons-httpclient-3.0.jar
Downloaded: http://repo.maven.apache.org/maven2/org/apache/maven/maven-plugin-parameter-documenter/2.2.1/maven-plugin-parameter-documenter-2.2.1.jar
(22 KB at 416.8 KB/sec)
Downloading: http://repo.maven.apache.org/maven2/org/slf4j/slf4j-nop/1.5.3/slf4j-nop-1.5.3.jar
Downloaded: http://repo.maven.apache.org/maven2/org/apache/maven/wagon/wagon-http/1.0-beta-6/wagon-http-1.0-beta-6.jar
(11 KB at 190.1 KB/sec)
Downloading: http://repo.maven.apache.org/maven2/org/apache/maven/maven-profile/2.2.1/maven-profile-2.2.1.jar
Downloaded: http://repo.maven.apache.org/maven2/org/slf4j/slf4j-nop/1.5.3/slf4j-nop-1.5.3.jar
(6 KB at 99.6 KB/sec)
Downloading: http://repo.maven.apache.org/maven2/org/apache/maven/maven-repository-metadata/2.2.1/maven-repository-metadata-2.2.1.jar
Downloaded: http://repo.maven.apache.org/maven2/org/apache/maven/maven-core/2.2.1/maven-core-2.2.1.jar
(174 KB at 1336.3 KB/sec)
Downloading: http://repo.maven.apache.org/maven2/org/apache/maven/maven-error-diagnostics/2.2.1/maven-error-diagnostics-2.2.1.jar
Downloaded: http://repo.maven.apache.org/maven2/jaxen/jaxen/1.1-beta-8/jaxen-1.1-beta-8.jar
(227 KB at 1300.4 KB/sec)
Downloading: http://repo.maven.apache.org/maven2/org/apache/maven/maven-plugin-descriptor/2.2.1/maven-plugin-descriptor-2.2.1.jar
Downloaded: http://repo.maven.apache.org/maven2/org/apache/maven/maven-error-diagnostics/2.2.1/maven-error-diagnostics-2.2.1.jar
(13 KB at 231.2 KB/sec)
Downloading: http://repo.maven.apache.org/maven2/org/apache/maven/maven-monitor/2.2.1/maven-monitor-2.2.1.jar
Downloaded: http://repo.maven.apache.org/maven2/org/apache/maven/maven-profile/2.2.1/maven-profile-2.2.1.jar
(0 B at 0.0 KB/sec)
Downloading: http://repo.maven.apache.org/maven2/org/apache/maven/maven-artifact/2.2.1/maven-artifact-2.2.1.jar
Downloaded: http://repo.maven.apache.org/maven2/org/apache/maven/maven-plugin-descriptor/2.2.1/maven-plugin-descriptor-2.2.1.jar
(39 KB at 710.4 KB/sec)
Downloading: http://repo.maven.apache.org/maven2/org/apache/maven/maven-model/2.2.1/maven-model-2.2.1.jar
Downloaded: http://repo.maven.apache.org/maven2/org/apache/maven/maven-monitor/2.2.1/maven-monitor-2.2.1.jar
(11 KB at 185.7 KB/sec)
Downloading: http://repo.maven.apache.org/maven2/org/apache/maven/maven-plugin-api/2.2.1/maven-plugin-api-2.2.1.jar
Downloaded: http://repo.maven.apache.org/maven2/org/apache/maven/maven-repository-metadata/2.2.1/maven-repository-metadata-2.2.1.jar
(0 B at 0.0 KB/sec)
Downloading: http://repo.maven.apache.org/maven2/org/apache/maven/maven-project/2.2.1/maven-project-2.2.1.jar
Downloaded: http://repo.maven.apache.org/maven2/commons-httpclient/commons-httpclient/3.0/commons-httpclient-3.0.jar
(273 KB at 1223.5 KB/sec)
Downloading: http://repo.maven.apache.org/maven2/org/apache/maven/maven-plugin-registry/2.2.1/maven-plugin-registry-2.2.1.jar
Downloaded: http://repo.maven.apache.org/maven2/org/apache/maven/maven-model/2.2.1/maven-model-2.2.1.jar
(86 KB at 1056.0 KB/sec)
Downloading: http://repo.maven.apache.org/maven2/findbugs/annotations/1.0.0/annotations-1.0.0.jar
Downloaded: http://repo.maven.apache.org/maven2/org/apache/maven/maven-plugin-api/2.2.1/maven-plugin-api-2.2.1.jar
(13 KB at 223.8 KB/sec)
Downloaded: http://repo.maven.apache.org/maven2/org/apache/maven/maven-artifact/2.2.1/maven-artifact-2.2.1.jar
(0 B at 0.0 KB/sec)
Downloaded: http://repo.maven.apache.org/maven2/findbugs/annotations/1.0.0/annotations-1.0.0.jar
(27 KB at 477.2 KB/sec)
Downloaded: http://repo.maven.apache.org/maven2/org/apache/maven/maven-project/2.2.1/maven-project-2.2.1.jar
(0 B at 0.0 KB/sec)
Downloaded: http://repo.maven.apache.org/maven2/org/apache/maven/maven-plugin-registry/2.2.1/maven-plugin-registry-2.2.1.jar
(0 B at 0.0 KB/sec)
[INFO] 
[INFO] --- maven-clean-plugin:2.4.1:clean (default-clean) @ studio-maven-plugin ---
[INFO] Deleting <https://builds.apache.org/job/dir-studio-maven-plugin-deploy-site/ws/trunk/target>
[INFO] 
[INFO] --- maven-plugin-plugin:2.9:descriptor (default-descriptor) @ studio-maven-plugin ---
Downloading: http://repo.maven.apache.org/maven2/org/apache/maven/plugin-tools/maven-plugin-tools-api/2.9/maven-plugin-tools-api-2.9.pom
Downloaded: http://repo.maven.apache.org/maven2/org/apache/maven/plugin-tools/maven-plugin-tools-api/2.9/maven-plugin-tools-api-2.9.pom
(5 KB at 56.3 KB/sec)
Downloading: http://repo.maven.apache.org/maven2/org/apache/maven/plugin-tools/maven-plugin-tools/2.9/maven-plugin-tools-2.9.pom
Downloaded: http://repo.maven.apache.org/maven2/org/apache/maven/plugin-tools/maven-plugin-tools/2.9/maven-plugin-tools-2.9.pom
(10 KB at 181.1 KB/sec)
Downloading: http://repo.maven.apache.org/maven2/org/apache/maven/plugin-tools/maven-plugin-tools-java/2.9/maven-plugin-tools-java-2.9.pom
Downloaded: http://repo.maven.apache.org/maven2/org/apache/maven/plugin-tools/maven-plugin-tools-java/2.9/maven-plugin-tools-java-2.9.pom
(3 KB at 52.6 KB/sec)
Downloading: http://repo.maven.apache.org/maven2/com/thoughtworks/qdox/qdox/1.11/qdox-1.11.pom
Downloaded: http://repo.maven.apache.org/maven2/com/thoughtworks/qdox/qdox/1.11/qdox-1.11.pom
(19 KB at 234.4 KB/sec)
Downloading: http://repo.maven.apache.org/maven2/org/apache/maven/plugin-tools/maven-plugin-tools-beanshell/2.9/maven-plugin-tools-beanshell-2.9.pom
Downloaded: http://repo.maven.apache.org/maven2/org/apache/maven/plugin-tools/maven-plugin-tools-beanshell/2.9/maven-plugin-tools-beanshell-2.9.pom
(3 KB at 42.5 KB/sec)
Downloading: http://repo.maven.apache.org/maven2/org/apache/maven/plugin-tools/maven-plugin-tools-api/2.9/maven-plugin-tools-api-2.9.jar
Downloading: http://repo.maven.apache.org/maven2/org/apache/maven/plugin-tools/maven-plugin-tools-java/2.9/maven-plugin-tools-java-2.9.jar
Downloading: http://repo.maven.apache.org/maven2/com/thoughtworks/qdox/qdox/1.11/qdox-1.11.jar
Downloading: http://repo.maven.apache.org/maven2/org/apache/maven/plugin-tools/maven-plugin-tools-beanshell/2.9/maven-plugin-tools-beanshell-2.9.jar
Downloaded: http://repo.maven.apache.org/maven2/org/apache/maven/plugin-tools/maven-plugin-tools-api/2.9/maven-plugin-tools-api-2.9.jar
(56 KB at 540.0 KB/sec)
Downloaded: http://repo.maven.apache.org/maven2/org/apache/maven/plugin-tools/maven-plugin-tools-beanshell/2.9/maven-plugin-tools-beanshell-2.9.jar
(14 KB at 123.5 KB/sec)
Downloaded: http://repo.maven.apache.org/maven2/org/apache/maven/plugin-tools/maven-plugin-tools-java/2.9/maven-plugin-tools-java-2.9.jar
(17 KB at 132.6 KB/sec)
Downloaded: http://repo.maven.apache.org/maven2/com/thoughtworks/qdox/qdox/1.11/qdox-1.11.jar
(172 KB at 695.1 KB/sec)
[INFO] Using 'UTF-8' encoding to read mojo metadata.
[INFO] Applying mojo extractor for language: java
[INFO] Mojo extractor for language: java found 6 mojo descriptors.
[INFO] Applying mojo extractor for language: bsh
[INFO] Mojo extractor for language: bsh found 0 mojo descriptors.
[INFO] 
[INFO] --- maven-remote-resources-plugin:1.2.1:process (default) @ studio-maven-plugin ---
[INFO] 
[INFO] --- maven-resources-plugin:2.5:resources (default-resources) @ studio-maven-plugin
---
[debug] execute contextualize
[INFO] Using 'UTF-8' encoding to copy filtered resources.
[INFO] skip non existing resourceDirectory <https://builds.apache.org/job/dir-studio-maven-plugin-deploy-site/ws/trunk/src/main/resources>
[INFO] Copying 3 resources
[INFO] 
[INFO] --- maven-compiler-plugin:2.3.2:compile (default-compile) @ studio-maven-plugin ---
[INFO] Compiling 8 source files to <https://builds.apache.org/job/dir-studio-maven-plugin-deploy-site/ws/trunk/target/classes>
[INFO] 
[INFO] --- maven-resources-plugin:2.5:testResources (default-testResources) @ studio-maven-plugin
---
[debug] execute contextualize
[INFO] Using 'UTF-8' encoding to copy filtered resources.
[INFO] Copying 16 resources
[INFO] Copying 3 resources
[INFO] 
[INFO] --- maven-compiler-plugin:2.3.2:testCompile (default-testCompile) @ studio-maven-plugin
---
[INFO] Compiling 6 source files to <https://builds.apache.org/job/dir-studio-maven-plugin-deploy-site/ws/trunk/target/test-classes>
[INFO] 
[INFO] --- maven-surefire-plugin:2.10:test (default-test) @ studio-maven-plugin ---
[INFO] Surefire report directory: <https://builds.apache.org/job/dir-studio-maven-plugin-deploy-site/ws/trunk/target/surefire-reports>

-------------------------------------------------------
 T E S T S
-------------------------------------------------------

Results :

Tests run: 0, Failures: 0, Errors: 0, Skipped: 0

[JENKINS] Recording test results
[INFO] 
[INFO] --- maven-jar-plugin:2.3.2:jar (default-jar) @ studio-maven-plugin ---
[INFO] Building jar: <https://builds.apache.org/job/dir-studio-maven-plugin-deploy-site/ws/trunk/target/studio-maven-plugin-1.0.6-SNAPSHOT.jar>
[INFO] 
[INFO] --- maven-plugin-plugin:2.9:addPluginArtifactMetadata (default-addPluginArtifactMetadata)
@ studio-maven-plugin ---
[WARNING] Failed to getClass for org.apache.maven.plugin.source.SourceJarMojo
[INFO] 
[INFO] --- maven-source-plugin:2.1.2:jar (attach-sources) @ studio-maven-plugin ---
[INFO] META-INF already added, skipping
[INFO] META-INF/NOTICE already added, skipping
[INFO] META-INF/DEPENDENCIES already added, skipping
[INFO] META-INF/LICENSE already added, skipping
[INFO] Building jar: <https://builds.apache.org/job/dir-studio-maven-plugin-deploy-site/ws/trunk/target/studio-maven-plugin-1.0.6-SNAPSHOT-sources.jar>
[INFO] META-INF already added, skipping
[INFO] META-INF/NOTICE already added, skipping
[INFO] META-INF/DEPENDENCIES already added, skipping
[INFO] META-INF/LICENSE already added, skipping
[INFO] 
[INFO] --- tools-maven-plugin:1.4:verify-legal-files (verify-legal-files) @ studio-maven-plugin
---
[INFO] Checking legal files in: studio-maven-plugin-1.0.6-SNAPSHOT.jar
[INFO] Checking legal files in: studio-maven-plugin-1.0.6-SNAPSHOT-sources.jar
[INFO] 
[INFO] --- maven-install-plugin:2.3.1:install (default-install) @ studio-maven-plugin ---
[INFO] Installing <https://builds.apache.org/job/dir-studio-maven-plugin-deploy-site/ws/trunk/target/studio-maven-plugin-1.0.6-SNAPSHOT.jar>
to /home/jenkins/jenkins-slave/maven-repositories/3/org/apache/directory/studio/studio-maven-plugin/1.0.6-SNAPSHOT/studio-maven-plugin-1.0.6-SNAPSHOT.jar
[INFO] Installing <https://builds.apache.org/job/dir-studio-maven-plugin-deploy-site/ws/trunk/pom.xml>
to /home/jenkins/jenkins-slave/maven-repositories/3/org/apache/directory/studio/studio-maven-plugin/1.0.6-SNAPSHOT/studio-maven-plugin-1.0.6-SNAPSHOT.pom
[INFO] Installing <https://builds.apache.org/job/dir-studio-maven-plugin-deploy-site/ws/trunk/target/studio-maven-plugin-1.0.6-SNAPSHOT-sources.jar>
to /home/jenkins/jenkins-slave/maven-repositories/3/org/apache/directory/studio/studio-maven-plugin/1.0.6-SNAPSHOT/studio-maven-plugin-1.0.6-SNAPSHOT-sources.jar
[INFO] 
[INFO] --- maven-deploy-plugin:2.7:deploy (default-deploy) @ studio-maven-plugin ---
Downloading: https://repository.apache.org/content/repositories/snapshots/org/apache/directory/studio/studio-maven-plugin/1.0.6-SNAPSHOT/maven-metadata.xml
Downloaded: https://repository.apache.org/content/repositories/snapshots/org/apache/directory/studio/studio-maven-plugin/1.0.6-SNAPSHOT/maven-metadata.xml
(1018 B at 0.0 KB/sec)
Uploading: https://repository.apache.org/content/repositories/snapshots/org/apache/directory/studio/studio-maven-plugin/1.0.6-SNAPSHOT/studio-maven-plugin-1.0.6-20140824.030315-847.jar
Uploaded: https://repository.apache.org/content/repositories/snapshots/org/apache/directory/studio/studio-maven-plugin/1.0.6-SNAPSHOT/studio-maven-plugin-1.0.6-20140824.030315-847.jar
(36 KB at 1.2 KB/sec)
Uploading: https://repository.apache.org/content/repositories/snapshots/org/apache/directory/studio/studio-maven-plugin/1.0.6-SNAPSHOT/studio-maven-plugin-1.0.6-20140824.030315-847.pom
Uploaded: https://repository.apache.org/content/repositories/snapshots/org/apache/directory/studio/studio-maven-plugin/1.0.6-SNAPSHOT/studio-maven-plugin-1.0.6-20140824.030315-847.pom
(10 KB at 0.2 KB/sec)
Downloading: https://repository.apache.org/content/repositories/snapshots/org/apache/directory/studio/studio-maven-plugin/maven-metadata.xml
Downloaded: https://repository.apache.org/content/repositories/snapshots/org/apache/directory/studio/studio-maven-plugin/maven-metadata.xml
(366 B at 0.0 KB/sec)
Downloading: https://repository.apache.org/content/repositories/snapshots/org/apache/directory/studio/maven-metadata.xml
Downloaded: https://repository.apache.org/content/repositories/snapshots/org/apache/directory/studio/maven-metadata.xml
(243 B at 0.0 KB/sec)
Uploading: https://repository.apache.org/content/repositories/snapshots/org/apache/directory/studio/studio-maven-plugin/1.0.6-SNAPSHOT/maven-metadata.xml
Uploaded: https://repository.apache.org/content/repositories/snapshots/org/apache/directory/studio/studio-maven-plugin/1.0.6-SNAPSHOT/maven-metadata.xml
(1018 B at 0.0 KB/sec)
Uploading: https://repository.apache.org/content/repositories/snapshots/org/apache/directory/studio/studio-maven-plugin/maven-metadata.xml
Uploaded: https://repository.apache.org/content/repositories/snapshots/org/apache/directory/studio/studio-maven-plugin/maven-metadata.xml
(366 B at 0.1 KB/sec)
Uploading: https://repository.apache.org/content/repositories/snapshots/org/apache/directory/studio/maven-metadata.xml
Uploaded: https://repository.apache.org/content/repositories/snapshots/org/apache/directory/studio/maven-metadata.xml
(243 B at 0.0 KB/sec)
Uploading: https://repository.apache.org/content/repositories/snapshots/org/apache/directory/studio/studio-maven-plugin/1.0.6-SNAPSHOT/studio-maven-plugin-1.0.6-20140824.030315-847-sources.jar
[INFO] ------------------------------------------------------------------------
[INFO] BUILD FAILURE
[INFO] ------------------------------------------------------------------------
[INFO] Total time: 5:20.001s
[INFO] Finished at: Sun Aug 24 03:06:51 UTC 2014
[INFO] Final Memory: 28M/151M
[INFO] ------------------------------------------------------------------------
Waiting for Jenkins to finish collecting data[ERROR] Failed to execute goal org.apache.maven.plugins:maven-deploy-plugin:2.7:deploy
(default-deploy) on project studio-maven-plugin: Failed to deploy artifacts: Could not transfer
artifact org.apache.directory.studio:studio-maven-plugin:jar:sources:1.0.6-20140824.030315-847
from/to apache.snapshots.https (https://repository.apache.org/content/repositories/snapshots):
Failed to transfer file: https://repository.apache.org/content/repositories/snapshots/org/apache/directory/studio/studio-maven-plugin/1.0.6-SNAPSHOT/studio-maven-plugin-1.0.6-20140824.030315-847-sources.jar.
Return code is: 502, ReasonPhrase:Proxy Error. -> [Help 1]
[ERROR] 
[ERROR] To see the full stack trace of the errors, re-run Maven with the -e switch.
[ERROR] Re-run Maven using the -X switch to enable full debug logging.
[ERROR] 
[ERROR] For more information about the errors and possible solutions, please read the following
articles:
[ERROR] [Help 1] http://cwiki.apache.org/confluence/display/MAVEN/MojoExecutionException

[JENKINS] Archiving <https://builds.apache.org/job/dir-studio-maven-plugin-deploy-site/ws/trunk/pom.xml>
to org.apache.directory.studio/studio-maven-plugin/1.0.6-SNAPSHOT/studio-maven-plugin-1.0.6-SNAPSHOT.pom
[JENKINS] Archiving <https://builds.apache.org/job/dir-studio-maven-plugin-deploy-site/ws/trunk/target/studio-maven-plugin-1.0.6-SNAPSHOT.jar>
to org.apache.directory.studio/studio-maven-plugin/1.0.6-20140824.030315-847/studio-maven-plugin-1.0.6-20140824.030315-847.jar
[JENKINS] Archiving <https://builds.apache.org/job/dir-studio-maven-plugin-deploy-site/ws/trunk/target/studio-maven-plugin-1.0.6-SNAPSHOT-sources.jar>
to org.apache.directory.studio/studio-maven-plugin/1.0.6-20140824.030315-847/studio-maven-plugin-1.0.6-20140824.030315-847-sources.jar
Sending artifact delta relative to dir-studio-maven-plugin-deploy-site ? Apache Directory
Studio Plugin #1411
Archived 3 artifacts
Archive block size is 32768
Received 0 blocks and 72967 bytes
Compression is 0.0%
Took 0.15 sec
Sending e-mails to: notifications@directory.apache.org
channel stopped

Mime
View raw message