directory-notifications mailing list archives

Site index · List index
Message view « Date » · « Thread »
Top « Date » · « Thread »
From Apache Jenkins Server <jenk...@builds.apache.org>
Subject Build failed in Jenkins: dir-apacheds-ubuntu-deploy #1419
Date Fri, 15 Aug 2014 06:59:01 GMT
See <https://builds.apache.org/job/dir-apacheds-ubuntu-deploy/1419/>

------------------------------------------
[...truncated 7576 lines...]
[INFO] --- maven-source-plugin:2.2.1:jar (attach-sources) @ kerberos-client ---
[INFO] Building jar: <https://builds.apache.org/job/dir-apacheds-ubuntu-deploy/ws/trunk/kerberos-client/target/kerberos-client-2.0.0-M18-SNAPSHOT-sources.jar>
[INFO] 
[INFO] --- maven-install-plugin:2.5.1:install (default-install) @ kerberos-client ---
[INFO] Installing <https://builds.apache.org/job/dir-apacheds-ubuntu-deploy/ws/trunk/kerberos-client/target/kerberos-client-2.0.0-M18-SNAPSHOT.jar>
to /home/jenkins/jenkins-slave/maven-repositories/1/org/apache/directory/server/kerberos-client/2.0.0-M18-SNAPSHOT/kerberos-client-2.0.0-M18-SNAPSHOT.jar
[INFO] Installing <https://builds.apache.org/job/dir-apacheds-ubuntu-deploy/ws/trunk/kerberos-client/pom.xml>
to /home/jenkins/jenkins-slave/maven-repositories/1/org/apache/directory/server/kerberos-client/2.0.0-M18-SNAPSHOT/kerberos-client-2.0.0-M18-SNAPSHOT.pom
[INFO] Installing <https://builds.apache.org/job/dir-apacheds-ubuntu-deploy/ws/trunk/kerberos-client/target/kerberos-client-2.0.0-M18-SNAPSHOT-sources.jar>
to /home/jenkins/jenkins-slave/maven-repositories/1/org/apache/directory/server/kerberos-client/2.0.0-M18-SNAPSHOT/kerberos-client-2.0.0-M18-SNAPSHOT-sources.jar
[INFO] 
[INFO] --- maven-deploy-plugin:2.8.1:deploy (default-deploy) @ kerberos-client ---
Downloading: https://repository.apache.org/content/repositories/snapshots/org/apache/directory/server/kerberos-client/2.0.0-M18-SNAPSHOT/maven-metadata.xml
Downloaded: https://repository.apache.org/content/repositories/snapshots/org/apache/directory/server/kerberos-client/2.0.0-M18-SNAPSHOT/maven-metadata.xml
(2 KB at 0.0 KB/sec)
Uploading: https://repository.apache.org/content/repositories/snapshots/org/apache/directory/server/kerberos-client/2.0.0-M18-SNAPSHOT/kerberos-client-2.0.0-M18-20140815.065837-36.jar
Uploaded: https://repository.apache.org/content/repositories/snapshots/org/apache/directory/server/kerberos-client/2.0.0-M18-SNAPSHOT/kerberos-client-2.0.0-M18-20140815.065837-36.jar
(57 KB at 17.2 KB/sec)
Uploading: https://repository.apache.org/content/repositories/snapshots/org/apache/directory/server/kerberos-client/2.0.0-M18-SNAPSHOT/kerberos-client-2.0.0-M18-20140815.065837-36.pom
Uploaded: https://repository.apache.org/content/repositories/snapshots/org/apache/directory/server/kerberos-client/2.0.0-M18-SNAPSHOT/kerberos-client-2.0.0-M18-20140815.065837-36.pom
(3 KB at 9.0 KB/sec)
Downloading: https://repository.apache.org/content/repositories/snapshots/org/apache/directory/server/kerberos-client/maven-metadata.xml
Downloaded: https://repository.apache.org/content/repositories/snapshots/org/apache/directory/server/kerberos-client/maven-metadata.xml
(370 B at 0.5 KB/sec)
Uploading: https://repository.apache.org/content/repositories/snapshots/org/apache/directory/server/kerberos-client/2.0.0-M18-SNAPSHOT/maven-metadata.xml
Uploaded: https://repository.apache.org/content/repositories/snapshots/org/apache/directory/server/kerberos-client/2.0.0-M18-SNAPSHOT/maven-metadata.xml
(2 KB at 17.9 KB/sec)
Uploading: https://repository.apache.org/content/repositories/snapshots/org/apache/directory/server/kerberos-client/maven-metadata.xml
Uploaded: https://repository.apache.org/content/repositories/snapshots/org/apache/directory/server/kerberos-client/maven-metadata.xml
(370 B at 6.9 KB/sec)
Uploading: https://repository.apache.org/content/repositories/snapshots/org/apache/directory/server/kerberos-client/2.0.0-M18-SNAPSHOT/kerberos-client-2.0.0-M18-20140815.065837-36-sources.jar
Uploaded: https://repository.apache.org/content/repositories/snapshots/org/apache/directory/server/kerberos-client/2.0.0-M18-SNAPSHOT/kerberos-client-2.0.0-M18-20140815.065837-36-sources.jar
(45 KB at 24.0 KB/sec)
Uploading: https://repository.apache.org/content/repositories/snapshots/org/apache/directory/server/kerberos-client/2.0.0-M18-SNAPSHOT/maven-metadata.xml
Uploaded: https://repository.apache.org/content/repositories/snapshots/org/apache/directory/server/kerberos-client/2.0.0-M18-SNAPSHOT/maven-metadata.xml
(2 KB at 2.5 KB/sec)
[JENKINS] Archiving disabled
[INFO]                                                                         
[INFO] ------------------------------------------------------------------------
[INFO] Building ApacheDS Service 2.0.0-M18-SNAPSHOT
[INFO] ------------------------------------------------------------------------
[INFO] 
[INFO] --- maven-clean-plugin:2.4.1:clean (default-clean) @ apacheds-service ---
[INFO] Deleting <https://builds.apache.org/job/dir-apacheds-ubuntu-deploy/ws/trunk/service/target>
[INFO] 
[INFO] --- maven-remote-resources-plugin:1.2.1:process (default) @ apacheds-service ---
[INFO] 
[INFO] --- maven-resources-plugin:2.6:resources (default-resources) @ apacheds-service ---
[INFO] Using 'UTF-8' encoding to copy filtered resources.
[INFO] skip non existing resourceDirectory <https://builds.apache.org/job/dir-apacheds-ubuntu-deploy/ws/trunk/service/src/main/resources>
[INFO] Copying 3 resources
[INFO] 
[INFO] --- maven-compiler-plugin:3.1:compile (default-compile) @ apacheds-service ---
[INFO] Changes detected - recompiling the module!
[INFO] Compiling 3 source files to <https://builds.apache.org/job/dir-apacheds-ubuntu-deploy/ws/trunk/service/target/classes>
[INFO] 
[INFO] --- maven-resources-plugin:2.6:testResources (default-testResources) @ apacheds-service
---
[INFO] Using 'UTF-8' encoding to copy filtered resources.
[INFO] Copying 3 resources
[INFO] Copying 3 resources
[INFO] 
[INFO] --- maven-compiler-plugin:3.1:testCompile (default-testCompile) @ apacheds-service
---
[INFO] Changes detected - recompiling the module!
[INFO] Compiling 1 source file to <https://builds.apache.org/job/dir-apacheds-ubuntu-deploy/ws/trunk/service/target/test-classes>
[INFO] 
[INFO] --- maven-surefire-plugin:2.17:test (default-test) @ apacheds-service ---
[INFO] Surefire report directory: <https://builds.apache.org/job/dir-apacheds-ubuntu-deploy/ws/trunk/service/target/surefire-reports>

-------------------------------------------------------
 T E S T S
-------------------------------------------------------
Running org.apache.directory.server.UberJarMainTest
org.apache.directory.api.ldap.model.exception.LdapOtherException: ERR_112_COULD_NOT_CREATE_DIRECORY
Could not create directory /tmp/ApacheDS-201471565848/partitions/system
	at org.apache.directory.server.core.api.partition.AbstractPartition.initialize(AbstractPartition.java:94)
	at org.apache.directory.server.core.DefaultDirectoryService.initialize(DefaultDirectoryService.java:1807)
	at org.apache.directory.server.core.DefaultDirectoryService.startup(DefaultDirectoryService.java:1244)
	at org.apache.directory.server.ApacheDsService.initDirectoryService(ApacheDsService.java:323)
	at org.apache.directory.server.ApacheDsService.start(ApacheDsService.java:182)
	at org.apache.directory.server.UberjarMain.start(UberjarMain.java:76)
	at org.apache.directory.server.UberJarMainTest.serviceInstanceTest(UberJarMainTest.java:98)
	at sun.reflect.NativeMethodAccessorImpl.invoke0(Native Method)
	at sun.reflect.NativeMethodAccessorImpl.invoke(NativeMethodAccessorImpl.java:57)
	at sun.reflect.DelegatingMethodAccessorImpl.invoke(DelegatingMethodAccessorImpl.java:43)
	at java.lang.reflect.Method.invoke(Method.java:606)
	at org.junit.runners.model.FrameworkMethod$1.runReflectiveCall(FrameworkMethod.java:47)
	at org.junit.internal.runners.model.ReflectiveCallable.run(ReflectiveCallable.java:12)
	at org.junit.runners.model.FrameworkMethod.invokeExplosively(FrameworkMethod.java:44)
	at org.junit.internal.runners.statements.InvokeMethod.evaluate(InvokeMethod.java:17)
	at org.junit.internal.runners.statements.RunBefores.evaluate(RunBefores.java:26)
	at org.junit.internal.runners.statements.RunAfters.evaluate(RunAfters.java:27)
	at org.junit.runners.ParentRunner.runLeaf(ParentRunner.java:271)
	at org.junit.runners.BlockJUnit4ClassRunner.runChild(BlockJUnit4ClassRunner.java:70)
	at org.junit.runners.BlockJUnit4ClassRunner.runChild(BlockJUnit4ClassRunner.java:50)
	at org.junit.runners.ParentRunner$3.run(ParentRunner.java:238)
	at org.junit.runners.ParentRunner$1.schedule(ParentRunner.java:63)
	at org.junit.runners.ParentRunner.runChildren(ParentRunner.java:236)
	at org.junit.runners.ParentRunner.access$000(ParentRunner.java:53)
	at org.junit.runners.ParentRunner$2.evaluate(ParentRunner.java:229)
	at org.junit.runners.ParentRunner.run(ParentRunner.java:309)
	at org.apache.maven.surefire.junit4.JUnit4Provider.execute(JUnit4Provider.java:264)
	at org.apache.maven.surefire.junit4.JUnit4Provider.executeTestSet(JUnit4Provider.java:153)
	at org.apache.maven.surefire.junit4.JUnit4Provider.invoke(JUnit4Provider.java:124)
	at org.apache.maven.surefire.booter.ForkedBooter.invokeProviderInSameClassLoader(ForkedBooter.java:200)
	at org.apache.maven.surefire.booter.ForkedBooter.runSuitesInProcess(ForkedBooter.java:153)
	at org.apache.maven.surefire.booter.ForkedBooter.main(ForkedBooter.java:103)
Caused by: org.apache.directory.api.ldap.model.exception.LdapOtherException: ERR_112_COULD_NOT_CREATE_DIRECORY
Could not create directory /tmp/ApacheDS-201471565848/partitions/system
	at org.apache.directory.server.core.api.partition.AbstractPartition.initialize(AbstractPartition.java:94)
	at org.apache.directory.server.core.shared.partition.DefaultPartitionNexus.addContextPartition(DefaultPartitionNexus.java:779)
	at org.apache.directory.server.core.shared.partition.DefaultPartitionNexus.doInit(DefaultPartitionNexus.java:218)
	at org.apache.directory.server.core.api.partition.AbstractPartition.initialize(AbstractPartition.java:89)
	... 31 more
Caused by: java.io.IOException: ERR_112_COULD_NOT_CREATE_DIRECORY Could not create directory
/tmp/ApacheDS-201471565848/partitions/system
	at org.apache.directory.server.core.partition.impl.btree.jdbm.JdbmPartition.doInit(JdbmPartition.java:151)
	at org.apache.directory.server.core.api.partition.AbstractPartition.initialize(AbstractPartition.java:89)
	... 34 more

Results :

Tests run: 0, Failures: 0, Errors: 0, Skipped: 0

[JENKINS] Recording test results
[JENKINS] Archiving disabled
[INFO] ------------------------------------------------------------------------
[INFO] Reactor Summary:
[INFO] 
[INFO] ApacheDS .......................................... SUCCESS [9.026s]
[INFO] ApacheDS I18n ..................................... SUCCESS [11.792s]
[INFO] ApacheDS Core Constants ........................... SUCCESS [3.474s]
[INFO] ApacheDS Core API ................................. SUCCESS [34.803s]
[INFO] ApacheDS Core Shared .............................. SUCCESS [8.804s]
[INFO] ApacheDS Interceptors ............................. SUCCESS [0.987s]
[INFO] ApacheDS AdministrativePoint Interceptor .......... SUCCESS [4.810s]
[INFO] ApacheDS Authentication Interceptor ............... SUCCESS [5.119s]
[INFO] ApacheDS Interceptor to increment numeric attributes  SUCCESS [3.318s]
[INFO] ApacheDS Authorization Interceptor ................ SUCCESS [5.884s]
[INFO] ApacheDS ChangeLog Interceptor .................... SUCCESS [5.551s]
[INFO] ApacheDS Collective Attribute Interceptor ......... SUCCESS [2.918s]
[INFO] ApacheDS Event Interceptor ........................ SUCCESS [2.851s]
[INFO] ApacheDS Exception Interceptor .................... SUCCESS [3.180s]
[INFO] ApacheDS Journal Interceptor ...................... SUCCESS [5.343s]
[INFO] ApacheDS Normalization Interceptor ................ SUCCESS [5.894s]
[INFO] ApacheDS Operational Attribute Interceptor ........ SUCCESS [2.911s]
[INFO] ApacheDS Referral Interceptor ..................... SUCCESS [2.890s]
[INFO] ApacheDS Schema Interceptor ....................... SUCCESS [6.731s]
[INFO] ApacheDS Subtree Interceptor ...................... SUCCESS [7.704s]
[INFO] ApacheDS Triggers Interceptor ..................... SUCCESS [5.938s]
[INFO] ApacheDS Core ..................................... SUCCESS [7.125s]
[INFO] ApacheDS Core AVL ................................. SUCCESS [9.088s]
[INFO] ApacheDS Generalized (X) DBM Partition ............ SUCCESS [11.693s]
[INFO] ApacheDS LDIF Partition ........................... SUCCESS [14.969s]
[INFO] ApacheDS JDBM Partition ........................... SUCCESS [32.555s]
[INFO] ApacheDS Mavibot Partition ........................ SUCCESS [9.584s]
[INFO] ApacheDS Core Annotations ......................... SUCCESS [38.165s]
[INFO] ApacheDS Core JNDI ................................ SUCCESS [5.945s]
[INFO] ApacheDS Protocol Kerberos Codec .................. SUCCESS [14.791s]
[INFO] ApacheDS Interceptors for Kerberos ................ SUCCESS [5.834s]
[INFO] ApacheDS Protocol Dhcp ............................ SUCCESS [5.535s]
[INFO] ApacheDS Protocol Shared .......................... SUCCESS [5.858s]
[INFO] ApacheDS Protocol Dns ............................. SUCCESS [5.786s]
[INFO] ApacheDS Protocol Kerberos ........................ SUCCESS [8.862s]
[INFO] ApacheDS Protocol Ldap ............................ SUCCESS [47.959s]
[INFO] ApacheDS Protocol Ntp ............................. SUCCESS [5.638s]
[INFO] Apacheds Server Annotations ....................... SUCCESS [32.690s]
[INFO] ApacheDS Server Config ............................ SUCCESS [8.722s]
[INFO] ApacheDS Server JNDI .............................. SUCCESS [6.017s]
[INFO] ApacheDS Test Framework ........................... SUCCESS [1:14.581s]
[INFO] ApacheDS All ...................................... SUCCESS [5.911s]
[INFO] ApacheDS Logger Interceptor ....................... SUCCESS [2.964s]
[INFO] ApacheDS Password Hashing Interceptor ............. SUCCESS [3.915s]
[INFO] ApacheDS Core Integration ......................... SUCCESS [19:23.557s]
[INFO] ApacheDS Protocol Kerberos Test ................... SUCCESS [1:09.851s]
[INFO] ApacheDS Server Integration ....................... SUCCESS [8:43.606s]
[INFO] ApacheDS DirectoryService-WebApp bridge ........... SUCCESS [27.123s]
[INFO] ApacheDS Jetty HTTP Server Integration ............ SUCCESS [38.859s]
[INFO] ApacheDS Service Builder .......................... SUCCESS [14.414s]
[INFO] Apache Directory LDAP Client API test ............. SUCCESS [4:04.148s]
[INFO] kerberos-client ................................... SUCCESS [54.162s]
[INFO] ApacheDS Service .................................. FAILURE [5.730s]
[INFO] ApacheDS Wrapper .................................. SKIPPED
[INFO] ApacheDS Installers Maven Plugin .................. SKIPPED
[INFO] ApacheDS Installers ............................... SKIPPED
[INFO] ApacheDS Mavibot bulkloader ....................... SKIPPED
[INFO] ------------------------------------------------------------------------
[INFO] BUILD FAILURE
[INFO] ------------------------------------------------------------------------
[INFO] Total time: 44:25.249s
[INFO] Finished at: Fri Aug 15 06:58:51 UTC 2014
[INFO] Final Memory: 65M/230M
[INFO] ------------------------------------------------------------------------
[JENKINS] Archiving disabled
[JENKINS] Archiving disabled
[JENKINS] Archiving disabled
[JENKINS] Archiving disabled
[JENKINS] Archiving disabled
[JENKINS] Archiving disabled
[JENKINS] Archiving disabled
[JENKINS] Archiving disabled
[JENKINS] Archiving disabled
[JENKINS] Archiving disabled
[JENKINS] Archiving disabled
[JENKINS] Archiving disabled
[JENKINS] Archiving disabled
[JENKINS] Archiving disabled
[JENKINS] Archiving disabled
[JENKINS] Archiving disabled
[JENKINS] Archiving disabled
[JENKINS] Archiving disabled
[JENKINS] Archiving disabled
[JENKINS] Archiving disabled
[JENKINS] Archiving disabled
[JENKINS] Archiving disabled
[JENKINS] Archiving disabled
[JENKINS] Archiving disabled
[JENKINS] Archiving disabled
[JENKINS] Archiving disabled
[JENKINS] Archiving disabled
[JENKINS] Archiving disabled
[JENKINS] Archiving disabled
[JENKINS] Archiving disabled
[JENKINS] Archiving disabled
[JENKINS] Archiving disabled
[JENKINS] Archiving disabled
[JENKINS] Archiving disabled
[JENKINS] Archiving disabled
[JENKINS] Archiving disabled
[JENKINS] Archiving disabled
[JENKINS] Archiving disabled
[JENKINS] Archiving disabled
[JENKINS] Archiving disabled
[JENKINS] Archiving disabled
[JENKINS] Archiving disabled
[JENKINS] Archiving disabled
[JENKINS] Archiving disabled
[JENKINS] Archiving disabled
[JENKINS] Archiving disabled
[JENKINS] Archiving disabled
[JENKINS] Archiving disabled
[JENKINS] Archiving disabled
[JENKINS] Archiving disabled
[JENKINS] Archiving disabled
[JENKINS] Archiving disabled
[JENKINS] Archiving disabled
[JENKINS] Archiving disabled
[JENKINS] Archiving disabled
[JENKINS] Archiving disabled
[JENKINS] Archiving disabled
Waiting for Jenkins to finish collecting data
[ERROR] Failed to execute goal org.apache.maven.plugins:maven-surefire-plugin:2.17:test (default-test)
on project apacheds-service: Execution default-test of goal org.apache.maven.plugins:maven-surefire-plugin:2.17:test
failed: The forked VM terminated without properly saying goodbye. VM crash or System.exit
called?
[ERROR] Command was /bin/sh -c cd <https://builds.apache.org/job/dir-apacheds-ubuntu-deploy/ws/trunk/service>
&& /x1/jenkins/tools/java/jdk1.7.0_25-32/jre/bin/java -Xmx1024m -jar <https://builds.apache.org/job/dir-apacheds-ubuntu-deploy/ws/trunk/service/target/surefire/surefirebooter8616714891097130830.jar>
<https://builds.apache.org/job/dir-apacheds-ubuntu-deploy/ws/trunk/service/target/surefire/surefire9212338342442065326tmp>
<https://builds.apache.org/job/dir-apacheds-ubuntu-deploy/ws/trunk/service/target/surefire/surefire_307182788408387283514tmp>
[ERROR] -> [Help 1]
[ERROR] 
[ERROR] To see the full stack trace of the errors, re-run Maven with the -e switch.
[ERROR] Re-run Maven using the -X switch to enable full debug logging.
[ERROR] 
[ERROR] For more information about the errors and possible solutions, please read the following
articles:
[ERROR] [Help 1] http://cwiki.apache.org/confluence/display/MAVEN/PluginExecutionException
[ERROR] 
[ERROR] After correcting the problems, you can resume the build with the command
[ERROR]   mvn <goals> -rf :apacheds-service
channel stopped

Mime
View raw message